tuscany-commits mailing list archives

Site index · List index
Message view « Date » · « Thread »
Top « Date » · « Thread »
From Apache Jenkins Server <jenk...@builds.apache.org>
Subject Build failed in Jenkins: Tuscany-2x-deploy #893
Date Wed, 15 Aug 2012 01:57:18 GMT
See <https://builds.apache.org/job/Tuscany-2x-deploy/893/>

------------------------------------------
[...truncated 4625 lines...]
[INFO] Building jar: <https://builds.apache.org/job/Tuscany-2x-deploy/ws/sca-2x/modules/binding-rmi-runtime/target/tuscany-binding-rmi-runtime-2.5-SNAPSHOT.jar>
[INFO] [source:jar-no-fork {execution: attach-sources}]
[INFO] Building jar: <https://builds.apache.org/job/Tuscany-2x-deploy/ws/sca-2x/modules/binding-rmi-runtime/target/tuscany-binding-rmi-runtime-2.5-SNAPSHOT-sources.jar>
[INFO] [install:install {execution: default-install}]
[INFO] Installing <https://builds.apache.org/job/Tuscany-2x-deploy/ws/sca-2x/modules/binding-rmi-runtime/target/tuscany-binding-rmi-runtime-2.5-SNAPSHOT.jar>
to <https://builds.apache.org/job/Tuscany-2x-deploy/ws/.repository/org/apache/tuscany/sca/tuscany-binding-rmi-runtime/2.5-SNAPSHOT/tuscany-binding-rmi-runtime-2.5-SNAPSHOT.jar>
[INFO] Installing <https://builds.apache.org/job/Tuscany-2x-deploy/ws/sca-2x/modules/binding-rmi-runtime/target/tuscany-binding-rmi-runtime-2.5-SNAPSHOT-sources.jar>
to <https://builds.apache.org/job/Tuscany-2x-deploy/ws/.repository/org/apache/tuscany/sca/tuscany-binding-rmi-runtime/2.5-SNAPSHOT/tuscany-binding-rmi-runtime-2.5-SNAPSHOT-sources.jar>
[INFO] [deploy:deploy {execution: default-deploy}]
[INFO] Retrieving previous build number from apache.snapshots.https
[WARNING] *** CHECKSUM FAILED - Checksum failed on download: local = 'ffc9f56361b12175ba9d2eaee2e9382b73e6de8b';
remote = '779cb432ebbad5ec0ec735d8e5029f5a1488e60a' - RETRYING
[WARNING] *** CHECKSUM FAILED - Checksum failed on download: local = 'ffc9f56361b12175ba9d2eaee2e9382b73e6de8b';
remote = '779cb432ebbad5ec0ec735d8e5029f5a1488e60a' - IGNORING
Uploading: https://repository.apache.org/content/repositories/snapshots/org/apache/tuscany/sca/tuscany-binding-rmi-runtime/2.5-SNAPSHOT/tuscany-binding-rmi-runtime-2.5-SNAPSHOT.jar
26K uploaded  (tuscany-binding-rmi-runtime-2.5-SNAPSHOT.jar)
[INFO] Retrieving previous metadata from apache.snapshots.https
[WARNING] *** CHECKSUM FAILED - Checksum failed on download: local = 'ffc9f56361b12175ba9d2eaee2e9382b73e6de8b';
remote = '779cb432ebbad5ec0ec735d8e5029f5a1488e60a' - RETRYING
[WARNING] *** CHECKSUM FAILED - Checksum failed on download: local = 'ffc9f56361b12175ba9d2eaee2e9382b73e6de8b';
remote = '779cb432ebbad5ec0ec735d8e5029f5a1488e60a' - IGNORING
[INFO] Uploading repository metadata for: 'snapshot org.apache.tuscany.sca:tuscany-binding-rmi-runtime:2.5-SNAPSHOT'
[INFO] Retrieving previous metadata from apache.snapshots.https
[INFO] Uploading repository metadata for: 'artifact org.apache.tuscany.sca:tuscany-binding-rmi-runtime'
[INFO] Uploading project information for tuscany-binding-rmi-runtime 2.5-SNAPSHOT
[INFO] Retrieving previous build number from apache.snapshots.https
Uploading: https://repository.apache.org/content/repositories/snapshots/org/apache/tuscany/sca/tuscany-binding-rmi-runtime/2.5-SNAPSHOT/tuscany-binding-rmi-runtime-2.5-SNAPSHOT-sources.jar
19K uploaded  (tuscany-binding-rmi-runtime-2.5-SNAPSHOT-sources.jar)
[JENKINS] Archiving disabled - not archiving <https://builds.apache.org/job/Tuscany-2x-deploy/ws/sca-2x/modules/binding-rmi-runtime/pom.xml>
[JENKINS] Archiving disabled - not archiving <https://builds.apache.org/job/Tuscany-2x-deploy/ws/sca-2x/modules/binding-rmi-runtime/target/tuscany-binding-rmi-runtime-2.5-SNAPSHOT.jar>
[JENKINS] Archiving disabled - not archiving <https://builds.apache.org/job/Tuscany-2x-deploy/ws/sca-2x/modules/binding-rmi-runtime/target/tuscany-binding-rmi-runtime-2.5-SNAPSHOT-sources.jar>
[INFO] ------------------------------------------------------------------------
[INFO] Building Apache Tuscany SCA Websocket Binding Extension
[INFO]    task-segment: [clean, deploy]
[INFO] ------------------------------------------------------------------------
[INFO] [clean:clean {execution: default-clean}]
[INFO] Deleting <https://builds.apache.org/job/Tuscany-2x-deploy/ws/sca-2x/modules/binding-websocket/target>
[INFO] [enforcer:enforce {execution: enforce-plugin-versions}]
[INFO] [remote-resources:process {execution: default}]
[INFO] [resources:resources {execution: default-resources}]
[INFO] Using 'UTF-8' encoding to copy filtered resources.
[INFO] Copying 6 resources
[INFO] Copying 3 resources
[INFO] Copying 3 resources
[INFO] [compiler:compile {execution: default-compile}]
[INFO] Compiling 17 source files to <https://builds.apache.org/job/Tuscany-2x-deploy/ws/sca-2x/modules/binding-websocket/target/classes>
[INFO] [resources:testResources {execution: default-testResources}]
[INFO] Using 'UTF-8' encoding to copy filtered resources.
[INFO] Copying 2 resources
[INFO] Copying 3 resources
[INFO] [compiler:testCompile {execution: default-testCompile}]
[INFO] Compiling 5 source files to <https://builds.apache.org/job/Tuscany-2x-deploy/ws/sca-2x/modules/binding-websocket/target/test-classes>
[INFO] [surefire:test {execution: default-test}]
[INFO] Tests are skipped.
[INFO] [jar:jar {execution: default-jar}]
[INFO] Building jar: <https://builds.apache.org/job/Tuscany-2x-deploy/ws/sca-2x/modules/binding-websocket/target/tuscany-binding-websocket-2.5-SNAPSHOT.jar>
[INFO] [source:jar-no-fork {execution: attach-sources}]
[INFO] Building jar: <https://builds.apache.org/job/Tuscany-2x-deploy/ws/sca-2x/modules/binding-websocket/target/tuscany-binding-websocket-2.5-SNAPSHOT-sources.jar>
[INFO] [install:install {execution: default-install}]
[INFO] Installing <https://builds.apache.org/job/Tuscany-2x-deploy/ws/sca-2x/modules/binding-websocket/target/tuscany-binding-websocket-2.5-SNAPSHOT.jar>
to <https://builds.apache.org/job/Tuscany-2x-deploy/ws/.repository/org/apache/tuscany/sca/tuscany-binding-websocket/2.5-SNAPSHOT/tuscany-binding-websocket-2.5-SNAPSHOT.jar>
[INFO] Installing <https://builds.apache.org/job/Tuscany-2x-deploy/ws/sca-2x/modules/binding-websocket/target/tuscany-binding-websocket-2.5-SNAPSHOT-sources.jar>
to <https://builds.apache.org/job/Tuscany-2x-deploy/ws/.repository/org/apache/tuscany/sca/tuscany-binding-websocket/2.5-SNAPSHOT/tuscany-binding-websocket-2.5-SNAPSHOT-sources.jar>
[INFO] [deploy:deploy {execution: default-deploy}]
[INFO] Retrieving previous build number from apache.snapshots.https
[WARNING] *** CHECKSUM FAILED - Checksum failed on download: local = '883e3c94e50619bcfc7b05a54a8b29a98a372bf2';
remote = 'd1d6014c9d196f69e8dc97665b4b4b2ca240a1e0' - RETRYING
[WARNING] *** CHECKSUM FAILED - Checksum failed on download: local = '883e3c94e50619bcfc7b05a54a8b29a98a372bf2';
remote = 'd1d6014c9d196f69e8dc97665b4b4b2ca240a1e0' - IGNORING
Uploading: https://repository.apache.org/content/repositories/snapshots/org/apache/tuscany/sca/tuscany-binding-websocket/2.5-SNAPSHOT/tuscany-binding-websocket-2.5-SNAPSHOT.jar
38K uploaded  (tuscany-binding-websocket-2.5-SNAPSHOT.jar)
[INFO] Retrieving previous metadata from apache.snapshots.https
[WARNING] *** CHECKSUM FAILED - Checksum failed on download: local = '883e3c94e50619bcfc7b05a54a8b29a98a372bf2';
remote = 'd1d6014c9d196f69e8dc97665b4b4b2ca240a1e0' - RETRYING
[WARNING] *** CHECKSUM FAILED - Checksum failed on download: local = '883e3c94e50619bcfc7b05a54a8b29a98a372bf2';
remote = 'd1d6014c9d196f69e8dc97665b4b4b2ca240a1e0' - IGNORING
[INFO] Uploading repository metadata for: 'snapshot org.apache.tuscany.sca:tuscany-binding-websocket:2.5-SNAPSHOT'
[INFO] Retrieving previous metadata from apache.snapshots.https
[INFO] Uploading repository metadata for: 'artifact org.apache.tuscany.sca:tuscany-binding-websocket'
[INFO] Uploading project information for tuscany-binding-websocket 2.5-SNAPSHOT
[INFO] Retrieving previous build number from apache.snapshots.https
Uploading: https://repository.apache.org/content/repositories/snapshots/org/apache/tuscany/sca/tuscany-binding-websocket/2.5-SNAPSHOT/tuscany-binding-websocket-2.5-SNAPSHOT-sources.jar
34K uploaded  (tuscany-binding-websocket-2.5-SNAPSHOT-sources.jar)
[JENKINS] Archiving disabled - not archiving <https://builds.apache.org/job/Tuscany-2x-deploy/ws/sca-2x/modules/binding-websocket/pom.xml>
[JENKINS] Archiving disabled - not archiving <https://builds.apache.org/job/Tuscany-2x-deploy/ws/sca-2x/modules/binding-websocket/target/tuscany-binding-websocket-2.5-SNAPSHOT.jar>
[JENKINS] Archiving disabled - not archiving <https://builds.apache.org/job/Tuscany-2x-deploy/ws/sca-2x/modules/binding-websocket/target/tuscany-binding-websocket-2.5-SNAPSHOT-sources.jar>
[INFO] ------------------------------------------------------------------------
[INFO] Building Apache Tuscany SCA Policy WS-Policy Model
[INFO]    task-segment: [clean, deploy]
[INFO] ------------------------------------------------------------------------
[INFO] [clean:clean {execution: default-clean}]
[INFO] Deleting <https://builds.apache.org/job/Tuscany-2x-deploy/ws/sca-2x/modules/policy-wspolicy/target>
[INFO] [enforcer:enforce {execution: enforce-plugin-versions}]
[INFO] [remote-resources:process {execution: default}]
[INFO] [resources:resources {execution: default-resources}]
[INFO] Using 'UTF-8' encoding to copy filtered resources.
[INFO] Copying 2 resources
[INFO] Copying 3 resources
[INFO] Copying 3 resources
[INFO] [compiler:compile {execution: default-compile}]
[INFO] Compiling 3 source files to <https://builds.apache.org/job/Tuscany-2x-deploy/ws/sca-2x/modules/policy-wspolicy/target/classes>
[INFO] [resources:testResources {execution: default-testResources}]
[INFO] Using 'UTF-8' encoding to copy filtered resources.
[INFO] Copying 1 resource
[INFO] Copying 3 resources
[INFO] [compiler:testCompile {execution: default-testCompile}]
[INFO] Compiling 5 source files to <https://builds.apache.org/job/Tuscany-2x-deploy/ws/sca-2x/modules/policy-wspolicy/target/test-classes>
[INFO] [surefire:test {execution: default-test}]
[INFO] Tests are skipped.
[INFO] [jar:jar {execution: default-jar}]
[INFO] Building jar: <https://builds.apache.org/job/Tuscany-2x-deploy/ws/sca-2x/modules/policy-wspolicy/target/tuscany-policy-wspolicy-2.5-SNAPSHOT.jar>
[INFO] [source:jar-no-fork {execution: attach-sources}]
[INFO] Building jar: <https://builds.apache.org/job/Tuscany-2x-deploy/ws/sca-2x/modules/policy-wspolicy/target/tuscany-policy-wspolicy-2.5-SNAPSHOT-sources.jar>
[INFO] [install:install {execution: default-install}]
[INFO] Installing <https://builds.apache.org/job/Tuscany-2x-deploy/ws/sca-2x/modules/policy-wspolicy/target/tuscany-policy-wspolicy-2.5-SNAPSHOT.jar>
to <https://builds.apache.org/job/Tuscany-2x-deploy/ws/.repository/org/apache/tuscany/sca/tuscany-policy-wspolicy/2.5-SNAPSHOT/tuscany-policy-wspolicy-2.5-SNAPSHOT.jar>
[INFO] Installing <https://builds.apache.org/job/Tuscany-2x-deploy/ws/sca-2x/modules/policy-wspolicy/target/tuscany-policy-wspolicy-2.5-SNAPSHOT-sources.jar>
to <https://builds.apache.org/job/Tuscany-2x-deploy/ws/.repository/org/apache/tuscany/sca/tuscany-policy-wspolicy/2.5-SNAPSHOT/tuscany-policy-wspolicy-2.5-SNAPSHOT-sources.jar>
[INFO] [deploy:deploy {execution: default-deploy}]
[INFO] Retrieving previous build number from apache.snapshots.https
[WARNING] *** CHECKSUM FAILED - Checksum failed on download: local = 'bd82fa785a5d48aad4d9c024a535e59980d4b1a4';
remote = 'd52cbc9d7272dc93222d8f451928dbf32a9c57be' - RETRYING
[WARNING] *** CHECKSUM FAILED - Checksum failed on download: local = 'bd82fa785a5d48aad4d9c024a535e59980d4b1a4';
remote = 'd52cbc9d7272dc93222d8f451928dbf32a9c57be' - IGNORING
Uploading: https://repository.apache.org/content/repositories/snapshots/org/apache/tuscany/sca/tuscany-policy-wspolicy/2.5-SNAPSHOT/tuscany-policy-wspolicy-2.5-SNAPSHOT.jar
21K uploaded  (tuscany-policy-wspolicy-2.5-SNAPSHOT.jar)
[INFO] Retrieving previous metadata from apache.snapshots.https
[WARNING] *** CHECKSUM FAILED - Checksum failed on download: local = 'bd82fa785a5d48aad4d9c024a535e59980d4b1a4';
remote = 'd52cbc9d7272dc93222d8f451928dbf32a9c57be' - RETRYING
[WARNING] *** CHECKSUM FAILED - Checksum failed on download: local = 'bd82fa785a5d48aad4d9c024a535e59980d4b1a4';
remote = 'd52cbc9d7272dc93222d8f451928dbf32a9c57be' - IGNORING
[INFO] Uploading repository metadata for: 'snapshot org.apache.tuscany.sca:tuscany-policy-wspolicy:2.5-SNAPSHOT'
[INFO] Uploading project information for tuscany-policy-wspolicy 2.5-SNAPSHOT
[INFO] Retrieving previous metadata from apache.snapshots.https
[INFO] Uploading repository metadata for: 'artifact org.apache.tuscany.sca:tuscany-policy-wspolicy'
[INFO] Retrieving previous build number from apache.snapshots.https
Uploading: https://repository.apache.org/content/repositories/snapshots/org/apache/tuscany/sca/tuscany-policy-wspolicy/2.5-SNAPSHOT/tuscany-policy-wspolicy-2.5-SNAPSHOT-sources.jar
17K uploaded  (tuscany-policy-wspolicy-2.5-SNAPSHOT-sources.jar)
[JENKINS] Archiving disabled - not archiving <https://builds.apache.org/job/Tuscany-2x-deploy/ws/sca-2x/modules/policy-wspolicy/pom.xml>
[JENKINS] Archiving disabled - not archiving <https://builds.apache.org/job/Tuscany-2x-deploy/ws/sca-2x/modules/policy-wspolicy/target/tuscany-policy-wspolicy-2.5-SNAPSHOT.jar>
[JENKINS] Archiving disabled - not archiving <https://builds.apache.org/job/Tuscany-2x-deploy/ws/sca-2x/modules/policy-wspolicy/target/tuscany-policy-wspolicy-2.5-SNAPSHOT-sources.jar>
[INFO] ------------------------------------------------------------------------
[INFO] Building Apache Tuscany SCA Data Binding for Axiom
[INFO]    task-segment: [clean, deploy]
[INFO] ------------------------------------------------------------------------
[INFO] [clean:clean {execution: default-clean}]
[INFO] Deleting <https://builds.apache.org/job/Tuscany-2x-deploy/ws/sca-2x/modules/databinding-axiom/target>
[INFO] [enforcer:enforce {execution: enforce-plugin-versions}]
[INFO] [remote-resources:process {execution: default}]
[INFO] [resources:resources {execution: default-resources}]
[INFO] Using 'UTF-8' encoding to copy filtered resources.
[INFO] Copying 2 resources
[INFO] Copying 3 resources
[INFO] Copying 3 resources
[INFO] [compiler:compile {execution: default-compile}]
[INFO] Compiling 13 source files to <https://builds.apache.org/job/Tuscany-2x-deploy/ws/sca-2x/modules/databinding-axiom/target/classes>
[INFO] [resources:testResources {execution: default-testResources}]
[INFO] Using 'UTF-8' encoding to copy filtered resources.
[INFO] Copying 3 resources
[INFO] Copying 3 resources
[INFO] [compiler:testCompile {execution: default-testCompile}]
[INFO] Compiling 2 source files to <https://builds.apache.org/job/Tuscany-2x-deploy/ws/sca-2x/modules/databinding-axiom/target/test-classes>
[INFO] [surefire:test {execution: default-test}]
[INFO] Tests are skipped.
[INFO] [jar:jar {execution: default-jar}]
[INFO] Building jar: <https://builds.apache.org/job/Tuscany-2x-deploy/ws/sca-2x/modules/databinding-axiom/target/tuscany-databinding-axiom-2.5-SNAPSHOT.jar>
[INFO] [source:jar-no-fork {execution: attach-sources}]
[INFO] Building jar: <https://builds.apache.org/job/Tuscany-2x-deploy/ws/sca-2x/modules/databinding-axiom/target/tuscany-databinding-axiom-2.5-SNAPSHOT-sources.jar>
[INFO] [install:install {execution: default-install}]
[INFO] Installing <https://builds.apache.org/job/Tuscany-2x-deploy/ws/sca-2x/modules/databinding-axiom/target/tuscany-databinding-axiom-2.5-SNAPSHOT.jar>
to <https://builds.apache.org/job/Tuscany-2x-deploy/ws/.repository/org/apache/tuscany/sca/tuscany-databinding-axiom/2.5-SNAPSHOT/tuscany-databinding-axiom-2.5-SNAPSHOT.jar>
[INFO] Installing <https://builds.apache.org/job/Tuscany-2x-deploy/ws/sca-2x/modules/databinding-axiom/target/tuscany-databinding-axiom-2.5-SNAPSHOT-sources.jar>
to <https://builds.apache.org/job/Tuscany-2x-deploy/ws/.repository/org/apache/tuscany/sca/tuscany-databinding-axiom/2.5-SNAPSHOT/tuscany-databinding-axiom-2.5-SNAPSHOT-sources.jar>
[INFO] [deploy:deploy {execution: default-deploy}]
[INFO] Retrieving previous build number from apache.snapshots.https
[WARNING] *** CHECKSUM FAILED - Checksum failed on download: local = 'ca6b4217849887a2c24b5327417d65e8b88a64ca';
remote = '8ba2c2d8fad73dfb99e93ca8c4ac084414152bb4' - RETRYING
[WARNING] *** CHECKSUM FAILED - Checksum failed on download: local = 'ca6b4217849887a2c24b5327417d65e8b88a64ca';
remote = '8ba2c2d8fad73dfb99e93ca8c4ac084414152bb4' - IGNORING
Uploading: https://repository.apache.org/content/repositories/snapshots/org/apache/tuscany/sca/tuscany-databinding-axiom/2.5-SNAPSHOT/tuscany-databinding-axiom-2.5-SNAPSHOT.jar
35K uploaded  (tuscany-databinding-axiom-2.5-SNAPSHOT.jar)
[INFO] Retrieving previous metadata from apache.snapshots.https
[INFO] Uploading repository metadata for: 'artifact org.apache.tuscany.sca:tuscany-databinding-axiom'
[INFO] Retrieving previous metadata from apache.snapshots.https
[WARNING] *** CHECKSUM FAILED - Checksum failed on download: local = 'ca6b4217849887a2c24b5327417d65e8b88a64ca';
remote = '8ba2c2d8fad73dfb99e93ca8c4ac084414152bb4' - RETRYING
[WARNING] *** CHECKSUM FAILED - Checksum failed on download: local = 'ca6b4217849887a2c24b5327417d65e8b88a64ca';
remote = '8ba2c2d8fad73dfb99e93ca8c4ac084414152bb4' - IGNORING
[INFO] Uploading repository metadata for: 'snapshot org.apache.tuscany.sca:tuscany-databinding-axiom:2.5-SNAPSHOT'
[INFO] Uploading project information for tuscany-databinding-axiom 2.5-SNAPSHOT
[INFO] Retrieving previous build number from apache.snapshots.https
Uploading: https://repository.apache.org/content/repositories/snapshots/org/apache/tuscany/sca/tuscany-databinding-axiom/2.5-SNAPSHOT/tuscany-databinding-axiom-2.5-SNAPSHOT-sources.jar
31K uploaded  (tuscany-databinding-axiom-2.5-SNAPSHOT-sources.jar)
[JENKINS] Archiving disabled - not archiving <https://builds.apache.org/job/Tuscany-2x-deploy/ws/sca-2x/modules/databinding-axiom/pom.xml>
[JENKINS] Archiving disabled - not archiving <https://builds.apache.org/job/Tuscany-2x-deploy/ws/sca-2x/modules/databinding-axiom/target/tuscany-databinding-axiom-2.5-SNAPSHOT.jar>
[JENKINS] Archiving disabled - not archiving <https://builds.apache.org/job/Tuscany-2x-deploy/ws/sca-2x/modules/databinding-axiom/target/tuscany-databinding-axiom-2.5-SNAPSHOT-sources.jar>
[INFO] ------------------------------------------------------------------------
[INFO] Building Apache Tuscany SCA Data Binding for JAXB-AXIOM
[INFO]    task-segment: [clean, deploy]
[INFO] ------------------------------------------------------------------------
[INFO] [clean:clean {execution: default-clean}]
[INFO] Deleting <https://builds.apache.org/job/Tuscany-2x-deploy/ws/sca-2x/modules/databinding-jaxb-axiom/target>
[INFO] [enforcer:enforce {execution: enforce-plugin-versions}]
[INFO] [build-helper:add-test-source {execution: add-test-source}]
[INFO] Test Source directory: <https://builds.apache.org/job/Tuscany-2x-deploy/ws/sca-2x/modules/databinding-jaxb-axiom/target/jaxb-source>
added.
[INFO] [remote-resources:process {execution: default}]
[INFO] [resources:resources {execution: default-resources}]
[INFO] Using 'UTF-8' encoding to copy filtered resources.
[INFO] Copying 1 resource
[INFO] Copying 3 resources
[INFO] Copying 3 resources
[INFO] [compiler:compile {execution: default-compile}]
[INFO] Compiling 10 source files to <https://builds.apache.org/job/Tuscany-2x-deploy/ws/sca-2x/modules/databinding-jaxb-axiom/target/classes>
[INFO] [jaxb2:generate {execution: generate-jaxb}]
[INFO] [resources:testResources {execution: default-testResources}]
[INFO] Using 'UTF-8' encoding to copy filtered resources.
[INFO] Copying 1 resource
[INFO] Copying 3 resources
[INFO] [compiler:testCompile {execution: default-testCompile}]
[INFO] Compiling 10 source files to <https://builds.apache.org/job/Tuscany-2x-deploy/ws/sca-2x/modules/databinding-jaxb-axiom/target/test-classes>
[INFO] [surefire:test {execution: default-test}]
[INFO] Tests are skipped.
[INFO] [jar:jar {execution: default-jar}]
[INFO] Building jar: <https://builds.apache.org/job/Tuscany-2x-deploy/ws/sca-2x/modules/databinding-jaxb-axiom/target/tuscany-databinding-jaxb-axiom-2.5-SNAPSHOT.jar>
[INFO] [source:jar-no-fork {execution: attach-sources}]
[INFO] Building jar: <https://builds.apache.org/job/Tuscany-2x-deploy/ws/sca-2x/modules/databinding-jaxb-axiom/target/tuscany-databinding-jaxb-axiom-2.5-SNAPSHOT-sources.jar>
[INFO] [install:install {execution: default-install}]
[INFO] Installing <https://builds.apache.org/job/Tuscany-2x-deploy/ws/sca-2x/modules/databinding-jaxb-axiom/target/tuscany-databinding-jaxb-axiom-2.5-SNAPSHOT.jar>
to <https://builds.apache.org/job/Tuscany-2x-deploy/ws/.repository/org/apache/tuscany/sca/tuscany-databinding-jaxb-axiom/2.5-SNAPSHOT/tuscany-databinding-jaxb-axiom-2.5-SNAPSHOT.jar>
[INFO] Installing <https://builds.apache.org/job/Tuscany-2x-deploy/ws/sca-2x/modules/databinding-jaxb-axiom/target/tuscany-databinding-jaxb-axiom-2.5-SNAPSHOT-sources.jar>
to <https://builds.apache.org/job/Tuscany-2x-deploy/ws/.repository/org/apache/tuscany/sca/tuscany-databinding-jaxb-axiom/2.5-SNAPSHOT/tuscany-databinding-jaxb-axiom-2.5-SNAPSHOT-sources.jar>
[INFO] [deploy:deploy {execution: default-deploy}]
[INFO] Retrieving previous build number from apache.snapshots.https
[WARNING] *** CHECKSUM FAILED - Checksum failed on download: local = 'dd2100c83604d5b69b5413031397a1e0d3eb274b';
remote = '094da1f5734760a38041ca0ebf2735b380d4fdfa' - RETRYING
[WARNING] *** CHECKSUM FAILED - Checksum failed on download: local = 'dd2100c83604d5b69b5413031397a1e0d3eb274b';
remote = '094da1f5734760a38041ca0ebf2735b380d4fdfa' - IGNORING
Uploading: https://repository.apache.org/content/repositories/snapshots/org/apache/tuscany/sca/tuscany-databinding-jaxb-axiom/2.5-SNAPSHOT/tuscany-databinding-jaxb-axiom-2.5-SNAPSHOT.jar
38K uploaded  (tuscany-databinding-jaxb-axiom-2.5-SNAPSHOT.jar)
[INFO] Uploading project information for tuscany-databinding-jaxb-axiom 2.5-SNAPSHOT
[INFO] Retrieving previous metadata from apache.snapshots.https
[WARNING] *** CHECKSUM FAILED - Checksum failed on download: local = 'dd2100c83604d5b69b5413031397a1e0d3eb274b';
remote = '094da1f5734760a38041ca0ebf2735b380d4fdfa' - RETRYING
[WARNING] *** CHECKSUM FAILED - Checksum failed on download: local = 'dd2100c83604d5b69b5413031397a1e0d3eb274b';
remote = '094da1f5734760a38041ca0ebf2735b380d4fdfa' - IGNORING
[INFO] Uploading repository metadata for: 'snapshot org.apache.tuscany.sca:tuscany-databinding-jaxb-axiom:2.5-SNAPSHOT'
[INFO] Retrieving previous metadata from apache.snapshots.https
[INFO] Uploading repository metadata for: 'artifact org.apache.tuscany.sca:tuscany-databinding-jaxb-axiom'
[INFO] Retrieving previous build number from apache.snapshots.https
Uploading: https://repository.apache.org/content/repositories/snapshots/org/apache/tuscany/sca/tuscany-databinding-jaxb-axiom/2.5-SNAPSHOT/tuscany-databinding-jaxb-axiom-2.5-SNAPSHOT-sources.jar
36K uploaded  (tuscany-databinding-jaxb-axiom-2.5-SNAPSHOT-sources.jar)
[JENKINS] Archiving disabled - not archiving <https://builds.apache.org/job/Tuscany-2x-deploy/ws/sca-2x/modules/databinding-jaxb-axiom/pom.xml>
[JENKINS] Archiving disabled - not archiving <https://builds.apache.org/job/Tuscany-2x-deploy/ws/sca-2x/modules/databinding-jaxb-axiom/target/tuscany-databinding-jaxb-axiom-2.5-SNAPSHOT.jar>
[JENKINS] Archiving disabled - not archiving <https://builds.apache.org/job/Tuscany-2x-deploy/ws/sca-2x/modules/databinding-jaxb-axiom/target/tuscany-databinding-jaxb-axiom-2.5-SNAPSHOT-sources.jar>
[INFO] ------------------------------------------------------------------------
[INFO] Building Apache Tuscany SCA Axis2-1.5-based WS Binding Runtime
[INFO]    task-segment: [clean, deploy]
[INFO] ------------------------------------------------------------------------
[INFO] [clean:clean {execution: default-clean}]
[JENKINS] Archiving disabled - not archiving <https://builds.apache.org/job/Tuscany-2x-deploy/ws/sca-2x/modules/binding-ws-runtime-axis2/pom.xml>
[INFO] ------------------------------------------------------------------------
[ERROR] BUILD ERROR
[INFO] ------------------------------------------------------------------------
[INFO] Error building POM (may not be this project's POM).


Project ID: org.apache.rampart:rampart-project:pom:1.5.1

Reason: Cannot find parent: org.apache:apache for project: org.apache.rampart:rampart-project:pom:1.5.1
for project org.apache.rampart:rampart-project:pom:1.5.1


[INFO] ------------------------------------------------------------------------
[INFO] For more information, run Maven with the -e switch
[INFO] ------------------------------------------------------------------------
[INFO] Total time: 43 minutes 39 seconds
[INFO] Finished at: Wed Aug 15 01:57:27 GMT+00:00 2012
[INFO] Final Memory: 386M/703M
[INFO] ------------------------------------------------------------------------
channel stopped

Mime
View raw message