tuscany-commits mailing list archives

Site index · List index
Message view « Date » · « Thread »
Top « Date » · « Thread »
From Apache Jenkins Server <jenk...@builds.apache.org>
Subject Build failed in Jenkins: Tuscany-2x-deploy #894
Date Thu, 16 Aug 2012 01:30:30 GMT
See <https://builds.apache.org/job/Tuscany-2x-deploy/894/changes>

Changes:

[antelder] Add method to get DOMInvoker for a service and testcase for that

[antelder] add method impl for ComponnetContext interface update

[antelder] Add implementation for DOMInvoker

[antelder] Add getDOMInvoker to the TuscanyServiceReference to enable dynamic invocation on
service references (and also add a getEndpointReference( to avoid the casts to impl where
this is already being used)

[antelder] Add an interface for a new invoker that uses DOM node for arg and return values.
This is to enable dynamic invocation of services and references using xml instead of Java
classes for the arguments

[antelder] Add getExtensionPointRegistry to interface to avoid having to cast to impl

------------------------------------------
[...truncated 4637 lines...]
[INFO] Building jar: <https://builds.apache.org/job/Tuscany-2x-deploy/ws/sca-2x/modules/binding-rmi-runtime/target/tuscany-binding-rmi-runtime-2.5-SNAPSHOT.jar>
[INFO] [source:jar-no-fork {execution: attach-sources}]
[INFO] Building jar: <https://builds.apache.org/job/Tuscany-2x-deploy/ws/sca-2x/modules/binding-rmi-runtime/target/tuscany-binding-rmi-runtime-2.5-SNAPSHOT-sources.jar>
[INFO] [install:install {execution: default-install}]
[INFO] Installing <https://builds.apache.org/job/Tuscany-2x-deploy/ws/sca-2x/modules/binding-rmi-runtime/target/tuscany-binding-rmi-runtime-2.5-SNAPSHOT.jar>
to <https://builds.apache.org/job/Tuscany-2x-deploy/ws/.repository/org/apache/tuscany/sca/tuscany-binding-rmi-runtime/2.5-SNAPSHOT/tuscany-binding-rmi-runtime-2.5-SNAPSHOT.jar>
[INFO] Installing <https://builds.apache.org/job/Tuscany-2x-deploy/ws/sca-2x/modules/binding-rmi-runtime/target/tuscany-binding-rmi-runtime-2.5-SNAPSHOT-sources.jar>
to <https://builds.apache.org/job/Tuscany-2x-deploy/ws/.repository/org/apache/tuscany/sca/tuscany-binding-rmi-runtime/2.5-SNAPSHOT/tuscany-binding-rmi-runtime-2.5-SNAPSHOT-sources.jar>
[INFO] [deploy:deploy {execution: default-deploy}]
[INFO] Retrieving previous build number from apache.snapshots.https
[WARNING] *** CHECKSUM FAILED - Checksum failed on download: local = '78173b3673d2a47a901b3a28fd4fffc0861a7742';
remote = 'cd38c0d2007c4db0dca63470cfa5186b6fbc56b4' - RETRYING
[WARNING] *** CHECKSUM FAILED - Checksum failed on download: local = '78173b3673d2a47a901b3a28fd4fffc0861a7742';
remote = 'cd38c0d2007c4db0dca63470cfa5186b6fbc56b4' - IGNORING
Uploading: https://repository.apache.org/content/repositories/snapshots/org/apache/tuscany/sca/tuscany-binding-rmi-runtime/2.5-SNAPSHOT/tuscany-binding-rmi-runtime-2.5-SNAPSHOT.jar
26K uploaded  (tuscany-binding-rmi-runtime-2.5-SNAPSHOT.jar)
[INFO] Retrieving previous metadata from apache.snapshots.https
[WARNING] *** CHECKSUM FAILED - Checksum failed on download: local = '78173b3673d2a47a901b3a28fd4fffc0861a7742';
remote = 'cd38c0d2007c4db0dca63470cfa5186b6fbc56b4' - RETRYING
[WARNING] *** CHECKSUM FAILED - Checksum failed on download: local = '78173b3673d2a47a901b3a28fd4fffc0861a7742';
remote = 'cd38c0d2007c4db0dca63470cfa5186b6fbc56b4' - IGNORING
[INFO] Uploading repository metadata for: 'snapshot org.apache.tuscany.sca:tuscany-binding-rmi-runtime:2.5-SNAPSHOT'
[INFO] Retrieving previous metadata from apache.snapshots.https
[INFO] Uploading repository metadata for: 'artifact org.apache.tuscany.sca:tuscany-binding-rmi-runtime'
[INFO] Uploading project information for tuscany-binding-rmi-runtime 2.5-SNAPSHOT
[INFO] Retrieving previous build number from apache.snapshots.https
Uploading: https://repository.apache.org/content/repositories/snapshots/org/apache/tuscany/sca/tuscany-binding-rmi-runtime/2.5-SNAPSHOT/tuscany-binding-rmi-runtime-2.5-SNAPSHOT-sources.jar
19K uploaded  (tuscany-binding-rmi-runtime-2.5-SNAPSHOT-sources.jar)
[JENKINS] Archiving disabled - not archiving <https://builds.apache.org/job/Tuscany-2x-deploy/ws/sca-2x/modules/binding-rmi-runtime/pom.xml>
[JENKINS] Archiving disabled - not archiving <https://builds.apache.org/job/Tuscany-2x-deploy/ws/sca-2x/modules/binding-rmi-runtime/target/tuscany-binding-rmi-runtime-2.5-SNAPSHOT.jar>
[JENKINS] Archiving disabled - not archiving <https://builds.apache.org/job/Tuscany-2x-deploy/ws/sca-2x/modules/binding-rmi-runtime/target/tuscany-binding-rmi-runtime-2.5-SNAPSHOT-sources.jar>
[INFO] ------------------------------------------------------------------------
[INFO] Building Apache Tuscany SCA Websocket Binding Extension
[INFO]    task-segment: [clean, deploy]
[INFO] ------------------------------------------------------------------------
[INFO] [clean:clean {execution: default-clean}]
[INFO] Deleting <https://builds.apache.org/job/Tuscany-2x-deploy/ws/sca-2x/modules/binding-websocket/target>
[INFO] [enforcer:enforce {execution: enforce-plugin-versions}]
[INFO] [remote-resources:process {execution: default}]
[INFO] [resources:resources {execution: default-resources}]
[INFO] Using 'UTF-8' encoding to copy filtered resources.
[INFO] Copying 6 resources
[INFO] Copying 3 resources
[INFO] Copying 3 resources
[INFO] [compiler:compile {execution: default-compile}]
[INFO] Compiling 17 source files to <https://builds.apache.org/job/Tuscany-2x-deploy/ws/sca-2x/modules/binding-websocket/target/classes>
[INFO] [resources:testResources {execution: default-testResources}]
[INFO] Using 'UTF-8' encoding to copy filtered resources.
[INFO] Copying 2 resources
[INFO] Copying 3 resources
[INFO] [compiler:testCompile {execution: default-testCompile}]
[INFO] Compiling 5 source files to <https://builds.apache.org/job/Tuscany-2x-deploy/ws/sca-2x/modules/binding-websocket/target/test-classes>
[INFO] [surefire:test {execution: default-test}]
[INFO] Tests are skipped.
[INFO] [jar:jar {execution: default-jar}]
[INFO] Building jar: <https://builds.apache.org/job/Tuscany-2x-deploy/ws/sca-2x/modules/binding-websocket/target/tuscany-binding-websocket-2.5-SNAPSHOT.jar>
[INFO] [source:jar-no-fork {execution: attach-sources}]
[INFO] Building jar: <https://builds.apache.org/job/Tuscany-2x-deploy/ws/sca-2x/modules/binding-websocket/target/tuscany-binding-websocket-2.5-SNAPSHOT-sources.jar>
[INFO] [install:install {execution: default-install}]
[INFO] Installing <https://builds.apache.org/job/Tuscany-2x-deploy/ws/sca-2x/modules/binding-websocket/target/tuscany-binding-websocket-2.5-SNAPSHOT.jar>
to <https://builds.apache.org/job/Tuscany-2x-deploy/ws/.repository/org/apache/tuscany/sca/tuscany-binding-websocket/2.5-SNAPSHOT/tuscany-binding-websocket-2.5-SNAPSHOT.jar>
[INFO] Installing <https://builds.apache.org/job/Tuscany-2x-deploy/ws/sca-2x/modules/binding-websocket/target/tuscany-binding-websocket-2.5-SNAPSHOT-sources.jar>
to <https://builds.apache.org/job/Tuscany-2x-deploy/ws/.repository/org/apache/tuscany/sca/tuscany-binding-websocket/2.5-SNAPSHOT/tuscany-binding-websocket-2.5-SNAPSHOT-sources.jar>
[INFO] [deploy:deploy {execution: default-deploy}]
[INFO] Retrieving previous build number from apache.snapshots.https
[WARNING] *** CHECKSUM FAILED - Checksum failed on download: local = '1c6105e54bb6de038847f4d6da9e76f65bdd0bc8';
remote = '10679fd02b79f1120444c617c2e687000c230ac8' - RETRYING
[WARNING] *** CHECKSUM FAILED - Checksum failed on download: local = '1c6105e54bb6de038847f4d6da9e76f65bdd0bc8';
remote = '10679fd02b79f1120444c617c2e687000c230ac8' - IGNORING
Uploading: https://repository.apache.org/content/repositories/snapshots/org/apache/tuscany/sca/tuscany-binding-websocket/2.5-SNAPSHOT/tuscany-binding-websocket-2.5-SNAPSHOT.jar
38K uploaded  (tuscany-binding-websocket-2.5-SNAPSHOT.jar)
[INFO] Retrieving previous metadata from apache.snapshots.https
[WARNING] *** CHECKSUM FAILED - Checksum failed on download: local = '1c6105e54bb6de038847f4d6da9e76f65bdd0bc8';
remote = '10679fd02b79f1120444c617c2e687000c230ac8' - RETRYING
[WARNING] *** CHECKSUM FAILED - Checksum failed on download: local = '1c6105e54bb6de038847f4d6da9e76f65bdd0bc8';
remote = '10679fd02b79f1120444c617c2e687000c230ac8' - IGNORING
[INFO] Uploading repository metadata for: 'snapshot org.apache.tuscany.sca:tuscany-binding-websocket:2.5-SNAPSHOT'
[INFO] Retrieving previous metadata from apache.snapshots.https
[INFO] Uploading repository metadata for: 'artifact org.apache.tuscany.sca:tuscany-binding-websocket'
[INFO] Uploading project information for tuscany-binding-websocket 2.5-SNAPSHOT
[INFO] Retrieving previous build number from apache.snapshots.https
Uploading: https://repository.apache.org/content/repositories/snapshots/org/apache/tuscany/sca/tuscany-binding-websocket/2.5-SNAPSHOT/tuscany-binding-websocket-2.5-SNAPSHOT-sources.jar
34K uploaded  (tuscany-binding-websocket-2.5-SNAPSHOT-sources.jar)
[JENKINS] Archiving disabled - not archiving <https://builds.apache.org/job/Tuscany-2x-deploy/ws/sca-2x/modules/binding-websocket/pom.xml>
[JENKINS] Archiving disabled - not archiving <https://builds.apache.org/job/Tuscany-2x-deploy/ws/sca-2x/modules/binding-websocket/target/tuscany-binding-websocket-2.5-SNAPSHOT.jar>
[JENKINS] Archiving disabled - not archiving <https://builds.apache.org/job/Tuscany-2x-deploy/ws/sca-2x/modules/binding-websocket/target/tuscany-binding-websocket-2.5-SNAPSHOT-sources.jar>
[INFO] ------------------------------------------------------------------------
[INFO] Building Apache Tuscany SCA Policy WS-Policy Model
[INFO]    task-segment: [clean, deploy]
[INFO] ------------------------------------------------------------------------
[INFO] [clean:clean {execution: default-clean}]
[INFO] Deleting <https://builds.apache.org/job/Tuscany-2x-deploy/ws/sca-2x/modules/policy-wspolicy/target>
[INFO] [enforcer:enforce {execution: enforce-plugin-versions}]
[INFO] [remote-resources:process {execution: default}]
[INFO] [resources:resources {execution: default-resources}]
[INFO] Using 'UTF-8' encoding to copy filtered resources.
[INFO] Copying 2 resources
[INFO] Copying 3 resources
[INFO] Copying 3 resources
[INFO] [compiler:compile {execution: default-compile}]
[INFO] Compiling 3 source files to <https://builds.apache.org/job/Tuscany-2x-deploy/ws/sca-2x/modules/policy-wspolicy/target/classes>
[INFO] [resources:testResources {execution: default-testResources}]
[INFO] Using 'UTF-8' encoding to copy filtered resources.
[INFO] Copying 1 resource
[INFO] Copying 3 resources
[INFO] [compiler:testCompile {execution: default-testCompile}]
[INFO] Compiling 5 source files to <https://builds.apache.org/job/Tuscany-2x-deploy/ws/sca-2x/modules/policy-wspolicy/target/test-classes>
[INFO] [surefire:test {execution: default-test}]
[INFO] Tests are skipped.
[INFO] [jar:jar {execution: default-jar}]
[INFO] Building jar: <https://builds.apache.org/job/Tuscany-2x-deploy/ws/sca-2x/modules/policy-wspolicy/target/tuscany-policy-wspolicy-2.5-SNAPSHOT.jar>
[INFO] [source:jar-no-fork {execution: attach-sources}]
[INFO] Building jar: <https://builds.apache.org/job/Tuscany-2x-deploy/ws/sca-2x/modules/policy-wspolicy/target/tuscany-policy-wspolicy-2.5-SNAPSHOT-sources.jar>
[INFO] [install:install {execution: default-install}]
[INFO] Installing <https://builds.apache.org/job/Tuscany-2x-deploy/ws/sca-2x/modules/policy-wspolicy/target/tuscany-policy-wspolicy-2.5-SNAPSHOT.jar>
to <https://builds.apache.org/job/Tuscany-2x-deploy/ws/.repository/org/apache/tuscany/sca/tuscany-policy-wspolicy/2.5-SNAPSHOT/tuscany-policy-wspolicy-2.5-SNAPSHOT.jar>
[INFO] Installing <https://builds.apache.org/job/Tuscany-2x-deploy/ws/sca-2x/modules/policy-wspolicy/target/tuscany-policy-wspolicy-2.5-SNAPSHOT-sources.jar>
to <https://builds.apache.org/job/Tuscany-2x-deploy/ws/.repository/org/apache/tuscany/sca/tuscany-policy-wspolicy/2.5-SNAPSHOT/tuscany-policy-wspolicy-2.5-SNAPSHOT-sources.jar>
[INFO] [deploy:deploy {execution: default-deploy}]
[INFO] Retrieving previous build number from apache.snapshots.https
[WARNING] *** CHECKSUM FAILED - Checksum failed on download: local = '98765102f402cb18615368bee069a6e9c0912cd1';
remote = '0a85be830f68e2fc8d06589b23b0249398d940b0' - RETRYING
[WARNING] *** CHECKSUM FAILED - Checksum failed on download: local = '98765102f402cb18615368bee069a6e9c0912cd1';
remote = '0a85be830f68e2fc8d06589b23b0249398d940b0' - IGNORING
Uploading: https://repository.apache.org/content/repositories/snapshots/org/apache/tuscany/sca/tuscany-policy-wspolicy/2.5-SNAPSHOT/tuscany-policy-wspolicy-2.5-SNAPSHOT.jar
21K uploaded  (tuscany-policy-wspolicy-2.5-SNAPSHOT.jar)
[INFO] Retrieving previous metadata from apache.snapshots.https
[WARNING] *** CHECKSUM FAILED - Checksum failed on download: local = '98765102f402cb18615368bee069a6e9c0912cd1';
remote = '0a85be830f68e2fc8d06589b23b0249398d940b0' - RETRYING
[WARNING] *** CHECKSUM FAILED - Checksum failed on download: local = '98765102f402cb18615368bee069a6e9c0912cd1';
remote = '0a85be830f68e2fc8d06589b23b0249398d940b0' - IGNORING
[INFO] Uploading repository metadata for: 'snapshot org.apache.tuscany.sca:tuscany-policy-wspolicy:2.5-SNAPSHOT'
[INFO] Uploading project information for tuscany-policy-wspolicy 2.5-SNAPSHOT
[INFO] Retrieving previous metadata from apache.snapshots.https
[INFO] Uploading repository metadata for: 'artifact org.apache.tuscany.sca:tuscany-policy-wspolicy'
[INFO] Retrieving previous build number from apache.snapshots.https
Uploading: https://repository.apache.org/content/repositories/snapshots/org/apache/tuscany/sca/tuscany-policy-wspolicy/2.5-SNAPSHOT/tuscany-policy-wspolicy-2.5-SNAPSHOT-sources.jar
17K uploaded  (tuscany-policy-wspolicy-2.5-SNAPSHOT-sources.jar)
[JENKINS] Archiving disabled - not archiving <https://builds.apache.org/job/Tuscany-2x-deploy/ws/sca-2x/modules/policy-wspolicy/pom.xml>
[JENKINS] Archiving disabled - not archiving <https://builds.apache.org/job/Tuscany-2x-deploy/ws/sca-2x/modules/policy-wspolicy/target/tuscany-policy-wspolicy-2.5-SNAPSHOT.jar>
[JENKINS] Archiving disabled - not archiving <https://builds.apache.org/job/Tuscany-2x-deploy/ws/sca-2x/modules/policy-wspolicy/target/tuscany-policy-wspolicy-2.5-SNAPSHOT-sources.jar>
[INFO] ------------------------------------------------------------------------
[INFO] Building Apache Tuscany SCA Data Binding for Axiom
[INFO]    task-segment: [clean, deploy]
[INFO] ------------------------------------------------------------------------
[INFO] [clean:clean {execution: default-clean}]
[INFO] Deleting <https://builds.apache.org/job/Tuscany-2x-deploy/ws/sca-2x/modules/databinding-axiom/target>
[INFO] [enforcer:enforce {execution: enforce-plugin-versions}]
[INFO] [remote-resources:process {execution: default}]
[INFO] [resources:resources {execution: default-resources}]
[INFO] Using 'UTF-8' encoding to copy filtered resources.
[INFO] Copying 2 resources
[INFO] Copying 3 resources
[INFO] Copying 3 resources
[INFO] [compiler:compile {execution: default-compile}]
[INFO] Compiling 13 source files to <https://builds.apache.org/job/Tuscany-2x-deploy/ws/sca-2x/modules/databinding-axiom/target/classes>
[INFO] [resources:testResources {execution: default-testResources}]
[INFO] Using 'UTF-8' encoding to copy filtered resources.
[INFO] Copying 3 resources
[INFO] Copying 3 resources
[INFO] [compiler:testCompile {execution: default-testCompile}]
[INFO] Compiling 2 source files to <https://builds.apache.org/job/Tuscany-2x-deploy/ws/sca-2x/modules/databinding-axiom/target/test-classes>
[INFO] [surefire:test {execution: default-test}]
[INFO] Tests are skipped.
[INFO] [jar:jar {execution: default-jar}]
[INFO] Building jar: <https://builds.apache.org/job/Tuscany-2x-deploy/ws/sca-2x/modules/databinding-axiom/target/tuscany-databinding-axiom-2.5-SNAPSHOT.jar>
[INFO] [source:jar-no-fork {execution: attach-sources}]
[INFO] Building jar: <https://builds.apache.org/job/Tuscany-2x-deploy/ws/sca-2x/modules/databinding-axiom/target/tuscany-databinding-axiom-2.5-SNAPSHOT-sources.jar>
[INFO] [install:install {execution: default-install}]
[INFO] Installing <https://builds.apache.org/job/Tuscany-2x-deploy/ws/sca-2x/modules/databinding-axiom/target/tuscany-databinding-axiom-2.5-SNAPSHOT.jar>
to <https://builds.apache.org/job/Tuscany-2x-deploy/ws/.repository/org/apache/tuscany/sca/tuscany-databinding-axiom/2.5-SNAPSHOT/tuscany-databinding-axiom-2.5-SNAPSHOT.jar>
[INFO] Installing <https://builds.apache.org/job/Tuscany-2x-deploy/ws/sca-2x/modules/databinding-axiom/target/tuscany-databinding-axiom-2.5-SNAPSHOT-sources.jar>
to <https://builds.apache.org/job/Tuscany-2x-deploy/ws/.repository/org/apache/tuscany/sca/tuscany-databinding-axiom/2.5-SNAPSHOT/tuscany-databinding-axiom-2.5-SNAPSHOT-sources.jar>
[INFO] [deploy:deploy {execution: default-deploy}]
[INFO] Retrieving previous build number from apache.snapshots.https
[WARNING] *** CHECKSUM FAILED - Checksum failed on download: local = '8bdcfdbadd902c8a4d9993ce1d94a35986974a35';
remote = '9339fd466137365c1e48f54ef19b14880142dd04' - RETRYING
[WARNING] *** CHECKSUM FAILED - Checksum failed on download: local = '8bdcfdbadd902c8a4d9993ce1d94a35986974a35';
remote = '9339fd466137365c1e48f54ef19b14880142dd04' - IGNORING
Uploading: https://repository.apache.org/content/repositories/snapshots/org/apache/tuscany/sca/tuscany-databinding-axiom/2.5-SNAPSHOT/tuscany-databinding-axiom-2.5-SNAPSHOT.jar
35K uploaded  (tuscany-databinding-axiom-2.5-SNAPSHOT.jar)
[INFO] Retrieving previous metadata from apache.snapshots.https
[INFO] Uploading repository metadata for: 'artifact org.apache.tuscany.sca:tuscany-databinding-axiom'
[INFO] Retrieving previous metadata from apache.snapshots.https
[WARNING] *** CHECKSUM FAILED - Checksum failed on download: local = '8bdcfdbadd902c8a4d9993ce1d94a35986974a35';
remote = '9339fd466137365c1e48f54ef19b14880142dd04' - RETRYING
[WARNING] *** CHECKSUM FAILED - Checksum failed on download: local = '8bdcfdbadd902c8a4d9993ce1d94a35986974a35';
remote = '9339fd466137365c1e48f54ef19b14880142dd04' - IGNORING
[INFO] Uploading repository metadata for: 'snapshot org.apache.tuscany.sca:tuscany-databinding-axiom:2.5-SNAPSHOT'
[INFO] Uploading project information for tuscany-databinding-axiom 2.5-SNAPSHOT
[INFO] Retrieving previous build number from apache.snapshots.https
Uploading: https://repository.apache.org/content/repositories/snapshots/org/apache/tuscany/sca/tuscany-databinding-axiom/2.5-SNAPSHOT/tuscany-databinding-axiom-2.5-SNAPSHOT-sources.jar
31K uploaded  (tuscany-databinding-axiom-2.5-SNAPSHOT-sources.jar)
[JENKINS] Archiving disabled - not archiving <https://builds.apache.org/job/Tuscany-2x-deploy/ws/sca-2x/modules/databinding-axiom/pom.xml>
[JENKINS] Archiving disabled - not archiving <https://builds.apache.org/job/Tuscany-2x-deploy/ws/sca-2x/modules/databinding-axiom/target/tuscany-databinding-axiom-2.5-SNAPSHOT.jar>
[JENKINS] Archiving disabled - not archiving <https://builds.apache.org/job/Tuscany-2x-deploy/ws/sca-2x/modules/databinding-axiom/target/tuscany-databinding-axiom-2.5-SNAPSHOT-sources.jar>
[INFO] ------------------------------------------------------------------------
[INFO] Building Apache Tuscany SCA Data Binding for JAXB-AXIOM
[INFO]    task-segment: [clean, deploy]
[INFO] ------------------------------------------------------------------------
[INFO] [clean:clean {execution: default-clean}]
[INFO] Deleting <https://builds.apache.org/job/Tuscany-2x-deploy/ws/sca-2x/modules/databinding-jaxb-axiom/target>
[INFO] [enforcer:enforce {execution: enforce-plugin-versions}]
[INFO] [build-helper:add-test-source {execution: add-test-source}]
[INFO] Test Source directory: <https://builds.apache.org/job/Tuscany-2x-deploy/ws/sca-2x/modules/databinding-jaxb-axiom/target/jaxb-source>
added.
[INFO] [remote-resources:process {execution: default}]
[INFO] [resources:resources {execution: default-resources}]
[INFO] Using 'UTF-8' encoding to copy filtered resources.
[INFO] Copying 1 resource
[INFO] Copying 3 resources
[INFO] Copying 3 resources
[INFO] [compiler:compile {execution: default-compile}]
[INFO] Compiling 10 source files to <https://builds.apache.org/job/Tuscany-2x-deploy/ws/sca-2x/modules/databinding-jaxb-axiom/target/classes>
[INFO] [jaxb2:generate {execution: generate-jaxb}]
[INFO] [resources:testResources {execution: default-testResources}]
[INFO] Using 'UTF-8' encoding to copy filtered resources.
[INFO] Copying 1 resource
[INFO] Copying 3 resources
[INFO] [compiler:testCompile {execution: default-testCompile}]
[INFO] Compiling 10 source files to <https://builds.apache.org/job/Tuscany-2x-deploy/ws/sca-2x/modules/databinding-jaxb-axiom/target/test-classes>
[INFO] [surefire:test {execution: default-test}]
[INFO] Tests are skipped.
[INFO] [jar:jar {execution: default-jar}]
[INFO] Building jar: <https://builds.apache.org/job/Tuscany-2x-deploy/ws/sca-2x/modules/databinding-jaxb-axiom/target/tuscany-databinding-jaxb-axiom-2.5-SNAPSHOT.jar>
[INFO] [source:jar-no-fork {execution: attach-sources}]
[INFO] Building jar: <https://builds.apache.org/job/Tuscany-2x-deploy/ws/sca-2x/modules/databinding-jaxb-axiom/target/tuscany-databinding-jaxb-axiom-2.5-SNAPSHOT-sources.jar>
[INFO] [install:install {execution: default-install}]
[INFO] Installing <https://builds.apache.org/job/Tuscany-2x-deploy/ws/sca-2x/modules/databinding-jaxb-axiom/target/tuscany-databinding-jaxb-axiom-2.5-SNAPSHOT.jar>
to <https://builds.apache.org/job/Tuscany-2x-deploy/ws/.repository/org/apache/tuscany/sca/tuscany-databinding-jaxb-axiom/2.5-SNAPSHOT/tuscany-databinding-jaxb-axiom-2.5-SNAPSHOT.jar>
[INFO] Installing <https://builds.apache.org/job/Tuscany-2x-deploy/ws/sca-2x/modules/databinding-jaxb-axiom/target/tuscany-databinding-jaxb-axiom-2.5-SNAPSHOT-sources.jar>
to <https://builds.apache.org/job/Tuscany-2x-deploy/ws/.repository/org/apache/tuscany/sca/tuscany-databinding-jaxb-axiom/2.5-SNAPSHOT/tuscany-databinding-jaxb-axiom-2.5-SNAPSHOT-sources.jar>
[INFO] [deploy:deploy {execution: default-deploy}]
[INFO] Retrieving previous build number from apache.snapshots.https
[WARNING] *** CHECKSUM FAILED - Checksum failed on download: local = 'a07170f90c9b872d96cd4d3123d4f8a8d3c1ac9c';
remote = 'f70dbfbf7ab1feaadd206197b6fa0436cbcf9269' - RETRYING
[WARNING] *** CHECKSUM FAILED - Checksum failed on download: local = 'a07170f90c9b872d96cd4d3123d4f8a8d3c1ac9c';
remote = 'f70dbfbf7ab1feaadd206197b6fa0436cbcf9269' - IGNORING
Uploading: https://repository.apache.org/content/repositories/snapshots/org/apache/tuscany/sca/tuscany-databinding-jaxb-axiom/2.5-SNAPSHOT/tuscany-databinding-jaxb-axiom-2.5-SNAPSHOT.jar
38K uploaded  (tuscany-databinding-jaxb-axiom-2.5-SNAPSHOT.jar)
[INFO] Uploading project information for tuscany-databinding-jaxb-axiom 2.5-SNAPSHOT
[INFO] Retrieving previous metadata from apache.snapshots.https
[WARNING] *** CHECKSUM FAILED - Checksum failed on download: local = 'a07170f90c9b872d96cd4d3123d4f8a8d3c1ac9c';
remote = 'f70dbfbf7ab1feaadd206197b6fa0436cbcf9269' - RETRYING
[WARNING] *** CHECKSUM FAILED - Checksum failed on download: local = 'a07170f90c9b872d96cd4d3123d4f8a8d3c1ac9c';
remote = 'f70dbfbf7ab1feaadd206197b6fa0436cbcf9269' - IGNORING
[INFO] Uploading repository metadata for: 'snapshot org.apache.tuscany.sca:tuscany-databinding-jaxb-axiom:2.5-SNAPSHOT'
[INFO] Retrieving previous metadata from apache.snapshots.https
[INFO] Uploading repository metadata for: 'artifact org.apache.tuscany.sca:tuscany-databinding-jaxb-axiom'
[INFO] Retrieving previous build number from apache.snapshots.https
Uploading: https://repository.apache.org/content/repositories/snapshots/org/apache/tuscany/sca/tuscany-databinding-jaxb-axiom/2.5-SNAPSHOT/tuscany-databinding-jaxb-axiom-2.5-SNAPSHOT-sources.jar
36K uploaded  (tuscany-databinding-jaxb-axiom-2.5-SNAPSHOT-sources.jar)
[JENKINS] Archiving disabled - not archiving <https://builds.apache.org/job/Tuscany-2x-deploy/ws/sca-2x/modules/databinding-jaxb-axiom/pom.xml>
[JENKINS] Archiving disabled - not archiving <https://builds.apache.org/job/Tuscany-2x-deploy/ws/sca-2x/modules/databinding-jaxb-axiom/target/tuscany-databinding-jaxb-axiom-2.5-SNAPSHOT.jar>
[JENKINS] Archiving disabled - not archiving <https://builds.apache.org/job/Tuscany-2x-deploy/ws/sca-2x/modules/databinding-jaxb-axiom/target/tuscany-databinding-jaxb-axiom-2.5-SNAPSHOT-sources.jar>
[INFO] ------------------------------------------------------------------------
[INFO] Building Apache Tuscany SCA Axis2-1.5-based WS Binding Runtime
[INFO]    task-segment: [clean, deploy]
[INFO] ------------------------------------------------------------------------
[INFO] [clean:clean {execution: default-clean}]
[JENKINS] Archiving disabled - not archiving <https://builds.apache.org/job/Tuscany-2x-deploy/ws/sca-2x/modules/binding-ws-runtime-axis2/pom.xml>
[INFO] ------------------------------------------------------------------------
[ERROR] BUILD ERROR
[INFO] ------------------------------------------------------------------------
[INFO] Error building POM (may not be this project's POM).


Project ID: org.apache.rampart:rampart-project:pom:1.5.1

Reason: Cannot find parent: org.apache:apache for project: org.apache.rampart:rampart-project:pom:1.5.1
for project org.apache.rampart:rampart-project:pom:1.5.1


[INFO] ------------------------------------------------------------------------
[INFO] For more information, run Maven with the -e switch
[INFO] ------------------------------------------------------------------------
[INFO] Total time: 49 minutes 22 seconds
[INFO] Finished at: Thu Aug 16 01:30:31 GMT+00:00 2012
[INFO] Final Memory: 385M/699M
[INFO] ------------------------------------------------------------------------
channel stopped

Mime
View raw message