tuscany-commits mailing list archives

Site index · List index
Message view « Date » · « Thread »
Top « Date » · « Thread »
From Apache Jenkins Server <jenk...@builds.apache.org>
Subject Build failed in Jenkins: Tuscany-2x-deploy #902
Date Fri, 24 Aug 2012 01:28:00 GMT
See <https://builds.apache.org/job/Tuscany-2x-deploy/902/>

------------------------------------------
[...truncated 4625 lines...]
[INFO] Building jar: <https://builds.apache.org/job/Tuscany-2x-deploy/ws/sca-2x/modules/binding-rmi-runtime/target/tuscany-binding-rmi-runtime-2.5-SNAPSHOT.jar>
[INFO] [source:jar-no-fork {execution: attach-sources}]
[INFO] Building jar: <https://builds.apache.org/job/Tuscany-2x-deploy/ws/sca-2x/modules/binding-rmi-runtime/target/tuscany-binding-rmi-runtime-2.5-SNAPSHOT-sources.jar>
[INFO] [install:install {execution: default-install}]
[INFO] Installing <https://builds.apache.org/job/Tuscany-2x-deploy/ws/sca-2x/modules/binding-rmi-runtime/target/tuscany-binding-rmi-runtime-2.5-SNAPSHOT.jar>
to <https://builds.apache.org/job/Tuscany-2x-deploy/ws/.repository/org/apache/tuscany/sca/tuscany-binding-rmi-runtime/2.5-SNAPSHOT/tuscany-binding-rmi-runtime-2.5-SNAPSHOT.jar>
[INFO] Installing <https://builds.apache.org/job/Tuscany-2x-deploy/ws/sca-2x/modules/binding-rmi-runtime/target/tuscany-binding-rmi-runtime-2.5-SNAPSHOT-sources.jar>
to <https://builds.apache.org/job/Tuscany-2x-deploy/ws/.repository/org/apache/tuscany/sca/tuscany-binding-rmi-runtime/2.5-SNAPSHOT/tuscany-binding-rmi-runtime-2.5-SNAPSHOT-sources.jar>
[INFO] [deploy:deploy {execution: default-deploy}]
[INFO] Retrieving previous build number from apache.snapshots.https
[WARNING] *** CHECKSUM FAILED - Checksum failed on download: local = '0c670cf9ec1fc401a4238fc0c421edce3c2845a9';
remote = 'a39621272a24530a0a3d8eea914960ab4233a85b' - RETRYING
[WARNING] *** CHECKSUM FAILED - Checksum failed on download: local = '0c670cf9ec1fc401a4238fc0c421edce3c2845a9';
remote = 'a39621272a24530a0a3d8eea914960ab4233a85b' - IGNORING
Uploading: https://repository.apache.org/content/repositories/snapshots/org/apache/tuscany/sca/tuscany-binding-rmi-runtime/2.5-SNAPSHOT/tuscany-binding-rmi-runtime-2.5-SNAPSHOT.jar
26K uploaded  (tuscany-binding-rmi-runtime-2.5-SNAPSHOT.jar)
[INFO] Retrieving previous metadata from apache.snapshots.https
[WARNING] *** CHECKSUM FAILED - Checksum failed on download: local = '0c670cf9ec1fc401a4238fc0c421edce3c2845a9';
remote = 'a39621272a24530a0a3d8eea914960ab4233a85b' - RETRYING
[WARNING] *** CHECKSUM FAILED - Checksum failed on download: local = '0c670cf9ec1fc401a4238fc0c421edce3c2845a9';
remote = 'a39621272a24530a0a3d8eea914960ab4233a85b' - IGNORING
[INFO] Uploading repository metadata for: 'snapshot org.apache.tuscany.sca:tuscany-binding-rmi-runtime:2.5-SNAPSHOT'
[INFO] Retrieving previous metadata from apache.snapshots.https
[INFO] Uploading repository metadata for: 'artifact org.apache.tuscany.sca:tuscany-binding-rmi-runtime'
[INFO] Uploading project information for tuscany-binding-rmi-runtime 2.5-SNAPSHOT
[INFO] Retrieving previous build number from apache.snapshots.https
Uploading: https://repository.apache.org/content/repositories/snapshots/org/apache/tuscany/sca/tuscany-binding-rmi-runtime/2.5-SNAPSHOT/tuscany-binding-rmi-runtime-2.5-SNAPSHOT-sources.jar
19K uploaded  (tuscany-binding-rmi-runtime-2.5-SNAPSHOT-sources.jar)
[JENKINS] Archiving disabled - not archiving <https://builds.apache.org/job/Tuscany-2x-deploy/ws/sca-2x/modules/binding-rmi-runtime/pom.xml>
[JENKINS] Archiving disabled - not archiving <https://builds.apache.org/job/Tuscany-2x-deploy/ws/sca-2x/modules/binding-rmi-runtime/target/tuscany-binding-rmi-runtime-2.5-SNAPSHOT.jar>
[JENKINS] Archiving disabled - not archiving <https://builds.apache.org/job/Tuscany-2x-deploy/ws/sca-2x/modules/binding-rmi-runtime/target/tuscany-binding-rmi-runtime-2.5-SNAPSHOT-sources.jar>
[INFO] ------------------------------------------------------------------------
[INFO] Building Apache Tuscany SCA Websocket Binding Extension
[INFO]    task-segment: [clean, deploy]
[INFO] ------------------------------------------------------------------------
[INFO] [clean:clean {execution: default-clean}]
[INFO] Deleting <https://builds.apache.org/job/Tuscany-2x-deploy/ws/sca-2x/modules/binding-websocket/target>
[INFO] [enforcer:enforce {execution: enforce-plugin-versions}]
[INFO] [remote-resources:process {execution: default}]
[INFO] [resources:resources {execution: default-resources}]
[INFO] Using 'UTF-8' encoding to copy filtered resources.
[INFO] Copying 6 resources
[INFO] Copying 3 resources
[INFO] Copying 3 resources
[INFO] [compiler:compile {execution: default-compile}]
[INFO] Compiling 17 source files to <https://builds.apache.org/job/Tuscany-2x-deploy/ws/sca-2x/modules/binding-websocket/target/classes>
[INFO] [resources:testResources {execution: default-testResources}]
[INFO] Using 'UTF-8' encoding to copy filtered resources.
[INFO] Copying 2 resources
[INFO] Copying 3 resources
[INFO] [compiler:testCompile {execution: default-testCompile}]
[INFO] Compiling 5 source files to <https://builds.apache.org/job/Tuscany-2x-deploy/ws/sca-2x/modules/binding-websocket/target/test-classes>
[INFO] [surefire:test {execution: default-test}]
[INFO] Tests are skipped.
[INFO] [jar:jar {execution: default-jar}]
[INFO] Building jar: <https://builds.apache.org/job/Tuscany-2x-deploy/ws/sca-2x/modules/binding-websocket/target/tuscany-binding-websocket-2.5-SNAPSHOT.jar>
[INFO] [source:jar-no-fork {execution: attach-sources}]
[INFO] Building jar: <https://builds.apache.org/job/Tuscany-2x-deploy/ws/sca-2x/modules/binding-websocket/target/tuscany-binding-websocket-2.5-SNAPSHOT-sources.jar>
[INFO] [install:install {execution: default-install}]
[INFO] Installing <https://builds.apache.org/job/Tuscany-2x-deploy/ws/sca-2x/modules/binding-websocket/target/tuscany-binding-websocket-2.5-SNAPSHOT.jar>
to <https://builds.apache.org/job/Tuscany-2x-deploy/ws/.repository/org/apache/tuscany/sca/tuscany-binding-websocket/2.5-SNAPSHOT/tuscany-binding-websocket-2.5-SNAPSHOT.jar>
[INFO] Installing <https://builds.apache.org/job/Tuscany-2x-deploy/ws/sca-2x/modules/binding-websocket/target/tuscany-binding-websocket-2.5-SNAPSHOT-sources.jar>
to <https://builds.apache.org/job/Tuscany-2x-deploy/ws/.repository/org/apache/tuscany/sca/tuscany-binding-websocket/2.5-SNAPSHOT/tuscany-binding-websocket-2.5-SNAPSHOT-sources.jar>
[INFO] [deploy:deploy {execution: default-deploy}]
[INFO] Retrieving previous build number from apache.snapshots.https
[WARNING] *** CHECKSUM FAILED - Checksum failed on download: local = '0a165f89d2eb31a8dc321c8af5de8cdef6066f1e';
remote = 'b8b171c23a734fcbaf2cda7acc807480caecad8b' - RETRYING
[WARNING] *** CHECKSUM FAILED - Checksum failed on download: local = '0a165f89d2eb31a8dc321c8af5de8cdef6066f1e';
remote = 'b8b171c23a734fcbaf2cda7acc807480caecad8b' - IGNORING
Uploading: https://repository.apache.org/content/repositories/snapshots/org/apache/tuscany/sca/tuscany-binding-websocket/2.5-SNAPSHOT/tuscany-binding-websocket-2.5-SNAPSHOT.jar
38K uploaded  (tuscany-binding-websocket-2.5-SNAPSHOT.jar)
[INFO] Retrieving previous metadata from apache.snapshots.https
[WARNING] *** CHECKSUM FAILED - Checksum failed on download: local = '0a165f89d2eb31a8dc321c8af5de8cdef6066f1e';
remote = 'b8b171c23a734fcbaf2cda7acc807480caecad8b' - RETRYING
[WARNING] *** CHECKSUM FAILED - Checksum failed on download: local = '0a165f89d2eb31a8dc321c8af5de8cdef6066f1e';
remote = 'b8b171c23a734fcbaf2cda7acc807480caecad8b' - IGNORING
[INFO] Uploading repository metadata for: 'snapshot org.apache.tuscany.sca:tuscany-binding-websocket:2.5-SNAPSHOT'
[INFO] Retrieving previous metadata from apache.snapshots.https
[INFO] Uploading repository metadata for: 'artifact org.apache.tuscany.sca:tuscany-binding-websocket'
[INFO] Uploading project information for tuscany-binding-websocket 2.5-SNAPSHOT
[INFO] Retrieving previous build number from apache.snapshots.https
Uploading: https://repository.apache.org/content/repositories/snapshots/org/apache/tuscany/sca/tuscany-binding-websocket/2.5-SNAPSHOT/tuscany-binding-websocket-2.5-SNAPSHOT-sources.jar
34K uploaded  (tuscany-binding-websocket-2.5-SNAPSHOT-sources.jar)
[JENKINS] Archiving disabled - not archiving <https://builds.apache.org/job/Tuscany-2x-deploy/ws/sca-2x/modules/binding-websocket/pom.xml>
[JENKINS] Archiving disabled - not archiving <https://builds.apache.org/job/Tuscany-2x-deploy/ws/sca-2x/modules/binding-websocket/target/tuscany-binding-websocket-2.5-SNAPSHOT.jar>
[JENKINS] Archiving disabled - not archiving <https://builds.apache.org/job/Tuscany-2x-deploy/ws/sca-2x/modules/binding-websocket/target/tuscany-binding-websocket-2.5-SNAPSHOT-sources.jar>
[INFO] ------------------------------------------------------------------------
[INFO] Building Apache Tuscany SCA Policy WS-Policy Model
[INFO]    task-segment: [clean, deploy]
[INFO] ------------------------------------------------------------------------
[INFO] [clean:clean {execution: default-clean}]
[INFO] Deleting <https://builds.apache.org/job/Tuscany-2x-deploy/ws/sca-2x/modules/policy-wspolicy/target>
[INFO] [enforcer:enforce {execution: enforce-plugin-versions}]
[INFO] [remote-resources:process {execution: default}]
[INFO] [resources:resources {execution: default-resources}]
[INFO] Using 'UTF-8' encoding to copy filtered resources.
[INFO] Copying 2 resources
[INFO] Copying 3 resources
[INFO] Copying 3 resources
[INFO] [compiler:compile {execution: default-compile}]
[INFO] Compiling 3 source files to <https://builds.apache.org/job/Tuscany-2x-deploy/ws/sca-2x/modules/policy-wspolicy/target/classes>
[INFO] [resources:testResources {execution: default-testResources}]
[INFO] Using 'UTF-8' encoding to copy filtered resources.
[INFO] Copying 1 resource
[INFO] Copying 3 resources
[INFO] [compiler:testCompile {execution: default-testCompile}]
[INFO] Compiling 5 source files to <https://builds.apache.org/job/Tuscany-2x-deploy/ws/sca-2x/modules/policy-wspolicy/target/test-classes>
[INFO] [surefire:test {execution: default-test}]
[INFO] Tests are skipped.
[INFO] [jar:jar {execution: default-jar}]
[INFO] Building jar: <https://builds.apache.org/job/Tuscany-2x-deploy/ws/sca-2x/modules/policy-wspolicy/target/tuscany-policy-wspolicy-2.5-SNAPSHOT.jar>
[INFO] [source:jar-no-fork {execution: attach-sources}]
[INFO] Building jar: <https://builds.apache.org/job/Tuscany-2x-deploy/ws/sca-2x/modules/policy-wspolicy/target/tuscany-policy-wspolicy-2.5-SNAPSHOT-sources.jar>
[INFO] [install:install {execution: default-install}]
[INFO] Installing <https://builds.apache.org/job/Tuscany-2x-deploy/ws/sca-2x/modules/policy-wspolicy/target/tuscany-policy-wspolicy-2.5-SNAPSHOT.jar>
to <https://builds.apache.org/job/Tuscany-2x-deploy/ws/.repository/org/apache/tuscany/sca/tuscany-policy-wspolicy/2.5-SNAPSHOT/tuscany-policy-wspolicy-2.5-SNAPSHOT.jar>
[INFO] Installing <https://builds.apache.org/job/Tuscany-2x-deploy/ws/sca-2x/modules/policy-wspolicy/target/tuscany-policy-wspolicy-2.5-SNAPSHOT-sources.jar>
to <https://builds.apache.org/job/Tuscany-2x-deploy/ws/.repository/org/apache/tuscany/sca/tuscany-policy-wspolicy/2.5-SNAPSHOT/tuscany-policy-wspolicy-2.5-SNAPSHOT-sources.jar>
[INFO] [deploy:deploy {execution: default-deploy}]
[INFO] Retrieving previous build number from apache.snapshots.https
[WARNING] *** CHECKSUM FAILED - Checksum failed on download: local = '46c5eddbb24baef47d8485dc43f319e0674ca844';
remote = '166003aad6fb9cd7453b8e926bca4c086e8bcffa' - RETRYING
[WARNING] *** CHECKSUM FAILED - Checksum failed on download: local = '46c5eddbb24baef47d8485dc43f319e0674ca844';
remote = '166003aad6fb9cd7453b8e926bca4c086e8bcffa' - IGNORING
Uploading: https://repository.apache.org/content/repositories/snapshots/org/apache/tuscany/sca/tuscany-policy-wspolicy/2.5-SNAPSHOT/tuscany-policy-wspolicy-2.5-SNAPSHOT.jar
21K uploaded  (tuscany-policy-wspolicy-2.5-SNAPSHOT.jar)
[INFO] Retrieving previous metadata from apache.snapshots.https
[WARNING] *** CHECKSUM FAILED - Checksum failed on download: local = '46c5eddbb24baef47d8485dc43f319e0674ca844';
remote = '166003aad6fb9cd7453b8e926bca4c086e8bcffa' - RETRYING
[WARNING] *** CHECKSUM FAILED - Checksum failed on download: local = '46c5eddbb24baef47d8485dc43f319e0674ca844';
remote = '166003aad6fb9cd7453b8e926bca4c086e8bcffa' - IGNORING
[INFO] Uploading repository metadata for: 'snapshot org.apache.tuscany.sca:tuscany-policy-wspolicy:2.5-SNAPSHOT'
[INFO] Uploading project information for tuscany-policy-wspolicy 2.5-SNAPSHOT
[INFO] Retrieving previous metadata from apache.snapshots.https
[INFO] Uploading repository metadata for: 'artifact org.apache.tuscany.sca:tuscany-policy-wspolicy'
[INFO] Retrieving previous build number from apache.snapshots.https
Uploading: https://repository.apache.org/content/repositories/snapshots/org/apache/tuscany/sca/tuscany-policy-wspolicy/2.5-SNAPSHOT/tuscany-policy-wspolicy-2.5-SNAPSHOT-sources.jar
17K uploaded  (tuscany-policy-wspolicy-2.5-SNAPSHOT-sources.jar)
[JENKINS] Archiving disabled - not archiving <https://builds.apache.org/job/Tuscany-2x-deploy/ws/sca-2x/modules/policy-wspolicy/pom.xml>
[JENKINS] Archiving disabled - not archiving <https://builds.apache.org/job/Tuscany-2x-deploy/ws/sca-2x/modules/policy-wspolicy/target/tuscany-policy-wspolicy-2.5-SNAPSHOT.jar>
[JENKINS] Archiving disabled - not archiving <https://builds.apache.org/job/Tuscany-2x-deploy/ws/sca-2x/modules/policy-wspolicy/target/tuscany-policy-wspolicy-2.5-SNAPSHOT-sources.jar>
[INFO] ------------------------------------------------------------------------
[INFO] Building Apache Tuscany SCA Data Binding for Axiom
[INFO]    task-segment: [clean, deploy]
[INFO] ------------------------------------------------------------------------
[INFO] [clean:clean {execution: default-clean}]
[INFO] Deleting <https://builds.apache.org/job/Tuscany-2x-deploy/ws/sca-2x/modules/databinding-axiom/target>
[INFO] [enforcer:enforce {execution: enforce-plugin-versions}]
[INFO] [remote-resources:process {execution: default}]
[INFO] [resources:resources {execution: default-resources}]
[INFO] Using 'UTF-8' encoding to copy filtered resources.
[INFO] Copying 2 resources
[INFO] Copying 3 resources
[INFO] Copying 3 resources
[INFO] [compiler:compile {execution: default-compile}]
[INFO] Compiling 13 source files to <https://builds.apache.org/job/Tuscany-2x-deploy/ws/sca-2x/modules/databinding-axiom/target/classes>
[INFO] [resources:testResources {execution: default-testResources}]
[INFO] Using 'UTF-8' encoding to copy filtered resources.
[INFO] Copying 3 resources
[INFO] Copying 3 resources
[INFO] [compiler:testCompile {execution: default-testCompile}]
[INFO] Compiling 2 source files to <https://builds.apache.org/job/Tuscany-2x-deploy/ws/sca-2x/modules/databinding-axiom/target/test-classes>
[INFO] [surefire:test {execution: default-test}]
[INFO] Tests are skipped.
[INFO] [jar:jar {execution: default-jar}]
[INFO] Building jar: <https://builds.apache.org/job/Tuscany-2x-deploy/ws/sca-2x/modules/databinding-axiom/target/tuscany-databinding-axiom-2.5-SNAPSHOT.jar>
[INFO] [source:jar-no-fork {execution: attach-sources}]
[INFO] Building jar: <https://builds.apache.org/job/Tuscany-2x-deploy/ws/sca-2x/modules/databinding-axiom/target/tuscany-databinding-axiom-2.5-SNAPSHOT-sources.jar>
[INFO] [install:install {execution: default-install}]
[INFO] Installing <https://builds.apache.org/job/Tuscany-2x-deploy/ws/sca-2x/modules/databinding-axiom/target/tuscany-databinding-axiom-2.5-SNAPSHOT.jar>
to <https://builds.apache.org/job/Tuscany-2x-deploy/ws/.repository/org/apache/tuscany/sca/tuscany-databinding-axiom/2.5-SNAPSHOT/tuscany-databinding-axiom-2.5-SNAPSHOT.jar>
[INFO] Installing <https://builds.apache.org/job/Tuscany-2x-deploy/ws/sca-2x/modules/databinding-axiom/target/tuscany-databinding-axiom-2.5-SNAPSHOT-sources.jar>
to <https://builds.apache.org/job/Tuscany-2x-deploy/ws/.repository/org/apache/tuscany/sca/tuscany-databinding-axiom/2.5-SNAPSHOT/tuscany-databinding-axiom-2.5-SNAPSHOT-sources.jar>
[INFO] [deploy:deploy {execution: default-deploy}]
[INFO] Retrieving previous build number from apache.snapshots.https
[WARNING] *** CHECKSUM FAILED - Checksum failed on download: local = 'de16b5722b3a56cb1aa5d7949891ac6786680a90';
remote = 'f737a8ddfdd02229afd2d38257ebbca2feee1150' - RETRYING
[WARNING] *** CHECKSUM FAILED - Checksum failed on download: local = 'de16b5722b3a56cb1aa5d7949891ac6786680a90';
remote = 'f737a8ddfdd02229afd2d38257ebbca2feee1150' - IGNORING
Uploading: https://repository.apache.org/content/repositories/snapshots/org/apache/tuscany/sca/tuscany-databinding-axiom/2.5-SNAPSHOT/tuscany-databinding-axiom-2.5-SNAPSHOT.jar
35K uploaded  (tuscany-databinding-axiom-2.5-SNAPSHOT.jar)
[INFO] Retrieving previous metadata from apache.snapshots.https
[INFO] Uploading repository metadata for: 'artifact org.apache.tuscany.sca:tuscany-databinding-axiom'
[INFO] Retrieving previous metadata from apache.snapshots.https
[WARNING] *** CHECKSUM FAILED - Checksum failed on download: local = 'de16b5722b3a56cb1aa5d7949891ac6786680a90';
remote = 'f737a8ddfdd02229afd2d38257ebbca2feee1150' - RETRYING
[WARNING] *** CHECKSUM FAILED - Checksum failed on download: local = 'de16b5722b3a56cb1aa5d7949891ac6786680a90';
remote = 'f737a8ddfdd02229afd2d38257ebbca2feee1150' - IGNORING
[INFO] Uploading repository metadata for: 'snapshot org.apache.tuscany.sca:tuscany-databinding-axiom:2.5-SNAPSHOT'
[INFO] Uploading project information for tuscany-databinding-axiom 2.5-SNAPSHOT
[INFO] Retrieving previous build number from apache.snapshots.https
Uploading: https://repository.apache.org/content/repositories/snapshots/org/apache/tuscany/sca/tuscany-databinding-axiom/2.5-SNAPSHOT/tuscany-databinding-axiom-2.5-SNAPSHOT-sources.jar
31K uploaded  (tuscany-databinding-axiom-2.5-SNAPSHOT-sources.jar)
[JENKINS] Archiving disabled - not archiving <https://builds.apache.org/job/Tuscany-2x-deploy/ws/sca-2x/modules/databinding-axiom/pom.xml>
[JENKINS] Archiving disabled - not archiving <https://builds.apache.org/job/Tuscany-2x-deploy/ws/sca-2x/modules/databinding-axiom/target/tuscany-databinding-axiom-2.5-SNAPSHOT.jar>
[JENKINS] Archiving disabled - not archiving <https://builds.apache.org/job/Tuscany-2x-deploy/ws/sca-2x/modules/databinding-axiom/target/tuscany-databinding-axiom-2.5-SNAPSHOT-sources.jar>
[INFO] ------------------------------------------------------------------------
[INFO] Building Apache Tuscany SCA Data Binding for JAXB-AXIOM
[INFO]    task-segment: [clean, deploy]
[INFO] ------------------------------------------------------------------------
[INFO] [clean:clean {execution: default-clean}]
[INFO] Deleting <https://builds.apache.org/job/Tuscany-2x-deploy/ws/sca-2x/modules/databinding-jaxb-axiom/target>
[INFO] [enforcer:enforce {execution: enforce-plugin-versions}]
[INFO] [build-helper:add-test-source {execution: add-test-source}]
[INFO] Test Source directory: <https://builds.apache.org/job/Tuscany-2x-deploy/ws/sca-2x/modules/databinding-jaxb-axiom/target/jaxb-source>
added.
[INFO] [remote-resources:process {execution: default}]
[INFO] [resources:resources {execution: default-resources}]
[INFO] Using 'UTF-8' encoding to copy filtered resources.
[INFO] Copying 1 resource
[INFO] Copying 3 resources
[INFO] Copying 3 resources
[INFO] [compiler:compile {execution: default-compile}]
[INFO] Compiling 10 source files to <https://builds.apache.org/job/Tuscany-2x-deploy/ws/sca-2x/modules/databinding-jaxb-axiom/target/classes>
[INFO] [jaxb2:generate {execution: generate-jaxb}]
[INFO] [resources:testResources {execution: default-testResources}]
[INFO] Using 'UTF-8' encoding to copy filtered resources.
[INFO] Copying 1 resource
[INFO] Copying 3 resources
[INFO] [compiler:testCompile {execution: default-testCompile}]
[INFO] Compiling 10 source files to <https://builds.apache.org/job/Tuscany-2x-deploy/ws/sca-2x/modules/databinding-jaxb-axiom/target/test-classes>
[INFO] [surefire:test {execution: default-test}]
[INFO] Tests are skipped.
[INFO] [jar:jar {execution: default-jar}]
[INFO] Building jar: <https://builds.apache.org/job/Tuscany-2x-deploy/ws/sca-2x/modules/databinding-jaxb-axiom/target/tuscany-databinding-jaxb-axiom-2.5-SNAPSHOT.jar>
[INFO] [source:jar-no-fork {execution: attach-sources}]
[INFO] Building jar: <https://builds.apache.org/job/Tuscany-2x-deploy/ws/sca-2x/modules/databinding-jaxb-axiom/target/tuscany-databinding-jaxb-axiom-2.5-SNAPSHOT-sources.jar>
[INFO] [install:install {execution: default-install}]
[INFO] Installing <https://builds.apache.org/job/Tuscany-2x-deploy/ws/sca-2x/modules/databinding-jaxb-axiom/target/tuscany-databinding-jaxb-axiom-2.5-SNAPSHOT.jar>
to <https://builds.apache.org/job/Tuscany-2x-deploy/ws/.repository/org/apache/tuscany/sca/tuscany-databinding-jaxb-axiom/2.5-SNAPSHOT/tuscany-databinding-jaxb-axiom-2.5-SNAPSHOT.jar>
[INFO] Installing <https://builds.apache.org/job/Tuscany-2x-deploy/ws/sca-2x/modules/databinding-jaxb-axiom/target/tuscany-databinding-jaxb-axiom-2.5-SNAPSHOT-sources.jar>
to <https://builds.apache.org/job/Tuscany-2x-deploy/ws/.repository/org/apache/tuscany/sca/tuscany-databinding-jaxb-axiom/2.5-SNAPSHOT/tuscany-databinding-jaxb-axiom-2.5-SNAPSHOT-sources.jar>
[INFO] [deploy:deploy {execution: default-deploy}]
[INFO] Retrieving previous build number from apache.snapshots.https
[WARNING] *** CHECKSUM FAILED - Checksum failed on download: local = 'dcd432d8103185ce59a9678331c4a1707b0b52cb';
remote = '754194396c77a8003491d776d080bcff5565564e' - RETRYING
[WARNING] *** CHECKSUM FAILED - Checksum failed on download: local = 'dcd432d8103185ce59a9678331c4a1707b0b52cb';
remote = '754194396c77a8003491d776d080bcff5565564e' - IGNORING
Uploading: https://repository.apache.org/content/repositories/snapshots/org/apache/tuscany/sca/tuscany-databinding-jaxb-axiom/2.5-SNAPSHOT/tuscany-databinding-jaxb-axiom-2.5-SNAPSHOT.jar
38K uploaded  (tuscany-databinding-jaxb-axiom-2.5-SNAPSHOT.jar)
[INFO] Uploading project information for tuscany-databinding-jaxb-axiom 2.5-SNAPSHOT
[INFO] Retrieving previous metadata from apache.snapshots.https
[WARNING] *** CHECKSUM FAILED - Checksum failed on download: local = 'dcd432d8103185ce59a9678331c4a1707b0b52cb';
remote = '754194396c77a8003491d776d080bcff5565564e' - RETRYING
[WARNING] *** CHECKSUM FAILED - Checksum failed on download: local = 'dcd432d8103185ce59a9678331c4a1707b0b52cb';
remote = '754194396c77a8003491d776d080bcff5565564e' - IGNORING
[INFO] Uploading repository metadata for: 'snapshot org.apache.tuscany.sca:tuscany-databinding-jaxb-axiom:2.5-SNAPSHOT'
[INFO] Retrieving previous metadata from apache.snapshots.https
[INFO] Uploading repository metadata for: 'artifact org.apache.tuscany.sca:tuscany-databinding-jaxb-axiom'
[INFO] Retrieving previous build number from apache.snapshots.https
Uploading: https://repository.apache.org/content/repositories/snapshots/org/apache/tuscany/sca/tuscany-databinding-jaxb-axiom/2.5-SNAPSHOT/tuscany-databinding-jaxb-axiom-2.5-SNAPSHOT-sources.jar
36K uploaded  (tuscany-databinding-jaxb-axiom-2.5-SNAPSHOT-sources.jar)
[JENKINS] Archiving disabled - not archiving <https://builds.apache.org/job/Tuscany-2x-deploy/ws/sca-2x/modules/databinding-jaxb-axiom/pom.xml>
[JENKINS] Archiving disabled - not archiving <https://builds.apache.org/job/Tuscany-2x-deploy/ws/sca-2x/modules/databinding-jaxb-axiom/target/tuscany-databinding-jaxb-axiom-2.5-SNAPSHOT.jar>
[JENKINS] Archiving disabled - not archiving <https://builds.apache.org/job/Tuscany-2x-deploy/ws/sca-2x/modules/databinding-jaxb-axiom/target/tuscany-databinding-jaxb-axiom-2.5-SNAPSHOT-sources.jar>
[INFO] ------------------------------------------------------------------------
[INFO] Building Apache Tuscany SCA Axis2-1.5-based WS Binding Runtime
[INFO]    task-segment: [clean, deploy]
[INFO] ------------------------------------------------------------------------
[INFO] [clean:clean {execution: default-clean}]
[JENKINS] Archiving disabled - not archiving <https://builds.apache.org/job/Tuscany-2x-deploy/ws/sca-2x/modules/binding-ws-runtime-axis2/pom.xml>
[INFO] ------------------------------------------------------------------------
[ERROR] BUILD ERROR
[INFO] ------------------------------------------------------------------------
[INFO] Error building POM (may not be this project's POM).


Project ID: org.apache.rampart:rampart-project:pom:1.5.1

Reason: Cannot find parent: org.apache:apache for project: org.apache.rampart:rampart-project:pom:1.5.1
for project org.apache.rampart:rampart-project:pom:1.5.1


[INFO] ------------------------------------------------------------------------
[INFO] For more information, run Maven with the -e switch
[INFO] ------------------------------------------------------------------------
[INFO] Total time: 46 minutes 42 seconds
[INFO] Finished at: Fri Aug 24 01:28:00 GMT+00:00 2012
[INFO] Final Memory: 385M/703M
[INFO] ------------------------------------------------------------------------
channel stopped

Mime
View raw message