tuscany-commits mailing list archives

Site index · List index
Message view « Date » · « Thread »
Top « Date » · « Thread »
From Apache Jenkins Server <jenk...@builds.apache.org>
Subject Build failed in Jenkins: Tuscany-2x-deploy #901
Date Wed, 22 Aug 2012 01:27:58 GMT
See <https://builds.apache.org/job/Tuscany-2x-deploy/901/>

------------------------------------------
[...truncated 14876 lines...]
[JENKINS] Archiving disabled - not archiving <https://builds.apache.org/job/Tuscany-2x-deploy/ws/sca-2x/modules/node-impl/target/tuscany-node-impl-2.5-SNAPSHOT.jar>
[JENKINS] Archiving disabled - not archiving <https://builds.apache.org/job/Tuscany-2x-deploy/ws/sca-2x/modules/node-impl/target/tuscany-node-impl-2.5-SNAPSHOT-sources.jar>
[JENKINS] Archiving disabled - not archiving <https://builds.apache.org/job/Tuscany-2x-deploy/ws/sca-2x/modules/implementation-osgi-runtime/pom.xml>
[JENKINS] Archiving disabled - not archiving <https://builds.apache.org/job/Tuscany-2x-deploy/ws/sca-2x/modules/implementation-osgi-runtime/target/tuscany-implementation-osgi-runtime-2.5-SNAPSHOT.jar>
[JENKINS] Archiving disabled - not archiving <https://builds.apache.org/job/Tuscany-2x-deploy/ws/sca-2x/modules/implementation-osgi-runtime/target/tuscany-implementation-osgi-runtime-2.5-SNAPSHOT-sources.jar>
[JENKINS] Archiving disabled - not archiving <https://builds.apache.org/job/Tuscany-2x-deploy/ws/sca-2x/samples/learning-more/binding-websocket/autocomplete-webapp/pom.xml>
[JENKINS] Archiving disabled - not archiving <https://builds.apache.org/job/Tuscany-2x-deploy/ws/sca-2x/samples/learning-more/binding-websocket/autocomplete-webapp/target/sample-binding-websocket-autocomplete-webapp-2.5-SNAPSHOT.war>
[JENKINS] Archiving disabled - not archiving <https://builds.apache.org/job/Tuscany-2x-deploy/ws/sca-2x/modules/implementation-jaxrs/pom.xml>
[JENKINS] Archiving disabled - not archiving <https://builds.apache.org/job/Tuscany-2x-deploy/ws/sca-2x/modules/implementation-jaxrs/target/tuscany-implementation-jaxrs-2.5-SNAPSHOT.jar>
[JENKINS] Archiving disabled - not archiving <https://builds.apache.org/job/Tuscany-2x-deploy/ws/sca-2x/modules/implementation-jaxrs/target/tuscany-implementation-jaxrs-2.5-SNAPSHOT-sources.jar>
[JENKINS] Archiving disabled - not archiving <https://builds.apache.org/job/Tuscany-2x-deploy/ws/sca-2x/modules/binding-jsonrpc-runtime/pom.xml>
[JENKINS] Archiving disabled - not archiving <https://builds.apache.org/job/Tuscany-2x-deploy/ws/sca-2x/modules/binding-jsonrpc-runtime/target/tuscany-binding-jsonrpc-runtime-2.5-SNAPSHOT.jar>
[JENKINS] Archiving disabled - not archiving <https://builds.apache.org/job/Tuscany-2x-deploy/ws/sca-2x/modules/binding-jsonrpc-runtime/target/tuscany-binding-jsonrpc-runtime-2.5-SNAPSHOT-sources.jar>
[JENKINS] Archiving disabled - not archiving <https://builds.apache.org/job/Tuscany-2x-deploy/ws/sca-2x/samples/getting-started/pom.xml>
[JENKINS] Archiving disabled - not archiving <https://builds.apache.org/job/Tuscany-2x-deploy/ws/sca-2x/modules/binding-atom-runtime/pom.xml>
[JENKINS] Archiving disabled - not archiving <https://builds.apache.org/job/Tuscany-2x-deploy/ws/sca-2x/modules/binding-atom-runtime/target/tuscany-binding-atom-runtime-2.5-SNAPSHOT.jar>
[JENKINS] Archiving disabled - not archiving <https://builds.apache.org/job/Tuscany-2x-deploy/ws/sca-2x/modules/binding-atom-runtime/target/tuscany-binding-atom-runtime-2.5-SNAPSHOT-sources.jar>
[JENKINS] Archiving disabled - not archiving <https://builds.apache.org/job/Tuscany-2x-deploy/ws/sca-2x/modules/node-api/pom.xml>
[JENKINS] Archiving disabled - not archiving <https://builds.apache.org/job/Tuscany-2x-deploy/ws/sca-2x/modules/node-api/target/tuscany-node-api-2.5-SNAPSHOT.jar>
[JENKINS] Archiving disabled - not archiving <https://builds.apache.org/job/Tuscany-2x-deploy/ws/sca-2x/modules/node-api/target/tuscany-node-api-2.5-SNAPSHOT-sources.jar>
[JENKINS] Archiving disabled - not archiving <https://builds.apache.org/job/Tuscany-2x-deploy/ws/sca-2x/modules/implementation-web-runtime/pom.xml>
[JENKINS] Archiving disabled - not archiving <https://builds.apache.org/job/Tuscany-2x-deploy/ws/sca-2x/modules/implementation-web-runtime/target/tuscany-implementation-web-runtime-2.5-SNAPSHOT.jar>
[JENKINS] Archiving disabled - not archiving <https://builds.apache.org/job/Tuscany-2x-deploy/ws/sca-2x/modules/implementation-web-runtime/target/tuscany-implementation-web-runtime-2.5-SNAPSHOT-sources.jar>
[JENKINS] Archiving disabled - not archiving <https://builds.apache.org/job/Tuscany-2x-deploy/ws/sca-2x/modules/stripes/pom.xml>
[JENKINS] Archiving disabled - not archiving <https://builds.apache.org/job/Tuscany-2x-deploy/ws/sca-2x/modules/stripes/target/tuscany-stripes-2.5-SNAPSHOT.jar>
[JENKINS] Archiving disabled - not archiving <https://builds.apache.org/job/Tuscany-2x-deploy/ws/sca-2x/modules/stripes/target/tuscany-stripes-2.5-SNAPSHOT-sources.jar>
[JENKINS] Archiving disabled - not archiving <https://builds.apache.org/job/Tuscany-2x-deploy/ws/sca-2x/maven/tuscany-maven-plugin/pom.xml>
[JENKINS] Archiving disabled - not archiving <https://builds.apache.org/job/Tuscany-2x-deploy/ws/sca-2x/maven/tuscany-maven-plugin/target/tuscany-maven-plugin-2.5-SNAPSHOT.jar>
[JENKINS] Archiving disabled - not archiving <https://builds.apache.org/job/Tuscany-2x-deploy/ws/sca-2x/distribution/all/pom.xml>
[JENKINS] Archiving disabled - not archiving <https://builds.apache.org/job/Tuscany-2x-deploy/ws/sca-2x/modules/binding-atom/pom.xml>
[JENKINS] Archiving disabled - not archiving <https://builds.apache.org/job/Tuscany-2x-deploy/ws/sca-2x/modules/binding-atom/target/tuscany-binding-atom-2.5-SNAPSHOT.jar>
[JENKINS] Archiving disabled - not archiving <https://builds.apache.org/job/Tuscany-2x-deploy/ws/sca-2x/modules/binding-atom/target/tuscany-binding-atom-2.5-SNAPSHOT-sources.jar>
[JENKINS] Archiving disabled - not archiving <https://builds.apache.org/job/Tuscany-2x-deploy/ws/sca-2x/samples/learning-more/contribution-osgi/pom.xml>
[JENKINS] Archiving disabled - not archiving <https://builds.apache.org/job/Tuscany-2x-deploy/ws/sca-2x/samples/learning-more/contribution-osgi/target/sample-contribution-osgi.jar>
[JENKINS] Archiving disabled - not archiving <https://builds.apache.org/job/Tuscany-2x-deploy/ws/sca-2x/modules/binding-http-runtime/pom.xml>
[JENKINS] Archiving disabled - not archiving <https://builds.apache.org/job/Tuscany-2x-deploy/ws/sca-2x/modules/binding-http-runtime/target/tuscany-binding-http-runtime-2.5-SNAPSHOT.jar>
[JENKINS] Archiving disabled - not archiving <https://builds.apache.org/job/Tuscany-2x-deploy/ws/sca-2x/modules/binding-http-runtime/target/tuscany-binding-http-runtime-2.5-SNAPSHOT-sources.jar>
[JENKINS] Archiving disabled - not archiving <https://builds.apache.org/job/Tuscany-2x-deploy/ws/sca-2x/modules/binding-websocket/pom.xml>
[JENKINS] Archiving disabled - not archiving <https://builds.apache.org/job/Tuscany-2x-deploy/ws/sca-2x/modules/binding-websocket/target/tuscany-binding-websocket-2.5-SNAPSHOT.jar>
[JENKINS] Archiving disabled - not archiving <https://builds.apache.org/job/Tuscany-2x-deploy/ws/sca-2x/modules/binding-websocket/target/tuscany-binding-websocket-2.5-SNAPSHOT-sources.jar>
[JENKINS] Archiving disabled - not archiving <https://builds.apache.org/job/Tuscany-2x-deploy/ws/sca-2x/modules/binding-rmi-runtime/pom.xml>
[JENKINS] Archiving disabled - not archiving <https://builds.apache.org/job/Tuscany-2x-deploy/ws/sca-2x/modules/binding-rmi-runtime/target/tuscany-binding-rmi-runtime-2.5-SNAPSHOT.jar>
[JENKINS] Archiving disabled - not archiving <https://builds.apache.org/job/Tuscany-2x-deploy/ws/sca-2x/modules/binding-rmi-runtime/target/tuscany-binding-rmi-runtime-2.5-SNAPSHOT-sources.jar>
[JENKINS] Archiving disabled - not archiving <https://builds.apache.org/job/Tuscany-2x-deploy/ws/sca-2x/modules/endpoint-tribes/pom.xml>
[JENKINS] Archiving disabled - not archiving <https://builds.apache.org/job/Tuscany-2x-deploy/ws/sca-2x/modules/endpoint-tribes/target/tuscany-endpoint-tribes-2.5-SNAPSHOT.jar>
[JENKINS] Archiving disabled - not archiving <https://builds.apache.org/job/Tuscany-2x-deploy/ws/sca-2x/modules/endpoint-tribes/target/tuscany-endpoint-tribes-2.5-SNAPSHOT-sources.jar>
[JENKINS] Archiving disabled - not archiving <https://builds.apache.org/job/Tuscany-2x-deploy/ws/sca-2x/modules/xsd/pom.xml>
[JENKINS] Archiving disabled - not archiving <https://builds.apache.org/job/Tuscany-2x-deploy/ws/sca-2x/modules/xsd/target/tuscany-xsd-2.5-SNAPSHOT.jar>
[JENKINS] Archiving disabled - not archiving <https://builds.apache.org/job/Tuscany-2x-deploy/ws/sca-2x/modules/xsd/target/tuscany-xsd-2.5-SNAPSHOT-sources.jar>
[JENKINS] Archiving disabled - not archiving <https://builds.apache.org/job/Tuscany-2x-deploy/ws/sca-2x/modules/binding-ws-runtime-jaxws-ri/pom.xml>
[JENKINS] Archiving disabled - not archiving <https://builds.apache.org/job/Tuscany-2x-deploy/ws/sca-2x/modules/binding-ws-runtime-jaxws-ri/target/tuscany-binding-ws-runtime-jaxws-ri-2.5-SNAPSHOT.jar>
[JENKINS] Archiving disabled - not archiving <https://builds.apache.org/job/Tuscany-2x-deploy/ws/sca-2x/modules/binding-ws-runtime-jaxws-ri/target/tuscany-binding-ws-runtime-jaxws-ri-2.5-SNAPSHOT-sources.jar>
[JENKINS] Archiving disabled - not archiving <https://builds.apache.org/job/Tuscany-2x-deploy/ws/sca-2x/modules/policy-transaction-runtime-geronimo/pom.xml>
[JENKINS] Archiving disabled - not archiving <https://builds.apache.org/job/Tuscany-2x-deploy/ws/sca-2x/modules/policy-transaction-runtime-geronimo/target/tuscany-policy-transaction-runtime-geronimo-2.5-SNAPSHOT.jar>
[JENKINS] Archiving disabled - not archiving <https://builds.apache.org/job/Tuscany-2x-deploy/ws/sca-2x/modules/policy-transaction-runtime-geronimo/target/tuscany-policy-transaction-runtime-geronimo-2.5-SNAPSHOT-sources.jar>
[JENKINS] Archiving disabled - not archiving <https://builds.apache.org/job/Tuscany-2x-deploy/ws/sca-2x/modules/implementation-spring-tie/pom.xml>
[JENKINS] Archiving disabled - not archiving <https://builds.apache.org/job/Tuscany-2x-deploy/ws/sca-2x/modules/implementation-spring-tie/target/tuscany-implementation-spring-tie-2.5-SNAPSHOT.jar>
[JENKINS] Archiving disabled - not archiving <https://builds.apache.org/job/Tuscany-2x-deploy/ws/sca-2x/modules/implementation-spring-tie/target/tuscany-implementation-spring-tie-2.5-SNAPSHOT-sources.jar>
[JENKINS] Archiving disabled - not archiving <https://builds.apache.org/job/Tuscany-2x-deploy/ws/sca-2x/modules/interface-java-jaxws/pom.xml>
[JENKINS] Archiving disabled - not archiving <https://builds.apache.org/job/Tuscany-2x-deploy/ws/sca-2x/modules/interface-java-jaxws/target/tuscany-interface-java-jaxws-2.5-SNAPSHOT.jar>
[JENKINS] Archiving disabled - not archiving <https://builds.apache.org/job/Tuscany-2x-deploy/ws/sca-2x/modules/interface-java-jaxws/target/tuscany-interface-java-jaxws-2.5-SNAPSHOT-sources.jar>
[JENKINS] Archiving disabled - not archiving <https://builds.apache.org/job/Tuscany-2x-deploy/ws/sca-2x/modules/data-api/pom.xml>
[JENKINS] Archiving disabled - not archiving <https://builds.apache.org/job/Tuscany-2x-deploy/ws/sca-2x/modules/data-api/target/tuscany-data-api-2.5-SNAPSHOT.jar>
[JENKINS] Archiving disabled - not archiving <https://builds.apache.org/job/Tuscany-2x-deploy/ws/sca-2x/modules/data-api/target/tuscany-data-api-2.5-SNAPSHOT-sources.jar>
[JENKINS] Archiving disabled - not archiving <https://builds.apache.org/job/Tuscany-2x-deploy/ws/sca-2x/modules/extensibility-equinox/pom.xml>
[JENKINS] Archiving disabled - not archiving <https://builds.apache.org/job/Tuscany-2x-deploy/ws/sca-2x/modules/extensibility-equinox/target/tuscany-extensibility-equinox-2.5-SNAPSHOT.jar>
[JENKINS] Archiving disabled - not archiving <https://builds.apache.org/job/Tuscany-2x-deploy/ws/sca-2x/modules/extensibility-equinox/target/tuscany-extensibility-equinox-2.5-SNAPSHOT-sources.jar>
[JENKINS] Archiving disabled - not archiving <https://builds.apache.org/job/Tuscany-2x-deploy/ws/sca-2x/modules/core/pom.xml>
[JENKINS] Archiving disabled - not archiving <https://builds.apache.org/job/Tuscany-2x-deploy/ws/sca-2x/modules/core/target/tuscany-core-2.5-SNAPSHOT.jar>
[JENKINS] Archiving disabled - not archiving <https://builds.apache.org/job/Tuscany-2x-deploy/ws/sca-2x/modules/core/target/tuscany-core-2.5-SNAPSHOT-sources.jar>
[JENKINS] Archiving disabled - not archiving <https://builds.apache.org/job/Tuscany-2x-deploy/ws/sca-2x/modules/domain-hazelcast/pom.xml>
[JENKINS] Archiving disabled - not archiving <https://builds.apache.org/job/Tuscany-2x-deploy/ws/sca-2x/modules/domain-hazelcast/target/tuscany-domain-hazelcast-2.5-SNAPSHOT.jar>
[JENKINS] Archiving disabled - not archiving <https://builds.apache.org/job/Tuscany-2x-deploy/ws/sca-2x/modules/domain-hazelcast/target/tuscany-domain-hazelcast-2.5-SNAPSHOT-sources.jar>
[JENKINS] Archiving disabled - not archiving <https://builds.apache.org/job/Tuscany-2x-deploy/ws/sca-2x/modules/implementation-java/pom.xml>
[JENKINS] Archiving disabled - not archiving <https://builds.apache.org/job/Tuscany-2x-deploy/ws/sca-2x/modules/implementation-java/target/tuscany-implementation-java-2.5-SNAPSHOT.jar>
[JENKINS] Archiving disabled - not archiving <https://builds.apache.org/job/Tuscany-2x-deploy/ws/sca-2x/modules/implementation-java/target/tuscany-implementation-java-2.5-SNAPSHOT-sources.jar>
[JENKINS] Archiving disabled - not archiving <https://builds.apache.org/job/Tuscany-2x-deploy/ws/sca-2x/samples/getting-started/helloworld-jsonp/pom.xml>
[JENKINS] Archiving disabled - not archiving <https://builds.apache.org/job/Tuscany-2x-deploy/ws/sca-2x/samples/getting-started/helloworld-jsonp/target/helloworld-jsonp-2.5-SNAPSHOT.jar>
[JENKINS] Archiving disabled - not archiving <https://builds.apache.org/job/Tuscany-2x-deploy/ws/sca-2x/modules/web-javascript/pom.xml>
[JENKINS] Archiving disabled - not archiving <https://builds.apache.org/job/Tuscany-2x-deploy/ws/sca-2x/modules/web-javascript/target/tuscany-web-javascript-2.5-SNAPSHOT.jar>
[JENKINS] Archiving disabled - not archiving <https://builds.apache.org/job/Tuscany-2x-deploy/ws/sca-2x/modules/web-javascript/target/tuscany-web-javascript-2.5-SNAPSHOT-sources.jar>
[JENKINS] Archiving disabled - not archiving <https://builds.apache.org/job/Tuscany-2x-deploy/ws/sca-2x/modules/databinding-jaxb-axiom/pom.xml>
[JENKINS] Archiving disabled - not archiving <https://builds.apache.org/job/Tuscany-2x-deploy/ws/sca-2x/modules/databinding-jaxb-axiom/target/tuscany-databinding-jaxb-axiom-2.5-SNAPSHOT.jar>
[JENKINS] Archiving disabled - not archiving <https://builds.apache.org/job/Tuscany-2x-deploy/ws/sca-2x/modules/databinding-jaxb-axiom/target/tuscany-databinding-jaxb-axiom-2.5-SNAPSHOT-sources.jar>
[JENKINS] Archiving disabled - not archiving <https://builds.apache.org/job/Tuscany-2x-deploy/ws/sca-2x/modules/host-corba/pom.xml>
[JENKINS] Archiving disabled - not archiving <https://builds.apache.org/job/Tuscany-2x-deploy/ws/sca-2x/modules/host-corba/target/tuscany-host-corba-2.5-SNAPSHOT.jar>
[JENKINS] Archiving disabled - not archiving <https://builds.apache.org/job/Tuscany-2x-deploy/ws/sca-2x/modules/host-corba/target/tuscany-host-corba-2.5-SNAPSHOT-sources.jar>
[JENKINS] Archiving disabled - not archiving <https://builds.apache.org/job/Tuscany-2x-deploy/ws/sca-2x/modules/implementation-web/pom.xml>
[JENKINS] Archiving disabled - not archiving <https://builds.apache.org/job/Tuscany-2x-deploy/ws/sca-2x/modules/implementation-web/target/tuscany-implementation-web-2.5-SNAPSHOT.jar>
[JENKINS] Archiving disabled - not archiving <https://builds.apache.org/job/Tuscany-2x-deploy/ws/sca-2x/modules/implementation-web/target/tuscany-implementation-web-2.5-SNAPSHOT-sources.jar>
[JENKINS] Archiving disabled - not archiving <https://builds.apache.org/job/Tuscany-2x-deploy/ws/sca-2x/samples/learning-more/binding-websocket/pubsub-webapp/pom.xml>
[JENKINS] Archiving disabled - not archiving <https://builds.apache.org/job/Tuscany-2x-deploy/ws/sca-2x/samples/learning-more/binding-websocket/pubsub-webapp/target/sample-binding-websocket-pubsub-webapp-2.5-SNAPSHOT.war>
[JENKINS] Archiving disabled - not archiving <https://builds.apache.org/job/Tuscany-2x-deploy/ws/sca-2x/samples/getting-started/helloworld-webservice/pom.xml>
[JENKINS] Archiving disabled - not archiving <https://builds.apache.org/job/Tuscany-2x-deploy/ws/sca-2x/samples/getting-started/helloworld-webservice/target/helloworld-webservice-2.5-SNAPSHOT.jar>
[JENKINS] Archiving disabled - not archiving <https://builds.apache.org/job/Tuscany-2x-deploy/ws/sca-2x/modules/policy-transaction/pom.xml>
[JENKINS] Archiving disabled - not archiving <https://builds.apache.org/job/Tuscany-2x-deploy/ws/sca-2x/modules/policy-transaction/target/tuscany-policy-transaction-2.5-SNAPSHOT.jar>
[JENKINS] Archiving disabled - not archiving <https://builds.apache.org/job/Tuscany-2x-deploy/ws/sca-2x/modules/policy-transaction/target/tuscany-policy-transaction-2.5-SNAPSHOT-sources.jar>
[JENKINS] Archiving disabled - not archiving <https://builds.apache.org/job/Tuscany-2x-deploy/ws/sca-2x/samples/running-tuscany/jse/pom.xml>
[JENKINS] Archiving disabled - not archiving <https://builds.apache.org/job/Tuscany-2x-deploy/ws/sca-2x/samples/running-tuscany/jse/target/jse.jar>
[JENKINS] Archiving disabled - not archiving <https://builds.apache.org/job/Tuscany-2x-deploy/ws/sca-2x/samples/getting-started/helloworld-spring/pom.xml>
[JENKINS] Archiving disabled - not archiving <https://builds.apache.org/job/Tuscany-2x-deploy/ws/sca-2x/samples/getting-started/helloworld-spring/target/helloworld-spring-2.5-SNAPSHOT.jar>
[JENKINS] Archiving disabled - not archiving <https://builds.apache.org/job/Tuscany-2x-deploy/ws/sca-2x/samples/learning-more/binding-websocket/weather-webapp/pom.xml>
[JENKINS] Archiving disabled - not archiving <https://builds.apache.org/job/Tuscany-2x-deploy/ws/sca-2x/samples/learning-more/binding-websocket/weather-webapp/target/sample-binding-websocket-weather-webapp-2.5-SNAPSHOT.war>
[JENKINS] Archiving disabled - not archiving <https://builds.apache.org/job/Tuscany-2x-deploy/ws/sca-2x/modules/implementation-widget-runtime-dojo/pom.xml>
[JENKINS] Archiving disabled - not archiving <https://builds.apache.org/job/Tuscany-2x-deploy/ws/sca-2x/modules/implementation-widget-runtime-dojo/target/tuscany-implementation-widget-runtime-dojo-2.5-SNAPSHOT.jar>
[JENKINS] Archiving disabled - not archiving <https://builds.apache.org/job/Tuscany-2x-deploy/ws/sca-2x/modules/implementation-widget-runtime-dojo/target/tuscany-implementation-widget-runtime-dojo-2.5-SNAPSHOT-sources.jar>
[JENKINS] Archiving disabled - not archiving <https://builds.apache.org/job/Tuscany-2x-deploy/ws/sca-2x/modules/core-runtime-pom/pom.xml>
[JENKINS] Archiving disabled - not archiving <https://builds.apache.org/job/Tuscany-2x-deploy/ws/sca-2x/maven/archetypes/quickstart-stripes/pom.xml>
[JENKINS] Archiving disabled - not archiving <https://builds.apache.org/job/Tuscany-2x-deploy/ws/sca-2x/maven/archetypes/quickstart-stripes/target/tuscany-quickstart-stripes-2.5-SNAPSHOT.jar>
[JENKINS] Archiving disabled - not archiving <https://builds.apache.org/job/Tuscany-2x-deploy/ws/sca-2x/modules/node-manager/pom.xml>
[JENKINS] Archiving disabled - not archiving <https://builds.apache.org/job/Tuscany-2x-deploy/ws/sca-2x/modules/node-manager/target/tuscany-node-manager-2.5-SNAPSHOT.jar>
[JENKINS] Archiving disabled - not archiving <https://builds.apache.org/job/Tuscany-2x-deploy/ws/sca-2x/modules/node-manager/target/tuscany-node-manager-2.5-SNAPSHOT-sources.jar>
[JENKINS] Archiving disabled - not archiving <https://builds.apache.org/job/Tuscany-2x-deploy/ws/sca-2x/samples/learning-more/distributed-osgi-static/pom.xml>
[JENKINS] Archiving disabled - not archiving <https://builds.apache.org/job/Tuscany-2x-deploy/ws/sca-2x/modules/builder/pom.xml>
[JENKINS] Archiving disabled - not archiving <https://builds.apache.org/job/Tuscany-2x-deploy/ws/sca-2x/modules/builder/target/tuscany-builder-2.5-SNAPSHOT.jar>
[JENKINS] Archiving disabled - not archiving <https://builds.apache.org/job/Tuscany-2x-deploy/ws/sca-2x/modules/builder/target/tuscany-builder-2.5-SNAPSHOT-sources.jar>
[JENKINS] Archiving disabled - not archiving <https://builds.apache.org/job/Tuscany-2x-deploy/ws/sca-2x/modules/contribution-osgi/pom.xml>
[JENKINS] Archiving disabled - not archiving <https://builds.apache.org/job/Tuscany-2x-deploy/ws/sca-2x/modules/contribution-osgi/target/tuscany-contribution-osgi-2.5-SNAPSHOT.jar>
[JENKINS] Archiving disabled - not archiving <https://builds.apache.org/job/Tuscany-2x-deploy/ws/sca-2x/modules/contribution-osgi/target/tuscany-contribution-osgi-2.5-SNAPSHOT-sources.jar>
[JENKINS] Archiving disabled - not archiving <https://builds.apache.org/job/Tuscany-2x-deploy/ws/sca-2x/modules/binding-ws-runtime-jaxws/pom.xml>
[JENKINS] Archiving disabled - not archiving <https://builds.apache.org/job/Tuscany-2x-deploy/ws/sca-2x/modules/binding-ws-runtime-jaxws/target/tuscany-binding-ws-runtime-jaxws-2.5-SNAPSHOT.jar>
[JENKINS] Archiving disabled - not archiving <https://builds.apache.org/job/Tuscany-2x-deploy/ws/sca-2x/modules/binding-ws-runtime-jaxws/target/tuscany-binding-ws-runtime-jaxws-2.5-SNAPSHOT-sources.jar>
[JENKINS] Archiving disabled - not archiving <https://builds.apache.org/job/Tuscany-2x-deploy/ws/sca-2x/samples/applications/store/pom.xml>
[JENKINS] Archiving disabled - not archiving <https://builds.apache.org/job/Tuscany-2x-deploy/ws/sca-2x/samples/applications/store/target/sample-store.jar>
[JENKINS] Archiving disabled - not archiving <https://builds.apache.org/job/Tuscany-2x-deploy/ws/sca-2x/modules/databinding/pom.xml>
[JENKINS] Archiving disabled - not archiving <https://builds.apache.org/job/Tuscany-2x-deploy/ws/sca-2x/modules/databinding/target/tuscany-databinding-2.5-SNAPSHOT.jar>
[JENKINS] Archiving disabled - not archiving <https://builds.apache.org/job/Tuscany-2x-deploy/ws/sca-2x/modules/databinding/target/tuscany-databinding-2.5-SNAPSHOT-sources.jar>
[JENKINS] Archiving disabled - not archiving <https://builds.apache.org/job/Tuscany-2x-deploy/ws/sca-2x/samples/learning-more/distributed-osgi-static/calculator-bundle/pom.xml>
[JENKINS] Archiving disabled - not archiving <https://builds.apache.org/job/Tuscany-2x-deploy/ws/sca-2x/samples/learning-more/distributed-osgi-static/calculator-bundle/target/sample-calculator-bundle.jar>
[JENKINS] Archiving disabled - not archiving <https://builds.apache.org/job/Tuscany-2x-deploy/ws/sca-2x/modules/binding-corba/pom.xml>
[JENKINS] Archiving disabled - not archiving <https://builds.apache.org/job/Tuscany-2x-deploy/ws/sca-2x/modules/binding-corba/target/tuscany-binding-corba-2.5-SNAPSHOT.jar>
[JENKINS] Archiving disabled - not archiving <https://builds.apache.org/job/Tuscany-2x-deploy/ws/sca-2x/modules/binding-corba/target/tuscany-binding-corba-2.5-SNAPSHOT-sources.jar>
[JENKINS] Archiving disabled - not archiving <https://builds.apache.org/job/Tuscany-2x-deploy/ws/sca-2x/modules/host-corba-jse-tns/pom.xml>
[JENKINS] Archiving disabled - not archiving <https://builds.apache.org/job/Tuscany-2x-deploy/ws/sca-2x/modules/host-corba-jse-tns/target/tuscany-host-corba-jse-tns-2.5-SNAPSHOT.jar>
[JENKINS] Archiving disabled - not archiving <https://builds.apache.org/job/Tuscany-2x-deploy/ws/sca-2x/modules/host-corba-jse-tns/target/tuscany-host-corba-jse-tns-2.5-SNAPSHOT-sources.jar>
[JENKINS] Archiving disabled - not archiving <https://builds.apache.org/job/Tuscany-2x-deploy/ws/sca-2x/modules/implementation-script/pom.xml>
[JENKINS] Archiving disabled - not archiving <https://builds.apache.org/job/Tuscany-2x-deploy/ws/sca-2x/modules/implementation-script/target/tuscany-implementation-script-2.5-SNAPSHOT.jar>
[JENKINS] Archiving disabled - not archiving <https://builds.apache.org/job/Tuscany-2x-deploy/ws/sca-2x/modules/implementation-script/target/tuscany-implementation-script-2.5-SNAPSHOT-sources.jar>
[JENKINS] Archiving disabled - not archiving <https://builds.apache.org/job/Tuscany-2x-deploy/ws/sca-2x/modules/binding-corba-runtime/pom.xml>
[JENKINS] Archiving disabled - not archiving <https://builds.apache.org/job/Tuscany-2x-deploy/ws/sca-2x/modules/binding-corba-runtime/target/tuscany-binding-corba-runtime-2.5-SNAPSHOT.jar>
[JENKINS] Archiving disabled - not archiving <https://builds.apache.org/job/Tuscany-2x-deploy/ws/sca-2x/modules/binding-corba-runtime/target/tuscany-binding-corba-runtime-2.5-SNAPSHOT-sources.jar>
[JENKINS] Archiving disabled - not archiving <https://builds.apache.org/job/Tuscany-2x-deploy/ws/sca-2x/modules/host-jetty/pom.xml>
[JENKINS] Archiving disabled - not archiving <https://builds.apache.org/job/Tuscany-2x-deploy/ws/sca-2x/modules/host-jetty/target/tuscany-host-jetty-2.5-SNAPSHOT.jar>
[JENKINS] Archiving disabled - not archiving <https://builds.apache.org/job/Tuscany-2x-deploy/ws/sca-2x/modules/host-jetty/target/tuscany-host-jetty-2.5-SNAPSHOT-sources.jar>
[JENKINS] Archiving disabled - not archiving <https://builds.apache.org/job/Tuscany-2x-deploy/ws/sca-2x/modules/databinding-sdo/pom.xml>
[JENKINS] Archiving disabled - not archiving <https://builds.apache.org/job/Tuscany-2x-deploy/ws/sca-2x/modules/databinding-sdo/target/tuscany-databinding-sdo-2.5-SNAPSHOT.jar>
[JENKINS] Archiving disabled - not archiving <https://builds.apache.org/job/Tuscany-2x-deploy/ws/sca-2x/modules/databinding-sdo/target/tuscany-databinding-sdo-2.5-SNAPSHOT-sources.jar>
[JENKINS] Archiving disabled - not archiving <https://builds.apache.org/job/Tuscany-2x-deploy/ws/sca-2x/modules/shell/pom.xml>
[JENKINS] Archiving disabled - not archiving <https://builds.apache.org/job/Tuscany-2x-deploy/ws/sca-2x/modules/shell/target/tuscany-shell-2.5-SNAPSHOT.jar>
[JENKINS] Archiving disabled - not archiving <https://builds.apache.org/job/Tuscany-2x-deploy/ws/sca-2x/modules/shell/target/tuscany-shell-2.5-SNAPSHOT-sources.jar>
[JENKINS] Archiving disabled - not archiving <https://builds.apache.org/job/Tuscany-2x-deploy/ws/sca-2x/modules/databinding-sdo-axiom/pom.xml>
[JENKINS] Archiving disabled - not archiving <https://builds.apache.org/job/Tuscany-2x-deploy/ws/sca-2x/modules/databinding-sdo-axiom/target/tuscany-databinding-sdo-axiom-2.5-SNAPSHOT.jar>
[JENKINS] Archiving disabled - not archiving <https://builds.apache.org/job/Tuscany-2x-deploy/ws/sca-2x/modules/databinding-sdo-axiom/target/tuscany-databinding-sdo-axiom-2.5-SNAPSHOT-sources.jar>
[JENKINS] Archiving disabled - not archiving <https://builds.apache.org/job/Tuscany-2x-deploy/ws/sca-2x/samples/learning-more/binding-websocket/chat-webapp/pom.xml>
[JENKINS] Archiving disabled - not archiving <https://builds.apache.org/job/Tuscany-2x-deploy/ws/sca-2x/samples/learning-more/binding-websocket/chat-webapp/target/sample-binding-websocket-chat-webapp-2.5-SNAPSHOT.war>
[JENKINS] Archiving disabled - not archiving <https://builds.apache.org/job/Tuscany-2x-deploy/ws/sca-2x/modules/implementation-jaxrs-runtime/pom.xml>
[JENKINS] Archiving disabled - not archiving <https://builds.apache.org/job/Tuscany-2x-deploy/ws/sca-2x/modules/implementation-jaxrs-runtime/target/tuscany-implementation-jaxrs-runtime-2.5-SNAPSHOT.jar>
[JENKINS] Archiving disabled - not archiving <https://builds.apache.org/job/Tuscany-2x-deploy/ws/sca-2x/modules/implementation-jaxrs-runtime/target/tuscany-implementation-jaxrs-runtime-2.5-SNAPSHOT-sources.jar>
[JENKINS] Archiving disabled - not archiving <https://builds.apache.org/job/Tuscany-2x-deploy/ws/sca-2x/maven/archetypes/quickstart/pom.xml>
[JENKINS] Archiving disabled - not archiving <https://builds.apache.org/job/Tuscany-2x-deploy/ws/sca-2x/maven/archetypes/quickstart/target/tuscany-quickstart-2.5-SNAPSHOT.jar>
[JENKINS] Archiving disabled - not archiving <https://builds.apache.org/job/Tuscany-2x-deploy/ws/sca-2x/samples/learning-more/pom.xml>
[JENKINS] Archiving disabled - not archiving <https://builds.apache.org/job/Tuscany-2x-deploy/ws/sca-2x/samples/learning-more/distributed-osgi-static/operations-bundle/pom.xml>
[JENKINS] Archiving disabled - not archiving <https://builds.apache.org/job/Tuscany-2x-deploy/ws/sca-2x/samples/learning-more/distributed-osgi-static/operations-bundle/target/sample-operations-bundle.jar>
[JENKINS] Archiving disabled - not archiving <https://builds.apache.org/job/Tuscany-2x-deploy/ws/sca-2x/maven/archetypes/quickstart-jsf/pom.xml>
[JENKINS] Archiving disabled - not archiving <https://builds.apache.org/job/Tuscany-2x-deploy/ws/sca-2x/maven/archetypes/quickstart-jsf/target/tuscany-quickstart-jsf-2.5-SNAPSHOT.jar>
[JENKINS] Archiving disabled - not archiving <https://builds.apache.org/job/Tuscany-2x-deploy/ws/sca-2x/modules/binding-ws-wsdlgen/pom.xml>
[JENKINS] Archiving disabled - not archiving <https://builds.apache.org/job/Tuscany-2x-deploy/ws/sca-2x/modules/binding-ws-wsdlgen/target/tuscany-binding-ws-wsdlgen-2.5-SNAPSHOT.jar>
[JENKINS] Archiving disabled - not archiving <https://builds.apache.org/job/Tuscany-2x-deploy/ws/sca-2x/modules/binding-ws-wsdlgen/target/tuscany-binding-ws-wsdlgen-2.5-SNAPSHOT-sources.jar>
[JENKINS] Archiving disabled - not archiving <https://builds.apache.org/job/Tuscany-2x-deploy/ws/sca-2x/samples/getting-started/helloworld-scaclient/pom.xml>
[JENKINS] Archiving disabled - not archiving <https://builds.apache.org/job/Tuscany-2x-deploy/ws/sca-2x/samples/getting-started/helloworld-scaclient/target/helloworld-scaclient-2.5-SNAPSHOT.jar>
[JENKINS] Archiving disabled - not archiving <https://builds.apache.org/job/Tuscany-2x-deploy/ws/sca-2x/modules/assembly-xsd/pom.xml>
[JENKINS] Archiving disabled - not archiving <https://builds.apache.org/job/Tuscany-2x-deploy/ws/sca-2x/modules/assembly-xsd/target/tuscany-assembly-xsd-2.5-SNAPSHOT.jar>
[JENKINS] Archiving disabled - not archiving <https://builds.apache.org/job/Tuscany-2x-deploy/ws/sca-2x/modules/assembly-xsd/target/tuscany-assembly-xsd-2.5-SNAPSHOT-sources.jar>
[JENKINS] Archiving disabled - not archiving <https://builds.apache.org/job/Tuscany-2x-deploy/ws/sca-2x/modules/binding-rest-runtime/pom.xml>
[JENKINS] Archiving disabled - not archiving <https://builds.apache.org/job/Tuscany-2x-deploy/ws/sca-2x/modules/binding-rest-runtime/target/tuscany-binding-rest-runtime-2.5-SNAPSHOT.jar>
[JENKINS] Archiving disabled - not archiving <https://builds.apache.org/job/Tuscany-2x-deploy/ws/sca-2x/modules/binding-rest-runtime/target/tuscany-binding-rest-runtime-2.5-SNAPSHOT-sources.jar>
[JENKINS] Archiving disabled - not archiving <https://builds.apache.org/job/Tuscany-2x-deploy/ws/sca-2x/modules/implementation-widget-runtime/pom.xml>
[JENKINS] Archiving disabled - not archiving <https://builds.apache.org/job/Tuscany-2x-deploy/ws/sca-2x/modules/implementation-widget-runtime/target/tuscany-implementation-widget-runtime-2.5-SNAPSHOT.jar>
[JENKINS] Archiving disabled - not archiving <https://builds.apache.org/job/Tuscany-2x-deploy/ws/sca-2x/modules/implementation-widget-runtime/target/tuscany-implementation-widget-runtime-2.5-SNAPSHOT-sources.jar>
[JENKINS] Archiving disabled - not archiving <https://builds.apache.org/job/Tuscany-2x-deploy/ws/sca-2x/modules/policy-transaction-runtime/pom.xml>
[JENKINS] Archiving disabled - not archiving <https://builds.apache.org/job/Tuscany-2x-deploy/ws/sca-2x/modules/policy-transaction-runtime/target/tuscany-policy-transaction-runtime-2.5-SNAPSHOT.jar>
[JENKINS] Archiving disabled - not archiving <https://builds.apache.org/job/Tuscany-2x-deploy/ws/sca-2x/modules/policy-transaction-runtime/target/tuscany-policy-transaction-runtime-2.5-SNAPSHOT-sources.jar>
[JENKINS] Archiving disabled - not archiving <https://builds.apache.org/job/Tuscany-2x-deploy/ws/sca-2x/modules/implementation-java-runtime/pom.xml>
[JENKINS] Archiving disabled - not archiving <https://builds.apache.org/job/Tuscany-2x-deploy/ws/sca-2x/modules/implementation-java-runtime/target/tuscany-implementation-java-runtime-2.5-SNAPSHOT.jar>
[JENKINS] Archiving disabled - not archiving <https://builds.apache.org/job/Tuscany-2x-deploy/ws/sca-2x/modules/implementation-java-runtime/target/tuscany-implementation-java-runtime-2.5-SNAPSHOT-sources.jar>
[JENKINS] Archiving disabled - not archiving <https://builds.apache.org/job/Tuscany-2x-deploy/ws/sca-2x/modules/core-spi/pom.xml>
[JENKINS] Archiving disabled - not archiving <https://builds.apache.org/job/Tuscany-2x-deploy/ws/sca-2x/modules/core-spi/target/tuscany-core-spi-2.5-SNAPSHOT.jar>
[JENKINS] Archiving disabled - not archiving <https://builds.apache.org/job/Tuscany-2x-deploy/ws/sca-2x/modules/core-spi/target/tuscany-core-spi-2.5-SNAPSHOT-sources.jar>
Waiting for Jenkins to finish collecting data
mavenExecutionResult exceptions not empty
message : Failed to execute goal on project tuscany-distribution-all: Could not resolve dependencies
for project org.apache.tuscany.sca:tuscany-distribution-all:pom:2.5-SNAPSHOT: The following
artifacts could not be resolved: org.apache.tuscany.sca.aggregation:tuscany-base-runtime-aggregation:jar:2.5-SNAPSHOT,
org.apache.tuscany.sca.aggregation:tuscany-binding-rmi-runtime-aggregation:jar:2.5-SNAPSHOT,
org.apache.tuscany.sca.aggregation:tuscany-binding-ws-runtime-axis2-aggregation:jar:2.5-SNAPSHOT:
Could not find artifact org.apache.tuscany.sca.aggregation:tuscany-base-runtime-aggregation:jar:2.5-SNAPSHOT
in java.net2 (http://download.java.net/maven/2)
cause : Could not resolve dependencies for project org.apache.tuscany.sca:tuscany-distribution-all:pom:2.5-SNAPSHOT:
The following artifacts could not be resolved: org.apache.tuscany.sca.aggregation:tuscany-base-runtime-aggregation:jar:2.5-SNAPSHOT,
org.apache.tuscany.sca.aggregation:tuscany-binding-rmi-runtime-aggregation:jar:2.5-SNAPSHOT,
org.apache.tuscany.sca.aggregation:tuscany-binding-ws-runtime-axis2-aggregation:jar:2.5-SNAPSHOT:
Could not find artifact org.apache.tuscany.sca.aggregation:tuscany-base-runtime-aggregation:jar:2.5-SNAPSHOT
in java.net2 (http://download.java.net/maven/2)
Stack trace : 
org.apache.maven.lifecycle.LifecycleExecutionException: Failed to execute goal on project
tuscany-distribution-all: Could not resolve dependencies for project org.apache.tuscany.sca:tuscany-distribution-all:pom:2.5-SNAPSHOT:
The following artifacts could not be resolved: org.apache.tuscany.sca.aggregation:tuscany-base-runtime-aggregation:jar:2.5-SNAPSHOT,
org.apache.tuscany.sca.aggregation:tuscany-binding-rmi-runtime-aggregation:jar:2.5-SNAPSHOT,
org.apache.tuscany.sca.aggregation:tuscany-binding-ws-runtime-axis2-aggregation:jar:2.5-SNAPSHOT:
Could not find artifact org.apache.tuscany.sca.aggregation:tuscany-base-runtime-aggregation:jar:2.5-SNAPSHOT
in java.net2 (http://download.java.net/maven/2)
	at org.apache.maven.lifecycle.internal.LifecycleDependencyResolver.getDependencies(LifecycleDependencyResolver.java:196)
	at org.apache.maven.lifecycle.internal.LifecycleDependencyResolver.resolveProjectDependencies(LifecycleDependencyResolver.java:108)
	at org.apache.maven.lifecycle.internal.MojoExecutor.ensureDependenciesAreResolved(MojoExecutor.java:258)
	at org.apache.maven.lifecycle.internal.MojoExecutor.execute(MojoExecutor.java:201)
	at org.apache.maven.lifecycle.internal.MojoExecutor.execute(MojoExecutor.java:153)
	at org.apache.maven.lifecycle.internal.MojoExecutor.execute(MojoExecutor.java:145)
	at org.apache.maven.lifecycle.internal.LifecycleModuleBuilder.buildProject(LifecycleModuleBuilder.java:84)
	at org.apache.maven.lifecycle.internal.LifecycleModuleBuilder.buildProject(LifecycleModuleBuilder.java:59)
	at org.apache.maven.lifecycle.internal.LifecycleStarter.singleThreadedBuild(LifecycleStarter.java:183)
	at org.apache.maven.lifecycle.internal.LifecycleStarter.execute(LifecycleStarter.java:161)
	at org.apache.maven.DefaultMaven.doExecute(DefaultMaven.java:319)
	at org.apache.maven.DefaultMaven.execute(DefaultMaven.java:156)
	at org.jvnet.hudson.maven3.launcher.Maven3Launcher.main(Maven3Launcher.java:79)
	at sun.reflect.NativeMethodAccessorImpl.invoke0(Native Method)
	at sun.reflect.NativeMethodAccessorImpl.invoke(NativeMethodAccessorImpl.java:39)
	at sun.reflect.DelegatingMethodAccessorImpl.invoke(DelegatingMethodAccessorImpl.java:25)
	at java.lang.reflect.Method.invoke(Method.java:597)
	at org.codehaus.plexus.classworlds.launcher.Launcher.launchStandard(Launcher.java:329)
	at org.codehaus.plexus.classworlds.launcher.Launcher.launch(Launcher.java:239)
	at org.jvnet.hudson.maven3.agent.Maven3Main.launch(Maven3Main.java:158)
	at hudson.maven.Maven3Builder.call(Maven3Builder.java:98)
	at hudson.maven.Maven3Builder.call(Maven3Builder.java:64)
	at hudson.remoting.UserRequest.perform(UserRequest.java:118)
	at hudson.remoting.UserRequest.perform(UserRequest.java:48)
	at hudson.remoting.Request$2.run(Request.java:326)
	at hudson.remoting.InterceptingExecutorService$1.call(InterceptingExecutorService.java:72)
	at java.util.concurrent.FutureTask$Sync.innerRun(FutureTask.java:303)
	at java.util.concurrent.FutureTask.run(FutureTask.java:138)
	at java.util.concurrent.ThreadPoolExecutor$Worker.runTask(ThreadPoolExecutor.java:886)
	at java.util.concurrent.ThreadPoolExecutor$Worker.run(ThreadPoolExecutor.java:908)
	at java.lang.Thread.run(Thread.java:662)
Caused by: org.apache.maven.project.DependencyResolutionException: Could not resolve dependencies
for project org.apache.tuscany.sca:tuscany-distribution-all:pom:2.5-SNAPSHOT: The following
artifacts could not be resolved: org.apache.tuscany.sca.aggregation:tuscany-base-runtime-aggregation:jar:2.5-SNAPSHOT,
org.apache.tuscany.sca.aggregation:tuscany-binding-rmi-runtime-aggregation:jar:2.5-SNAPSHOT,
org.apache.tuscany.sca.aggregation:tuscany-binding-ws-runtime-axis2-aggregation:jar:2.5-SNAPSHOT:
Could not find artifact org.apache.tuscany.sca.aggregation:tuscany-base-runtime-aggregation:jar:2.5-SNAPSHOT
in java.net2 (http://download.java.net/maven/2)
	at org.apache.maven.project.DefaultProjectDependenciesResolver.resolve(DefaultProjectDependenciesResolver.java:170)
	at org.apache.maven.lifecycle.internal.LifecycleDependencyResolver.getDependencies(LifecycleDependencyResolver.java:171)
	... 30 more
Caused by: org.sonatype.aether.resolution.DependencyResolutionException: The following artifacts
could not be resolved: org.apache.tuscany.sca.aggregation:tuscany-base-runtime-aggregation:jar:2.5-SNAPSHOT,
org.apache.tuscany.sca.aggregation:tuscany-binding-rmi-runtime-aggregation:jar:2.5-SNAPSHOT,
org.apache.tuscany.sca.aggregation:tuscany-binding-ws-runtime-axis2-aggregation:jar:2.5-SNAPSHOT:
Could not find artifact org.apache.tuscany.sca.aggregation:tuscany-base-runtime-aggregation:jar:2.5-SNAPSHOT
in java.net2 (http://download.java.net/maven/2)
	at org.sonatype.aether.impl.internal.DefaultRepositorySystem.resolveDependencies(DefaultRepositorySystem.java:412)
	at org.apache.maven.project.DefaultProjectDependenciesResolver.resolve(DefaultProjectDependenciesResolver.java:164)
	... 31 more
Caused by: org.sonatype.aether.resolution.ArtifactResolutionException: The following artifacts
could not be resolved: org.apache.tuscany.sca.aggregation:tuscany-base-runtime-aggregation:jar:2.5-SNAPSHOT,
org.apache.tuscany.sca.aggregation:tuscany-binding-rmi-runtime-aggregation:jar:2.5-SNAPSHOT,
org.apache.tuscany.sca.aggregation:tuscany-binding-ws-runtime-axis2-aggregation:jar:2.5-SNAPSHOT:
Could not find artifact org.apache.tuscany.sca.aggregation:tuscany-base-runtime-aggregation:jar:2.5-SNAPSHOT
in java.net2 (http://download.java.net/maven/2)
	at org.sonatype.aether.impl.internal.DefaultArtifactResolver.resolve(DefaultArtifactResolver.java:541)
	at org.sonatype.aether.impl.internal.DefaultArtifactResolver.resolveArtifacts(DefaultArtifactResolver.java:220)
	at org.sonatype.aether.impl.internal.DefaultRepositorySystem.resolveDependencies(DefaultRepositorySystem.java:395)
	... 32 more
Caused by: org.sonatype.aether.transfer.ArtifactNotFoundException: Could not find artifact
org.apache.tuscany.sca.aggregation:tuscany-base-runtime-aggregation:jar:2.5-SNAPSHOT in java.net2
(http://download.java.net/maven/2)
	at org.sonatype.aether.connector.wagon.WagonRepositoryConnector$4.wrap(WagonRepositoryConnector.java:945)
	at org.sonatype.aether.connector.wagon.WagonRepositoryConnector$4.wrap(WagonRepositoryConnector.java:940)
	at org.sonatype.aether.connector.wagon.WagonRepositoryConnector$GetTask.flush(WagonRepositoryConnector.java:695)
	at org.sonatype.aether.connector.wagon.WagonRepositoryConnector$GetTask.flush(WagonRepositoryConnector.java:689)
	at org.sonatype.aether.connector.wagon.WagonRepositoryConnector.get(WagonRepositoryConnector.java:445)
	at org.sonatype.aether.impl.internal.DefaultArtifactResolver.resolve(DefaultArtifactResolver.java:460)
	... 34 more
channel stopped
2012-08-22 01:27:52.313:INFO::Shutdown hook executing
2012-08-22 01:27:52.313:INFO::Shutdown hook complete

Mime
View raw message