tuscany-commits mailing list archives

Site index · List index
Message view « Date » · « Thread »
Top « Date » · « Thread »
From Apache Jenkins Server <jenk...@builds.apache.org>
Subject Build failed in Jenkins: Tuscany-2x-deploy #815
Date Sat, 02 Jun 2012 01:13:17 GMT
See <https://builds.apache.org/job/Tuscany-2x-deploy/815/>

------------------------------------------
[...truncated 3842 lines...]
[JENKINS] Archiving disabled - not archiving <https://builds.apache.org/job/Tuscany-2x-deploy/ws/sca-2x/maven/archetypes/pom.xml>
[JENKINS] Archiving disabled - not archiving <https://builds.apache.org/job/Tuscany-2x-deploy/ws/.repository/org/apache/tuscany/sca/tuscany-archetype/2.0-SNAPSHOT/tuscany-archetype-2.0-SNAPSHOT.pom>
[INFO] ------------------------------------------------------------------------
[INFO] Building Apache Tuscany SCA Web JavaScript
[INFO]    task-segment: [clean, deploy]
[INFO] ------------------------------------------------------------------------
[INFO] [clean:clean {execution: default-clean}]
[INFO] Deleting <https://builds.apache.org/job/Tuscany-2x-deploy/ws/sca-2x/modules/web-javascript/target>
[INFO] [enforcer:enforce {execution: enforce-plugin-versions}]
[INFO] [remote-resources:process {execution: default}]
[INFO] [resources:resources {execution: default-resources}]
[INFO] Using 'UTF-8' encoding to copy filtered resources.
[INFO] Copying 3 resources
[INFO] Copying 3 resources
[INFO] Copying 3 resources
[INFO] [compiler:compile {execution: default-compile}]
[INFO] Compiling 6 source files to <https://builds.apache.org/job/Tuscany-2x-deploy/ws/sca-2x/modules/web-javascript/target/classes>
[INFO] [resources:testResources {execution: default-testResources}]
[INFO] Using 'UTF-8' encoding to copy filtered resources.
[INFO] skip non existing resourceDirectory <https://builds.apache.org/job/Tuscany-2x-deploy/ws/sca-2x/modules/web-javascript/src/test/resources>
[INFO] Copying 3 resources
[INFO] [compiler:testCompile {execution: default-testCompile}]
[INFO] No sources to compile
[INFO] [surefire:test {execution: default-test}]
[INFO] Tests are skipped.
[INFO] [jar:jar {execution: default-jar}]
[INFO] Building jar: <https://builds.apache.org/job/Tuscany-2x-deploy/ws/sca-2x/modules/web-javascript/target/tuscany-web-javascript-2.0-SNAPSHOT.jar>
[INFO] [source:jar-no-fork {execution: attach-sources}]
[INFO] Building jar: <https://builds.apache.org/job/Tuscany-2x-deploy/ws/sca-2x/modules/web-javascript/target/tuscany-web-javascript-2.0-SNAPSHOT-sources.jar>
[INFO] [install:install {execution: default-install}]
[INFO] Installing <https://builds.apache.org/job/Tuscany-2x-deploy/ws/sca-2x/modules/web-javascript/target/tuscany-web-javascript-2.0-SNAPSHOT.jar>
to <https://builds.apache.org/job/Tuscany-2x-deploy/ws/.repository/org/apache/tuscany/sca/tuscany-web-javascript/2.0-SNAPSHOT/tuscany-web-javascript-2.0-SNAPSHOT.jar>
[INFO] Installing <https://builds.apache.org/job/Tuscany-2x-deploy/ws/sca-2x/modules/web-javascript/target/tuscany-web-javascript-2.0-SNAPSHOT-sources.jar>
to <https://builds.apache.org/job/Tuscany-2x-deploy/ws/.repository/org/apache/tuscany/sca/tuscany-web-javascript/2.0-SNAPSHOT/tuscany-web-javascript-2.0-SNAPSHOT-sources.jar>
[INFO] [deploy:deploy {execution: default-deploy}]
[INFO] Retrieving previous build number from apache.snapshots.https
[WARNING] *** CHECKSUM FAILED - Checksum failed on download: local = '176211744f44baccf6ebe8a78b0a4d2061dd7c6a';
remote = '8c73dccc5128f291e2630a2c040bc7385245d16f' - RETRYING
[WARNING] *** CHECKSUM FAILED - Checksum failed on download: local = '176211744f44baccf6ebe8a78b0a4d2061dd7c6a';
remote = '8c73dccc5128f291e2630a2c040bc7385245d16f' - IGNORING
Uploading: https://repository.apache.org/content/repositories/snapshots/org/apache/tuscany/sca/tuscany-web-javascript/2.0-SNAPSHOT/tuscany-web-javascript-2.0-SNAPSHOT.jar
22K uploaded  (tuscany-web-javascript-2.0-SNAPSHOT.jar)
[INFO] Retrieving previous metadata from apache.snapshots.https
[WARNING] *** CHECKSUM FAILED - Checksum failed on download: local = '176211744f44baccf6ebe8a78b0a4d2061dd7c6a';
remote = '8c73dccc5128f291e2630a2c040bc7385245d16f' - RETRYING
[WARNING] *** CHECKSUM FAILED - Checksum failed on download: local = '176211744f44baccf6ebe8a78b0a4d2061dd7c6a';
remote = '8c73dccc5128f291e2630a2c040bc7385245d16f' - IGNORING
[INFO] Uploading repository metadata for: 'snapshot org.apache.tuscany.sca:tuscany-web-javascript:2.0-SNAPSHOT'
[INFO] Uploading project information for tuscany-web-javascript 2.0-SNAPSHOT
[INFO] Retrieving previous metadata from apache.snapshots.https
[INFO] Uploading repository metadata for: 'artifact org.apache.tuscany.sca:tuscany-web-javascript'
[INFO] Retrieving previous build number from apache.snapshots.https
Uploading: https://repository.apache.org/content/repositories/snapshots/org/apache/tuscany/sca/tuscany-web-javascript/2.0-SNAPSHOT/tuscany-web-javascript-2.0-SNAPSHOT-sources.jar
21K uploaded  (tuscany-web-javascript-2.0-SNAPSHOT-sources.jar)
[JENKINS] Archiving disabled - not archiving <https://builds.apache.org/job/Tuscany-2x-deploy/ws/sca-2x/modules/web-javascript/pom.xml>
[JENKINS] Archiving disabled - not archiving <https://builds.apache.org/job/Tuscany-2x-deploy/ws/sca-2x/modules/web-javascript/target/tuscany-web-javascript-2.0-SNAPSHOT.jar>
[JENKINS] Archiving disabled - not archiving <https://builds.apache.org/job/Tuscany-2x-deploy/ws/sca-2x/modules/web-javascript/target/tuscany-web-javascript-2.0-SNAPSHOT-sources.jar>
[INFO] ------------------------------------------------------------------------
[INFO] Building Apache Tuscany SCA Abdera Atom Feed Binding Extension
[INFO]    task-segment: [clean, deploy]
[INFO] ------------------------------------------------------------------------
[INFO] [clean:clean {execution: default-clean}]
[INFO] Deleting <https://builds.apache.org/job/Tuscany-2x-deploy/ws/sca-2x/modules/binding-atom-runtime/target>
[INFO] [enforcer:enforce {execution: enforce-plugin-versions}]
[INFO] [remote-resources:process {execution: default}]
[INFO] [resources:resources {execution: default-resources}]
[INFO] Using 'UTF-8' encoding to copy filtered resources.
[INFO] Copying 2 resources
[INFO] Copying 3 resources
[INFO] Copying 3 resources
[INFO] [compiler:compile {execution: default-compile}]
[INFO] Compiling 11 source files to <https://builds.apache.org/job/Tuscany-2x-deploy/ws/sca-2x/modules/binding-atom-runtime/target/classes>
[INFO] [resources:testResources {execution: default-testResources}]
[INFO] Using 'UTF-8' encoding to copy filtered resources.
[INFO] Copying 8 resources
[INFO] Copying 3 resources
[INFO] [compiler:testCompile {execution: default-testCompile}]
[INFO] Compiling 29 source files to <https://builds.apache.org/job/Tuscany-2x-deploy/ws/sca-2x/modules/binding-atom-runtime/target/test-classes>
[INFO] [surefire:test {execution: default-test}]
[INFO] Tests are skipped.
[INFO] [jar:jar {execution: default-jar}]
[INFO] Building jar: <https://builds.apache.org/job/Tuscany-2x-deploy/ws/sca-2x/modules/binding-atom-runtime/target/tuscany-binding-atom-runtime-2.0-SNAPSHOT.jar>
[INFO] [source:jar-no-fork {execution: attach-sources}]
[INFO] Building jar: <https://builds.apache.org/job/Tuscany-2x-deploy/ws/sca-2x/modules/binding-atom-runtime/target/tuscany-binding-atom-runtime-2.0-SNAPSHOT-sources.jar>
[INFO] [install:install {execution: default-install}]
[INFO] Installing <https://builds.apache.org/job/Tuscany-2x-deploy/ws/sca-2x/modules/binding-atom-runtime/target/tuscany-binding-atom-runtime-2.0-SNAPSHOT.jar>
to <https://builds.apache.org/job/Tuscany-2x-deploy/ws/.repository/org/apache/tuscany/sca/tuscany-binding-atom-runtime/2.0-SNAPSHOT/tuscany-binding-atom-runtime-2.0-SNAPSHOT.jar>
[INFO] Installing <https://builds.apache.org/job/Tuscany-2x-deploy/ws/sca-2x/modules/binding-atom-runtime/target/tuscany-binding-atom-runtime-2.0-SNAPSHOT-sources.jar>
to <https://builds.apache.org/job/Tuscany-2x-deploy/ws/.repository/org/apache/tuscany/sca/tuscany-binding-atom-runtime/2.0-SNAPSHOT/tuscany-binding-atom-runtime-2.0-SNAPSHOT-sources.jar>
[INFO] [deploy:deploy {execution: default-deploy}]
[INFO] Retrieving previous build number from apache.snapshots.https
[WARNING] *** CHECKSUM FAILED - Checksum failed on download: local = '79ece748349c289c2a86b04eb044e9484a781a98';
remote = 'd025b52868c5c437b6f01660fd71967214a6afb0' - RETRYING
[WARNING] *** CHECKSUM FAILED - Checksum failed on download: local = '79ece748349c289c2a86b04eb044e9484a781a98';
remote = 'd025b52868c5c437b6f01660fd71967214a6afb0' - IGNORING
Uploading: https://repository.apache.org/content/repositories/snapshots/org/apache/tuscany/sca/tuscany-binding-atom-runtime/2.0-SNAPSHOT/tuscany-binding-atom-runtime-2.0-SNAPSHOT.jar
54K uploaded  (tuscany-binding-atom-runtime-2.0-SNAPSHOT.jar)
[INFO] Uploading project information for tuscany-binding-atom-runtime 2.0-SNAPSHOT
[INFO] Retrieving previous metadata from apache.snapshots.https
[WARNING] *** CHECKSUM FAILED - Checksum failed on download: local = '79ece748349c289c2a86b04eb044e9484a781a98';
remote = 'd025b52868c5c437b6f01660fd71967214a6afb0' - RETRYING
[WARNING] *** CHECKSUM FAILED - Checksum failed on download: local = '79ece748349c289c2a86b04eb044e9484a781a98';
remote = 'd025b52868c5c437b6f01660fd71967214a6afb0' - IGNORING
[INFO] Uploading repository metadata for: 'snapshot org.apache.tuscany.sca:tuscany-binding-atom-runtime:2.0-SNAPSHOT'
[INFO] Retrieving previous metadata from apache.snapshots.https
[INFO] Uploading repository metadata for: 'artifact org.apache.tuscany.sca:tuscany-binding-atom-runtime'
[INFO] Retrieving previous build number from apache.snapshots.https
Uploading: https://repository.apache.org/content/repositories/snapshots/org/apache/tuscany/sca/tuscany-binding-atom-runtime/2.0-SNAPSHOT/tuscany-binding-atom-runtime-2.0-SNAPSHOT-sources.jar
35K uploaded  (tuscany-binding-atom-runtime-2.0-SNAPSHOT-sources.jar)
[JENKINS] Archiving disabled - not archiving <https://builds.apache.org/job/Tuscany-2x-deploy/ws/sca-2x/modules/binding-atom-runtime/pom.xml>
[JENKINS] Archiving disabled - not archiving <https://builds.apache.org/job/Tuscany-2x-deploy/ws/sca-2x/modules/binding-atom-runtime/target/tuscany-binding-atom-runtime-2.0-SNAPSHOT.jar>
[JENKINS] Archiving disabled - not archiving <https://builds.apache.org/job/Tuscany-2x-deploy/ws/sca-2x/modules/binding-atom-runtime/target/tuscany-binding-atom-runtime-2.0-SNAPSHOT-sources.jar>
[INFO] ------------------------------------------------------------------------
[INFO] Building Apache Tuscany SCA JAX-RS Implementation Model
[INFO]    task-segment: [clean, deploy]
[INFO] ------------------------------------------------------------------------
[INFO] [clean:clean {execution: default-clean}]
[INFO] Deleting <https://builds.apache.org/job/Tuscany-2x-deploy/ws/sca-2x/modules/implementation-jaxrs/target>
[INFO] [enforcer:enforce {execution: enforce-plugin-versions}]
[INFO] [remote-resources:process {execution: default}]
[INFO] [resources:resources {execution: default-resources}]
[INFO] Using 'UTF-8' encoding to copy filtered resources.
[INFO] Copying 4 resources
[INFO] Copying 3 resources
[INFO] Copying 3 resources
[INFO] [compiler:compile {execution: default-compile}]
[INFO] Compiling 5 source files to <https://builds.apache.org/job/Tuscany-2x-deploy/ws/sca-2x/modules/implementation-jaxrs/target/classes>
[INFO] [resources:testResources {execution: default-testResources}]
[INFO] Using 'UTF-8' encoding to copy filtered resources.
[INFO] Copying 1 resource
[INFO] Copying 3 resources
[INFO] [compiler:testCompile {execution: default-testCompile}]
[INFO] Compiling 2 source files to <https://builds.apache.org/job/Tuscany-2x-deploy/ws/sca-2x/modules/implementation-jaxrs/target/test-classes>
[INFO] [surefire:test {execution: default-test}]
[INFO] Tests are skipped.
[INFO] [jar:jar {execution: default-jar}]
[INFO] Building jar: <https://builds.apache.org/job/Tuscany-2x-deploy/ws/sca-2x/modules/implementation-jaxrs/target/tuscany-implementation-jaxrs-2.0-SNAPSHOT.jar>
[INFO] [source:jar-no-fork {execution: attach-sources}]
[INFO] Building jar: <https://builds.apache.org/job/Tuscany-2x-deploy/ws/sca-2x/modules/implementation-jaxrs/target/tuscany-implementation-jaxrs-2.0-SNAPSHOT-sources.jar>
[INFO] [install:install {execution: default-install}]
[INFO] Installing <https://builds.apache.org/job/Tuscany-2x-deploy/ws/sca-2x/modules/implementation-jaxrs/target/tuscany-implementation-jaxrs-2.0-SNAPSHOT.jar>
to <https://builds.apache.org/job/Tuscany-2x-deploy/ws/.repository/org/apache/tuscany/sca/tuscany-implementation-jaxrs/2.0-SNAPSHOT/tuscany-implementation-jaxrs-2.0-SNAPSHOT.jar>
[INFO] Installing <https://builds.apache.org/job/Tuscany-2x-deploy/ws/sca-2x/modules/implementation-jaxrs/target/tuscany-implementation-jaxrs-2.0-SNAPSHOT-sources.jar>
to <https://builds.apache.org/job/Tuscany-2x-deploy/ws/.repository/org/apache/tuscany/sca/tuscany-implementation-jaxrs/2.0-SNAPSHOT/tuscany-implementation-jaxrs-2.0-SNAPSHOT-sources.jar>
[INFO] [deploy:deploy {execution: default-deploy}]
[INFO] Retrieving previous build number from apache.snapshots.https
[WARNING] *** CHECKSUM FAILED - Checksum failed on download: local = '7908e302bddbd046cef3743e2f1fb05a11cd254a';
remote = '555cd105665732aea8a96bb6de248779d5b3f396' - RETRYING
[WARNING] *** CHECKSUM FAILED - Checksum failed on download: local = '7908e302bddbd046cef3743e2f1fb05a11cd254a';
remote = '555cd105665732aea8a96bb6de248779d5b3f396' - IGNORING
Uploading: https://repository.apache.org/content/repositories/snapshots/org/apache/tuscany/sca/tuscany-implementation-jaxrs/2.0-SNAPSHOT/tuscany-implementation-jaxrs-2.0-SNAPSHOT.jar
22K uploaded  (tuscany-implementation-jaxrs-2.0-SNAPSHOT.jar)
[INFO] Uploading project information for tuscany-implementation-jaxrs 2.0-SNAPSHOT
[INFO] Retrieving previous metadata from apache.snapshots.https
[WARNING] *** CHECKSUM FAILED - Checksum failed on download: local = '7908e302bddbd046cef3743e2f1fb05a11cd254a';
remote = '555cd105665732aea8a96bb6de248779d5b3f396' - RETRYING
[WARNING] *** CHECKSUM FAILED - Checksum failed on download: local = '7908e302bddbd046cef3743e2f1fb05a11cd254a';
remote = '555cd105665732aea8a96bb6de248779d5b3f396' - IGNORING
[INFO] Uploading repository metadata for: 'snapshot org.apache.tuscany.sca:tuscany-implementation-jaxrs:2.0-SNAPSHOT'
[INFO] Retrieving previous metadata from apache.snapshots.https
[INFO] Uploading repository metadata for: 'artifact org.apache.tuscany.sca:tuscany-implementation-jaxrs'
[INFO] Retrieving previous build number from apache.snapshots.https
Uploading: https://repository.apache.org/content/repositories/snapshots/org/apache/tuscany/sca/tuscany-implementation-jaxrs/2.0-SNAPSHOT/tuscany-implementation-jaxrs-2.0-SNAPSHOT-sources.jar
19K uploaded  (tuscany-implementation-jaxrs-2.0-SNAPSHOT-sources.jar)
[JENKINS] Archiving disabled - not archiving <https://builds.apache.org/job/Tuscany-2x-deploy/ws/sca-2x/modules/implementation-jaxrs/pom.xml>
[JENKINS] Archiving disabled - not archiving <https://builds.apache.org/job/Tuscany-2x-deploy/ws/sca-2x/modules/implementation-jaxrs/target/tuscany-implementation-jaxrs-2.0-SNAPSHOT.jar>
[JENKINS] Archiving disabled - not archiving <https://builds.apache.org/job/Tuscany-2x-deploy/ws/sca-2x/modules/implementation-jaxrs/target/tuscany-implementation-jaxrs-2.0-SNAPSHOT-sources.jar>
[INFO] ------------------------------------------------------------------------
[INFO] Building Apache Tuscany SCA Python Implementation Model
[INFO]    task-segment: [clean, deploy]
[INFO] ------------------------------------------------------------------------
[INFO] [clean:clean {execution: default-clean}]
[INFO] Deleting <https://builds.apache.org/job/Tuscany-2x-deploy/ws/sca-2x/modules/implementation-python/target>
[INFO] [enforcer:enforce {execution: enforce-plugin-versions}]
[INFO] [remote-resources:process {execution: default}]
[INFO] [resources:resources {execution: default-resources}]
[INFO] Using 'UTF-8' encoding to copy filtered resources.
[INFO] Copying 3 resources
[INFO] Copying 3 resources
[INFO] Copying 3 resources
[INFO] [compiler:compile {execution: default-compile}]
[INFO] Compiling 4 source files to <https://builds.apache.org/job/Tuscany-2x-deploy/ws/sca-2x/modules/implementation-python/target/classes>
[INFO] [resources:testResources {execution: default-testResources}]
[INFO] Using 'UTF-8' encoding to copy filtered resources.
[INFO] Copying 1 resource
[INFO] Copying 3 resources
[INFO] [compiler:testCompile {execution: default-testCompile}]
[INFO] Compiling 1 source file to <https://builds.apache.org/job/Tuscany-2x-deploy/ws/sca-2x/modules/implementation-python/target/test-classes>
[INFO] [surefire:test {execution: default-test}]
[INFO] Tests are skipped.
[INFO] [jar:jar {execution: default-jar}]
[INFO] Building jar: <https://builds.apache.org/job/Tuscany-2x-deploy/ws/sca-2x/modules/implementation-python/target/tuscany-implementation-python-2.0-SNAPSHOT.jar>
[INFO] [source:jar-no-fork {execution: attach-sources}]
[INFO] Building jar: <https://builds.apache.org/job/Tuscany-2x-deploy/ws/sca-2x/modules/implementation-python/target/tuscany-implementation-python-2.0-SNAPSHOT-sources.jar>
[INFO] [install:install {execution: default-install}]
[INFO] Installing <https://builds.apache.org/job/Tuscany-2x-deploy/ws/sca-2x/modules/implementation-python/target/tuscany-implementation-python-2.0-SNAPSHOT.jar>
to <https://builds.apache.org/job/Tuscany-2x-deploy/ws/.repository/org/apache/tuscany/sca/tuscany-implementation-python/2.0-SNAPSHOT/tuscany-implementation-python-2.0-SNAPSHOT.jar>
[INFO] Installing <https://builds.apache.org/job/Tuscany-2x-deploy/ws/sca-2x/modules/implementation-python/target/tuscany-implementation-python-2.0-SNAPSHOT-sources.jar>
to <https://builds.apache.org/job/Tuscany-2x-deploy/ws/.repository/org/apache/tuscany/sca/tuscany-implementation-python/2.0-SNAPSHOT/tuscany-implementation-python-2.0-SNAPSHOT-sources.jar>
[INFO] [deploy:deploy {execution: default-deploy}]
[INFO] Retrieving previous build number from apache.snapshots.https
[WARNING] *** CHECKSUM FAILED - Checksum failed on download: local = 'ed180d98e26f313963b93f76c79f7007e5866089';
remote = 'a6453b572490ddc4b3e3cf4035ed1235b728998f' - RETRYING
[WARNING] *** CHECKSUM FAILED - Checksum failed on download: local = 'ed180d98e26f313963b93f76c79f7007e5866089';
remote = 'a6453b572490ddc4b3e3cf4035ed1235b728998f' - IGNORING
Uploading: https://repository.apache.org/content/repositories/snapshots/org/apache/tuscany/sca/tuscany-implementation-python/2.0-SNAPSHOT/tuscany-implementation-python-2.0-SNAPSHOT.jar
22K uploaded  (tuscany-implementation-python-2.0-SNAPSHOT.jar)
[INFO] Retrieving previous metadata from apache.snapshots.https
[WARNING] *** CHECKSUM FAILED - Checksum failed on download: local = 'ed180d98e26f313963b93f76c79f7007e5866089';
remote = 'a6453b572490ddc4b3e3cf4035ed1235b728998f' - RETRYING
[WARNING] *** CHECKSUM FAILED - Checksum failed on download: local = 'ed180d98e26f313963b93f76c79f7007e5866089';
remote = 'a6453b572490ddc4b3e3cf4035ed1235b728998f' - IGNORING
[INFO] Uploading repository metadata for: 'snapshot org.apache.tuscany.sca:tuscany-implementation-python:2.0-SNAPSHOT'
[INFO] Uploading project information for tuscany-implementation-python 2.0-SNAPSHOT
[INFO] Retrieving previous metadata from apache.snapshots.https
[INFO] Uploading repository metadata for: 'artifact org.apache.tuscany.sca:tuscany-implementation-python'
[INFO] Retrieving previous build number from apache.snapshots.https
Uploading: https://repository.apache.org/content/repositories/snapshots/org/apache/tuscany/sca/tuscany-implementation-python/2.0-SNAPSHOT/tuscany-implementation-python-2.0-SNAPSHOT-sources.jar
17K uploaded  (tuscany-implementation-python-2.0-SNAPSHOT-sources.jar)
[JENKINS] Archiving disabled - not archiving <https://builds.apache.org/job/Tuscany-2x-deploy/ws/sca-2x/modules/implementation-python/pom.xml>
[JENKINS] Archiving disabled - not archiving <https://builds.apache.org/job/Tuscany-2x-deploy/ws/sca-2x/modules/implementation-python/target/tuscany-implementation-python-2.0-SNAPSHOT.jar>
[JENKINS] Archiving disabled - not archiving <https://builds.apache.org/job/Tuscany-2x-deploy/ws/sca-2x/modules/implementation-python/target/tuscany-implementation-python-2.0-SNAPSHOT-sources.jar>
[INFO] ------------------------------------------------------------------------
[INFO] Building Apache Tuscany SCA Base Runtime POM
[INFO]    task-segment: [clean, deploy]
[INFO] ------------------------------------------------------------------------
[INFO] [clean:clean {execution: default-clean}]
[INFO] Deleting <https://builds.apache.org/job/Tuscany-2x-deploy/ws/sca-2x/modules/base-runtime-pom/target>
[INFO] [enforcer:enforce {execution: enforce-plugin-versions}]
[INFO] [remote-resources:process {execution: default}]
[INFO] [site:attach-descriptor {execution: default-attach-descriptor}]
[INFO] [source:jar-no-fork {execution: attach-sources}]
[INFO] [install:install {execution: default-install}]
[INFO] Installing <https://builds.apache.org/job/Tuscany-2x-deploy/ws/sca-2x/modules/base-runtime-pom/pom.xml>
to <https://builds.apache.org/job/Tuscany-2x-deploy/ws/.repository/org/apache/tuscany/sca/tuscany-base-runtime-pom/2.0-SNAPSHOT/tuscany-base-runtime-pom-2.0-SNAPSHOT.pom>
[INFO] [deploy:deploy {execution: default-deploy}]
[INFO] Retrieving previous build number from apache.snapshots.https
[WARNING] *** CHECKSUM FAILED - Checksum failed on download: local = 'dec4df60b06547194eebc6ea5ab06715a1b980c9';
remote = '0e16c589b477597e86bcaee55c8a753bee30e584' - RETRYING
[WARNING] *** CHECKSUM FAILED - Checksum failed on download: local = 'dec4df60b06547194eebc6ea5ab06715a1b980c9';
remote = '0e16c589b477597e86bcaee55c8a753bee30e584' - IGNORING
Uploading: https://repository.apache.org/content/repositories/snapshots/org/apache/tuscany/sca/tuscany-base-runtime-pom/2.0-SNAPSHOT/tuscany-base-runtime-pom-2.0-SNAPSHOT.pom
8K uploaded  (tuscany-base-runtime-pom-2.0-SNAPSHOT.pom)
[INFO] Retrieving previous metadata from apache.snapshots.https
[INFO] Uploading repository metadata for: 'artifact org.apache.tuscany.sca:tuscany-base-runtime-pom'
[INFO] Retrieving previous metadata from apache.snapshots.https
[WARNING] *** CHECKSUM FAILED - Checksum failed on download: local = 'dec4df60b06547194eebc6ea5ab06715a1b980c9';
remote = '0e16c589b477597e86bcaee55c8a753bee30e584' - RETRYING
[WARNING] *** CHECKSUM FAILED - Checksum failed on download: local = 'dec4df60b06547194eebc6ea5ab06715a1b980c9';
remote = '0e16c589b477597e86bcaee55c8a753bee30e584' - IGNORING
[INFO] Uploading repository metadata for: 'snapshot org.apache.tuscany.sca:tuscany-base-runtime-pom:2.0-SNAPSHOT'
[JENKINS] Archiving disabled - not archiving <https://builds.apache.org/job/Tuscany-2x-deploy/ws/sca-2x/modules/base-runtime-pom/pom.xml>
[JENKINS] Archiving disabled - not archiving <https://builds.apache.org/job/Tuscany-2x-deploy/ws/.repository/org/apache/tuscany/sca/tuscany-base-runtime-pom/2.0-SNAPSHOT/tuscany-base-runtime-pom-2.0-SNAPSHOT.pom>
[INFO] ------------------------------------------------------------------------
[INFO] Building Apache Tuscany SCA Comet Binding Runtime
[INFO]    task-segment: [clean, deploy]
[INFO] ------------------------------------------------------------------------
[INFO] [clean:clean {execution: default-clean}]
[JENKINS] Archiving disabled - not archiving <https://builds.apache.org/job/Tuscany-2x-deploy/ws/sca-2x/modules/binding-comet-runtime/pom.xml>
[INFO] ------------------------------------------------------------------------
[ERROR] BUILD ERROR
[INFO] ------------------------------------------------------------------------
[INFO] Error building POM (may not be this project's POM).


Project ID: null:jersey-server:bundle:null

Reason: Cannot find parent: com.sun.jersey:jersey-project for project: null:jersey-server:bundle:null
for project null:jersey-server:bundle:null


[INFO] ------------------------------------------------------------------------
[INFO] For more information, run Maven with the -e switch
[INFO] ------------------------------------------------------------------------
[INFO] Total time: 34 minutes 19 seconds
[INFO] Finished at: Sat Jun 02 01:13:05 GMT+00:00 2012
[INFO] Final Memory: 171M/700M
[INFO] ------------------------------------------------------------------------
channel stopped

Mime
View raw message