tuscany-commits mailing list archives

Site index · List index
Message view « Date » · « Thread »
Top « Date » · « Thread »
From Apache Jenkins Server <jenk...@builds.apache.org>
Subject Build failed in Jenkins: Tuscany-2x-deploy #604
Date Fri, 30 Dec 2011 00:26:03 GMT
See <https://builds.apache.org/job/Tuscany-2x-deploy/604/>

------------------------------------------
[...truncated 9183 lines...]
[INFO] --- maven-enforcer-plugin:1.0:enforce (enforce-plugin-versions) @ helloworld-webapp
---
[INFO] 
[INFO] --- maven-remote-resources-plugin:1.1:process (default) @ helloworld-webapp ---
[INFO] [INFO] Using 'UTF-8' encoding to copy filtered resources.
[INFO] skip non existing resourceDirectory <https://builds.apache.org/job/Tuscany-2x-deploy/ws/sca-2x/samples/getting-started/helloworld-webapp/src/main/resources>
[INFO] Copying 1 resource
[INFO] Copying 3 resources
[INFO] Copying 3 resources

[INFO] --- maven-resources-plugin:2.4.2:resources (default-resources) @ helloworld-webapp
---
[INFO] [INFO] Nothing to compile - all classes are up to date

[INFO] --- maven-compiler-plugin:2.2:compile (default-compile) @ helloworld-webapp ---
[INFO] [INFO] Configured Artifact: org.apache.tuscany.sca.samples:helloworld:2.0-SNAPSHOT:jar
[INFO] org.apache.tuscany.sca.samples:helloworld:2.0-SNAPSHOT:jar already exists in <https://builds.apache.org/job/Tuscany-2x-deploy/ws/sca-2x/samples/getting-started/helloworld-webapp/src/main/webapp/WEB-INF/sca-contributions>

[INFO] --- maven-dependency-plugin:2.1:copy (copy) @ helloworld-webapp ---
[INFO] [INFO] Using 'UTF-8' encoding to copy filtered resources.
[INFO] Copying 1 resource
[INFO] Copying 3 resources
[INFO] Copying 3 resources

[INFO] --- maven-resources-plugin:2.4.2:testResources (default-testResources) @ helloworld-webapp
---
[INFO] [INFO] Nothing to compile - all classes are up to date

[INFO] --- maven-compiler-plugin:2.2:testCompile (default-testCompile) @ helloworld-webapp
---
[JENKINS] Archiving disabled - not archiving <https://builds.apache.org/job/Tuscany-2x-deploy/ws/sca-2x/samples/getting-started/helloworld-webapp/pom.xml>
[JENKINS] Archiving disabled - not archiving <https://builds.apache.org/job/Tuscany-2x-deploy/ws/sca-2x/samples/getting-started/helloworld-webapp/pom.xml>
[INFO] ------------------------------------------------------------------------
[INFO] Reactor Summary:
[INFO] 
[INFO] Apache Tuscany SCA Implementation Project (2.x) ... SUCCESS [36.371s]
[INFO] Apache Tuscany SCA Implementation Modules ......... SUCCESS [6.322s]
[INFO] Apache Tuscany SCA Monitor ........................ SUCCESS [5.369s]
[INFO] Apache Tuscany SCA Extensibility .................. SUCCESS [5.455s]
[INFO] Apache Tuscany SCA Assembly Model ................. SUCCESS [6.070s]
[INFO] Apache Tuscany SCA Assembly Model XSD Files ....... SUCCESS [4.667s]
[INFO] Apache Tuscany SCA Common XML ..................... SUCCESS [5.978s]
[INFO] Apache Tuscany SCA API ............................ SUCCESS [4.387s]
[INFO] Apache Tuscany SCA Common Java .................... SUCCESS [5.603s]
[INFO] Apache Tuscany SCA Contribution Model ............. SUCCESS [5.851s]
[INFO] Apache Tuscany SCA Node API ....................... SUCCESS [4.451s]
[INFO] Apache Tuscany SCA Core SPI ....................... SUCCESS [9.484s]
[INFO] Apache Tuscany SCA XSD Model ...................... SUCCESS [4.966s]
[INFO] Apache Tuscany SCA Assembly XML Model ............. SUCCESS [11.106s]
[INFO] Apache Tuscany SCA WSDL Interface Model ........... SUCCESS [5.100s]
[INFO] Apache Tuscany SCA Interface Java Model ........... SUCCESS [5.362s]
[INFO] Apache Tuscany SCA Core Runtime ................... SUCCESS [6.752s]
[INFO] Apache Tuscany SCA DataBinding Framework .......... SUCCESS [5.785s]
[INFO] Apache Tuscany SCA DataBinding for JAXB ........... SUCCESS [8.019s]
[INFO] Apache Tuscany SCA Model Builders ................. SUCCESS [8.198s]
[INFO] Apache Tuscany SCA Deployment ..................... SUCCESS [6.730s]
[INFO] Apache Tuscany SCA WS Binding Model ............... SUCCESS [4.736s]
[INFO] Apache Tuscany SCA Interface Java For JAXWS ....... SUCCESS [10.372s]
[INFO] Apache Tuscany SCA Core/DataBinding Integration ... SUCCESS [4.514s]
[INFO] Apache Tuscany SCA Web Service binding WSDL Generator  SUCCESS [8.139s]
[INFO] Apache Tuscany SCA Binding SCA Runtime ............ SUCCESS [5.728s]
[INFO] Apache Tuscany SCA Implementation Java Model ...... SUCCESS [6.182s]
[INFO] Apache Tuscany SCA Implementation Java Runtime .... SUCCESS [6.086s]
[INFO] Apache Tuscany SCA Node Implementation ............ SUCCESS [5.939s]
[INFO] Apache Tuscany SCA Data API ....................... SUCCESS [4.422s]
[INFO] Apache Tuscany SCA Domain Node .................... SUCCESS [6.539s]
[INFO] Apache Tuscany SCA Web Implementation Model ....... SUCCESS [5.542s]
[INFO] Apache Tuscany SCA HTTP Servlet Host Extension Point  SUCCESS [7.430s]
[INFO] Apache Tuscany SCA Webapp Host .................... SUCCESS [4.547s]
[INFO] Apache Tuscany SCA Web Implementation Runtime ..... SUCCESS [6.555s]
[INFO] Apache Tuscany SCA Launcher ....................... SUCCESS [5.076s]
[INFO] Apache Tuscany SCA Client Impl .................... SUCCESS [4.552s]
[INFO] Apache Tuscany SCA Jetty Servlet Host Extension ... SUCCESS [8.265s]
[INFO] Apache Tuscany SCA Shell .......................... SUCCESS [4.908s]
[INFO] Apache Tuscany SCA Stripes Web Framework Integration  SUCCESS [4.507s]
[INFO] Apache Tuscany SCA Apache Wink JAX-RS Integration . SUCCESS [6.715s]
[INFO] Apache Tuscany SCA JAXWS-based WS Binding Extension  SUCCESS [5.275s]
[INFO] Apache Tuscany SCA JAXWS RI based WS Binding Extension  SUCCESS [6.451s]
[INFO] Apache Tuscany SCA Common HTTP .................... SUCCESS [5.280s]
[INFO] Apache Tuscany SCA Core Runtime POM ............... SUCCESS [1.777s]
[INFO] Apache Tuscany SCA Policy Security Model .......... SUCCESS [5.602s]
[INFO] Apache Tuscany SCA Atom Feed Binding Extension .... SUCCESS [7.409s]
[INFO] Apache Tuscany SCA Comet Binding Model ............ SUCCESS [7.483s]
[INFO] Apache Tuscany SCA CORBA Host Extension Point ..... SUCCESS [5.473s]
[INFO] Apache Tuscany SCA CORBA Binding Extension ........ SUCCESS [4.808s]
[INFO] Apache Tuscany SCA EJB Binding Model .............. SUCCESS [5.140s]
[INFO] Apache Tuscany SCA HTTP Binding Model ............. SUCCESS [5.464s]
[INFO] Apache Tuscany SCA JMS Binding Model .............. SUCCESS [6.196s]
[INFO] Apache Tuscany SCA JSONP Binding Model ............ SUCCESS [4.731s]
[INFO] Apache Tuscany SCA JSON-RPC Binding Model ......... SUCCESS [5.347s]
[INFO] Apache Tuscany SCA REST Binding Model ............. SUCCESS [5.314s]
[INFO] Apache Tuscany SCA RMI Binding Model .............. SUCCESS [4.718s]
[INFO] Apache Tuscany SCA BPEL Implementation Extension .. SUCCESS [5.155s]
[INFO] Apache Tuscany SCA Script Implementation Model .... SUCCESS [4.479s]
[INFO] Apache Tuscany SCA Spring Implementation Model .... SUCCESS [5.211s]
[INFO] Apache Tuscany SCA Widget Implementation Model .... SUCCESS [5.614s]
[INFO] Apache Tuscany SCA Base Runtime Jar ............... SUCCESS [12.016s]
[INFO] Apache Tuscany SCA EndPoint Registry using Hazelcast  SUCCESS [5.758s]
[INFO] Apache Tuscany Maven Tuscany Plugin ............... SUCCESS [8.284s]
[INFO] Create an SCA JAR contribution project ............ SUCCESS [4.478s]
[INFO] Create an SCA ZIP contribution project ............ SUCCESS [3.688s]
[INFO] Tuscany SCA ZIP contribution Shared Assembly Descriptor  SUCCESS [2.878s]
[INFO] Create a simple Apache Tuscany SCA webapp project . SUCCESS [4.786s]
[INFO] Create a Tuscany SCA and JSF project .............. SUCCESS [4.031s]
[INFO] Create a simple Apache Tuscany SCA webapp project using the Stripes Web Framework 
SUCCESS [4.811s]
[INFO] Create an SCA Webapp project using BPEL ........... SUCCESS [4.309s]
[INFO] Create a Tuscany binding extension project ........ SUCCESS [4.804s]
[INFO] Apache Tuscany SCA Maven Archetypes ............... SUCCESS [1.925s]
[INFO] Apache Tuscany SCA Web JavaScript ................. SUCCESS [4.721s]
[INFO] Apache Tuscany SCA Abdera Atom Feed Binding Extension  SUCCESS [8.551s]
[INFO] Apache Tuscany SCA JAX-RS Implementation Model .... SUCCESS [9.329s]
[INFO] Apache Tuscany SCA Python Implementation Model .... SUCCESS [4.681s]
[INFO] Apache Tuscany SCA Base Runtime POM ............... SUCCESS [2.517s]
[INFO] Apache Tuscany SCA Comet Binding Runtime .......... SUCCESS [6.440s]
[INFO] Apache Tuscany SCA EJB Binding Runtime ............ SUCCESS [9.659s]
[INFO] Apache Tuscany SCA Data Binding for JSON .......... SUCCESS [6.419s]
[INFO] Apache Tuscany SCA HTTP Binding Runtime ........... SUCCESS [4.998s]
[INFO] Apache Tuscany SCA JMS Binding Runtime ............ SUCCESS [5.799s]
[INFO] Apache Tuscany SCA JMS Binding Runtime AcytiveMQ .. SUCCESS [4.742s]
[INFO] Apache Tuscany SCA JSONP Binding Runtime .......... SUCCESS [5.349s]
[INFO] Apache Tuscany SCA JSON-RPC Binding Runtime ....... SUCCESS [6.192s]
[INFO] Apache Tuscany SCA Interface Java For JAX_RS ...... SUCCESS [4.605s]
[INFO] Apache Tuscany SCA REST Binding Runtime ........... SUCCESS [5.950s]
[INFO] Apache Tuscany SCA RMI Host Extension Point ....... SUCCESS [4.757s]
[INFO] Apache Tuscany SCA RMI Binding Extension .......... SUCCESS [8.030s]
[INFO] Apache Tuscany SCA Websocket Binding Extension .... SUCCESS [6.821s]
[INFO] Apache Tuscany SCA Policy WS-Policy Model ......... SUCCESS [5.352s]
[INFO] Apache Tuscany SCA Data Binding for Axiom ......... SUCCESS [6.098s]
[INFO] Apache Tuscany SCA Data Binding for JAXB-AXIOM .... SUCCESS [5.828s]
[INFO] Apache Tuscany SCA Axis2-1.5-based WS Binding Runtime  SUCCESS [12.921s]
[INFO] Apache Tuscany SCA Resource Import/Export Model ... SUCCESS [4.635s]
[INFO] Apache Tuscany SCA Data Binding for SDO ........... SUCCESS [9.001s]
[INFO] Apache Tuscany SCA Data Binding for SDO/AXIOM ..... SUCCESS [5.501s]
[INFO] Apache Tuscany SCA Tomcat Tribes Based EndPoint Registry  SUCCESS [6.820s]
[INFO] Apache Tuscany SCA Extensibility for Eclipse Equinox  SUCCESS [6.006s]
[INFO] Apache Tuscany SCA Node Equinox OSGi Launcher ..... SUCCESS [8.482s]
[INFO] Apache Tuscany SCA OSGi HTTP Service Based Servlet Host Extension  SUCCESS [6.777s]
[INFO] Apache Tuscany SCA BPEL ODE Implementation Extension  SUCCESS [9.939s]
[INFO] Apache Tuscany SCA JAX-RS Implementation Runtime .. SUCCESS [5.244s]
[INFO] Apache Tuscany SCA Python Implementation Extension  SUCCESS [6.121s]
[INFO] Apache Tuscany SCA Script Implementation Extension  SUCCESS [8.025s]
[INFO] Apache Tuscany SCA Spring Implementation Runtime Model  SUCCESS [5.292s]
[INFO] Apache Tuscany SCA Spring Implementation WebApp Integration  SUCCESS [5.520s]
[INFO] Apache Tuscany SCA Spring Implementation Runtime Stub  SUCCESS [4.803s]
[INFO] Apache Tuscany SCA Spring Implementation Runtime Tie  SUCCESS [6.375s]
[INFO] Apache Tuscany SCA Web Implementation Client ...... SUCCESS [5.139s]
[INFO] Apache Tuscany SCA Widget Implementation Runtime .. SUCCESS [4.997s]
[INFO] Apache Tuscany SCA Web JavaScript for DOJO ........ SUCCESS [20.129s]
[INFO] Apache Tuscany SCA Widget Implementation Runtime (Dojo)  SUCCESS [6.277s]
[INFO] Apache Tuscany SCA MyFaces JSF Integration ........ SUCCESS [4.745s]
[INFO] Apache Tuscany SCA Node Launcher .................. SUCCESS [4.935s]
[INFO] Apache Tuscany SCA Node Manager ................... SUCCESS [5.473s]
[INFO] Apache Tuscany SCA Extension Policy Logging Model . SUCCESS [5.517s]
[INFO] Apache Tuscany SCA Java JSR250 Implementation ..... SUCCESS [5.339s]
[INFO] Apache Tuscany SCA Transaction Policy Model ....... SUCCESS [4.748s]
[INFO] Apache Tuscany SCA Transaction Policy Runtime ..... SUCCESS [4.195s]
[INFO] Apache Tuscany SCA Transaction Policy Runtime (Geronimo)  SUCCESS [4.815s]
[INFO] Apache Tuscany SCA AOP-based Logging and Tracing .. SUCCESS [5.707s]
[INFO] Apache Tuscany SCA Contribution OSGi Bundle ....... SUCCESS [5.168s]
[INFO] Apache Tuscany SCA OSGi Implementation Extension .. SUCCESS [5.282s]
[INFO] Apache Tuscany SCA OSGi Implementation Extension Runtime  SUCCESS [4.279s]
[INFO] Apache Tuscany SCA OSGi Node Implementation ....... SUCCESS [5.327s]
[INFO] Apache Tuscany SCA JSE built-in CORBA Host ........ SUCCESS [4.937s]
[INFO] Apache Tuscany SCA JEE environment CORBA Host ..... SUCCESS [5.559s]
[INFO] Apache Tuscany SCA CORBA Binding Runtime .......... SUCCESS [10.013s]
[INFO] Apache Tuscany SCA Transient Name Server CORBA Host  SUCCESS [6.115s]
[INFO] Apache Tuscany SCA Composite Diagram Generator Application  SUCCESS [6.346s]
[INFO] Apache Tuscany SCA OSGi Runtime POM ............... SUCCESS [2.194s]
[INFO] Apache Tuscany SCA Samples ........................ SUCCESS [1.860s]
[INFO] Apache Tuscany SCA Samples Helloworld ............. SUCCESS [5.018s]
[INFO] Apache Tuscany SCA Samples Helloworld JAX-RS ...... SUCCESS [4.377s]
[INFO] Apache Tuscany SCA Samples Helloworld JSONP ....... SUCCESS [4.310s]
[INFO] Apache Tuscany SCA Samples Helloworld JSON-RPC .... SUCCESS [4.038s]
[INFO] Apache Tuscany SCA Samples Helloworld SCAClient ... SUCCESS [4.256s]
[INFO] Apache Tuscany SCA Samples Helloworld Spring ...... SUCCESS [4.876s]
[INFO] Apache Tuscany SCA Samples Helloworld WebApp ...... FAILURE [4.536s]
[INFO] Apache Tuscany SCA Samples Helloworld Web Service . SKIPPED
[INFO] Apache Tuscany SCA Samples Helloworld With Dependencies  SKIPPED
[INFO] Apache Tuscany SCA Samples Getting Started ........ SKIPPED
[INFO] Apache Tuscany SCA Samples Running Tuscany ........ SKIPPED
[INFO] Apache Tuscany SCA Samples JSE .................... SKIPPED
[INFO] Apache Tuscany SCA Samples JUnit .................. SKIPPED
[INFO] Apache Tuscany SCA Sample Async Invocation ........ SKIPPED
[INFO] Apache Tuscany SCA Sample Learning More ........... SKIPPED
[INFO] Apache Tuscany SCA Sample binding.comet ........... SKIPPED
[INFO] Apache Tuscany SCA Sample binding.comet Real-Time Suggestions Webapp  SKIPPED
[INFO] Apache Tuscany SCA Sample binding.comet Weather Monitor Webapp  SKIPPED
[INFO] Apache Tuscany SCA Sample binding.comet PubSub Webapp  SKIPPED
[INFO] Apache Tuscany SCA Sample binding.comet Chat Webapp  SKIPPED
[INFO] Apache Tuscany SCA Sample binding.websocket ....... SKIPPED
[INFO] Apache Tuscany SCA Sample binding.websocket Autocomplete Webapp  SKIPPED
[INFO] Apache Tuscany SCA Sample binding.websocket Weather Monitor Webapp  SKIPPED
[INFO] Apache Tuscany SCA Sample binding.websocket Chat Webapp  SKIPPED
[INFO] Apache Tuscany SCA Sample binding.websocket PubSub Webapp  SKIPPED
[INFO] Apache Tuscany SCA Sample Calculator OSGi ......... SKIPPED
[INFO] Apache Tuscany SCA Sample OSGi Remote Services Calculator  SKIPPED
[INFO] Apache Tuscany SCA Sample OSGi Remote Services Calculator Operations  SKIPPED
[INFO] Apache Tuscany SCA Distributed OSGI Statically Configured Samples  SKIPPED
[INFO] Apache Tuscany SCA All-in-one Distribution ........ SKIPPED
[INFO] ------------------------------------------------------------------------
[INFO] BUILD FAILURE
[INFO] ------------------------------------------------------------------------
[INFO] Total time: 16:54.864s
[INFO] Finished at: Fri Dec 30 00:26:00 UTC 2011
[INFO] Final Memory: 88M/744M
[INFO] ------------------------------------------------------------------------
mavenExecutionResult exceptions not empty
message : Internal error: java.lang.NullPointerException
cause : null
Stack trace : 
org.apache.maven.InternalErrorException: Internal error: java.lang.NullPointerException
	at org.apache.maven.lifecycle.internal.BuilderCommon.handleBuildError(BuilderCommon.java:128)
	at org.apache.maven.lifecycle.internal.LifecycleModuleBuilder.buildProject(LifecycleModuleBuilder.java:95)
	at org.apache.maven.lifecycle.internal.LifecycleModuleBuilder.buildProject(LifecycleModuleBuilder.java:59)
	at org.apache.maven.lifecycle.internal.LifecycleStarter.singleThreadedBuild(LifecycleStarter.java:183)
	at org.apache.maven.lifecycle.internal.LifecycleStarter.execute(LifecycleStarter.java:161)
	at org.apache.maven.DefaultMaven.doExecute(DefaultMaven.java:319)
	at org.apache.maven.DefaultMaven.execute(DefaultMaven.java:156)
	at org.jvnet.hudson.maven3.launcher.Maven3Launcher.main(Maven3Launcher.java:79)
	at sun.reflect.NativeMethodAccessorImpl.invoke0(Native Method)
	at sun.reflect.NativeMethodAccessorImpl.invoke(NativeMethodAccessorImpl.java:39)
	at sun.reflect.DelegatingMethodAccessorImpl.invoke(DelegatingMethodAccessorImpl.java:25)
	at java.lang.reflect.Method.invoke(Method.java:597)
	at org.codehaus.plexus.classworlds.launcher.Launcher.launchStandard(Launcher.java:329)
	at org.codehaus.plexus.classworlds.launcher.Launcher.launch(Launcher.java:239)
	at org.jvnet.hudson.maven3.agent.Maven3Main.launch(Maven3Main.java:158)
	at hudson.maven.Maven3Builder.call(Maven3Builder.java:112)
	at hudson.maven.Maven3Builder.call(Maven3Builder.java:70)
	at hudson.remoting.UserRequest.perform(UserRequest.java:118)
	at hudson.remoting.UserRequest.perform(UserRequest.java:48)
	at hudson.remoting.Request$2.run(Request.java:287)
	at java.util.concurrent.Executors$RunnableAdapter.call(Executors.java:441)
	at java.util.concurrent.FutureTask$Sync.innerRun(FutureTask.java:303)
	at java.util.concurrent.FutureTask.run(FutureTask.java:138)
	at java.util.concurrent.ThreadPoolExecutor$Worker.runTask(ThreadPoolExecutor.java:886)
	at java.util.concurrent.ThreadPoolExecutor$Worker.run(ThreadPoolExecutor.java:908)
	at java.lang.Thread.run(Thread.java:662)
Caused by: java.lang.NullPointerException
	at hudson.maven.ExecutedMojo.getMojoClass(ExecutedMojo.java:114)
	at hudson.maven.ExecutedMojo.<init>(ExecutedMojo.java:99)
	at hudson.maven.Maven3Builder$MavenExecutionListener.recordExecutionTime(Maven3Builder.java:524)
	at hudson.maven.Maven3Builder$MavenExecutionListener.recordMojoSucceeded(Maven3Builder.java:493)
	at hudson.maven.Maven3Builder$MavenExecutionListener.forkSucceeded(Maven3Builder.java:601)
	at org.apache.maven.lifecycle.internal.DefaultExecutionEventCatapult.fire(DefaultExecutionEventCatapult.java:97)
	at org.apache.maven.lifecycle.internal.DefaultExecutionEventCatapult.fire(DefaultExecutionEventCatapult.java:42)
	at org.apache.maven.lifecycle.internal.MojoExecutor.executeForkedExecutions(MojoExecutor.java:383)
	at org.apache.maven.lifecycle.internal.MojoExecutor.execute(MojoExecutor.java:199)
	at org.apache.maven.lifecycle.internal.MojoExecutor.execute(MojoExecutor.java:153)
	at org.apache.maven.lifecycle.internal.MojoExecutor.execute(MojoExecutor.java:145)
	at org.apache.maven.lifecycle.internal.LifecycleModuleBuilder.buildProject(LifecycleModuleBuilder.java:84)
	... 24 more
Sending e-mails to: commits@tuscany.apache.org
channel stopped


Mime
View raw message