tuscany-commits mailing list archives

Site index · List index
Message view « Date » · « Thread »
Top « Date » · « Thread »
From Apache Jenkins Server <jenk...@builds.apache.org>
Subject Build failed in Jenkins: Tuscany-2x-deploy #605
Date Sat, 31 Dec 2011 00:30:00 GMT
See <https://builds.apache.org/job/Tuscany-2x-deploy/605/>

------------------------------------------
[...truncated 9184 lines...]
[INFO] 
[INFO] --- maven-remote-resources-plugin:1.1:process (default) @ helloworld-webapp ---
[INFO] [INFO] Using 'UTF-8' encoding to copy filtered resources.
[INFO] skip non existing resourceDirectory <https://builds.apache.org/job/Tuscany-2x-deploy/ws/sca-2x/samples/getting-started/helloworld-webapp/src/main/resources>
[INFO] Copying 1 resource
[INFO] Copying 3 resources
[INFO] Copying 3 resources

[INFO] --- maven-resources-plugin:2.4.2:resources (default-resources) @ helloworld-webapp
---
[INFO] [INFO] Nothing to compile - all classes are up to date

[INFO] --- maven-compiler-plugin:2.2:compile (default-compile) @ helloworld-webapp ---
[INFO] [INFO] Configured Artifact: org.apache.tuscany.sca.samples:helloworld:2.0-SNAPSHOT:jar
[INFO] org.apache.tuscany.sca.samples:helloworld:2.0-SNAPSHOT:jar already exists in <https://builds.apache.org/job/Tuscany-2x-deploy/ws/sca-2x/samples/getting-started/helloworld-webapp/src/main/webapp/WEB-INF/sca-contributions>

[INFO] --- maven-dependency-plugin:2.1:copy (copy) @ helloworld-webapp ---
[INFO] [INFO] Using 'UTF-8' encoding to copy filtered resources.
[INFO] Copying 1 resource
[INFO] Copying 3 resources
[INFO] Copying 3 resources

[INFO] --- maven-resources-plugin:2.4.2:testResources (default-testResources) @ helloworld-webapp
---
[INFO] [INFO] Nothing to compile - all classes are up to date

[INFO] --- maven-compiler-plugin:2.2:testCompile (default-testCompile) @ helloworld-webapp
---
[JENKINS] Archiving disabled - not archiving <https://builds.apache.org/job/Tuscany-2x-deploy/ws/sca-2x/samples/getting-started/helloworld-webapp/pom.xml>
[JENKINS] Archiving disabled - not archiving <https://builds.apache.org/job/Tuscany-2x-deploy/ws/sca-2x/samples/getting-started/helloworld-webapp/pom.xml>
[INFO] ------------------------------------------------------------------------
[INFO] Reactor Summary:
[INFO] 
[INFO] Apache Tuscany SCA Implementation Project (2.x) ... SUCCESS [33.563s]
[INFO] Apache Tuscany SCA Implementation Modules ......... SUCCESS [4.459s]
[INFO] Apache Tuscany SCA Monitor ........................ SUCCESS [5.869s]
[INFO] Apache Tuscany SCA Extensibility .................. SUCCESS [5.072s]
[INFO] Apache Tuscany SCA Assembly Model ................. SUCCESS [6.236s]
[INFO] Apache Tuscany SCA Assembly Model XSD Files ....... SUCCESS [7.209s]
[INFO] Apache Tuscany SCA Common XML ..................... SUCCESS [6.306s]
[INFO] Apache Tuscany SCA API ............................ SUCCESS [4.293s]
[INFO] Apache Tuscany SCA Common Java .................... SUCCESS [4.683s]
[INFO] Apache Tuscany SCA Contribution Model ............. SUCCESS [6.202s]
[INFO] Apache Tuscany SCA Node API ....................... SUCCESS [7.591s]
[INFO] Apache Tuscany SCA Core SPI ....................... SUCCESS [8.931s]
[INFO] Apache Tuscany SCA XSD Model ...................... SUCCESS [5.436s]
[INFO] Apache Tuscany SCA Assembly XML Model ............. SUCCESS [6.099s]
[INFO] Apache Tuscany SCA WSDL Interface Model ........... SUCCESS [5.981s]
[INFO] Apache Tuscany SCA Interface Java Model ........... SUCCESS [5.391s]
[INFO] Apache Tuscany SCA Core Runtime ................... SUCCESS [7.190s]
[INFO] Apache Tuscany SCA DataBinding Framework .......... SUCCESS [8.722s]
[INFO] Apache Tuscany SCA DataBinding for JAXB ........... SUCCESS [7.789s]
[INFO] Apache Tuscany SCA Model Builders ................. SUCCESS [6.441s]
[INFO] Apache Tuscany SCA Deployment ..................... SUCCESS [4.802s]
[INFO] Apache Tuscany SCA WS Binding Model ............... SUCCESS [4.731s]
[INFO] Apache Tuscany SCA Interface Java For JAXWS ....... SUCCESS [10.129s]
[INFO] Apache Tuscany SCA Core/DataBinding Integration ... SUCCESS [4.209s]
[INFO] Apache Tuscany SCA Web Service binding WSDL Generator  SUCCESS [5.142s]
[INFO] Apache Tuscany SCA Binding SCA Runtime ............ SUCCESS [6.318s]
[INFO] Apache Tuscany SCA Implementation Java Model ...... SUCCESS [6.112s]
[INFO] Apache Tuscany SCA Implementation Java Runtime .... SUCCESS [7.005s]
[INFO] Apache Tuscany SCA Node Implementation ............ SUCCESS [6.343s]
[INFO] Apache Tuscany SCA Data API ....................... SUCCESS [4.862s]
[INFO] Apache Tuscany SCA Domain Node .................... SUCCESS [5.398s]
[INFO] Apache Tuscany SCA Web Implementation Model ....... SUCCESS [5.118s]
[INFO] Apache Tuscany SCA HTTP Servlet Host Extension Point  SUCCESS [4.872s]
[INFO] Apache Tuscany SCA Webapp Host .................... SUCCESS [4.613s]
[INFO] Apache Tuscany SCA Web Implementation Runtime ..... SUCCESS [4.767s]
[INFO] Apache Tuscany SCA Launcher ....................... SUCCESS [4.089s]
[INFO] Apache Tuscany SCA Client Impl .................... SUCCESS [4.448s]
[INFO] Apache Tuscany SCA Jetty Servlet Host Extension ... SUCCESS [6.320s]
[INFO] Apache Tuscany SCA Shell .......................... SUCCESS [4.718s]
[INFO] Apache Tuscany SCA Stripes Web Framework Integration  SUCCESS [7.520s]
[INFO] Apache Tuscany SCA Apache Wink JAX-RS Integration . SUCCESS [4.767s]
[INFO] Apache Tuscany SCA JAXWS-based WS Binding Extension  SUCCESS [4.427s]
[INFO] Apache Tuscany SCA JAXWS RI based WS Binding Extension  SUCCESS [6.005s]
[INFO] Apache Tuscany SCA Common HTTP .................... SUCCESS [3.926s]
[INFO] Apache Tuscany SCA Core Runtime POM ............... SUCCESS [2.441s]
[INFO] Apache Tuscany SCA Policy Security Model .......... SUCCESS [5.336s]
[INFO] Apache Tuscany SCA Atom Feed Binding Extension .... SUCCESS [4.883s]
[INFO] Apache Tuscany SCA Comet Binding Model ............ SUCCESS [5.193s]
[INFO] Apache Tuscany SCA CORBA Host Extension Point ..... SUCCESS [5.675s]
[INFO] Apache Tuscany SCA CORBA Binding Extension ........ SUCCESS [4.955s]
[INFO] Apache Tuscany SCA EJB Binding Model .............. SUCCESS [4.350s]
[INFO] Apache Tuscany SCA HTTP Binding Model ............. SUCCESS [4.654s]
[INFO] Apache Tuscany SCA JMS Binding Model .............. SUCCESS [5.382s]
[INFO] Apache Tuscany SCA JSONP Binding Model ............ SUCCESS [4.402s]
[INFO] Apache Tuscany SCA JSON-RPC Binding Model ......... SUCCESS [4.342s]
[INFO] Apache Tuscany SCA REST Binding Model ............. SUCCESS [4.530s]
[INFO] Apache Tuscany SCA RMI Binding Model .............. SUCCESS [4.216s]
[INFO] Apache Tuscany SCA BPEL Implementation Extension .. SUCCESS [5.876s]
[INFO] Apache Tuscany SCA Script Implementation Model .... SUCCESS [4.486s]
[INFO] Apache Tuscany SCA Spring Implementation Model .... SUCCESS [5.632s]
[INFO] Apache Tuscany SCA Widget Implementation Model .... SUCCESS [5.258s]
[INFO] Apache Tuscany SCA Base Runtime Jar ............... SUCCESS [13.668s]
[INFO] Apache Tuscany SCA EndPoint Registry using Hazelcast  SUCCESS [5.816s]
[INFO] Apache Tuscany Maven Tuscany Plugin ............... SUCCESS [7.910s]
[INFO] Create an SCA JAR contribution project ............ SUCCESS [5.402s]
[INFO] Create an SCA ZIP contribution project ............ SUCCESS [3.472s]
[INFO] Tuscany SCA ZIP contribution Shared Assembly Descriptor  SUCCESS [3.102s]
[INFO] Create a simple Apache Tuscany SCA webapp project . SUCCESS [3.963s]
[INFO] Create a Tuscany SCA and JSF project .............. SUCCESS [3.853s]
[INFO] Create a simple Apache Tuscany SCA webapp project using the Stripes Web Framework 
SUCCESS [4.555s]
[INFO] Create an SCA Webapp project using BPEL ........... SUCCESS [4.095s]
[INFO] Create a Tuscany binding extension project ........ SUCCESS [5.240s]
[INFO] Apache Tuscany SCA Maven Archetypes ............... SUCCESS [2.122s]
[INFO] Apache Tuscany SCA Web JavaScript ................. SUCCESS [4.390s]
[INFO] Apache Tuscany SCA Abdera Atom Feed Binding Extension  SUCCESS [11.957s]
[INFO] Apache Tuscany SCA JAX-RS Implementation Model .... SUCCESS [5.035s]
[INFO] Apache Tuscany SCA Python Implementation Model .... SUCCESS [5.258s]
[INFO] Apache Tuscany SCA Base Runtime POM ............... SUCCESS [3.469s]
[INFO] Apache Tuscany SCA Comet Binding Runtime .......... SUCCESS [5.887s]
[INFO] Apache Tuscany SCA EJB Binding Runtime ............ SUCCESS [9.510s]
[INFO] Apache Tuscany SCA Data Binding for JSON .......... SUCCESS [6.259s]
[INFO] Apache Tuscany SCA HTTP Binding Runtime ........... SUCCESS [6.967s]
[INFO] Apache Tuscany SCA JMS Binding Runtime ............ SUCCESS [5.641s]
[INFO] Apache Tuscany SCA JMS Binding Runtime AcytiveMQ .. SUCCESS [5.148s]
[INFO] Apache Tuscany SCA JSONP Binding Runtime .......... SUCCESS [10.156s]
[INFO] Apache Tuscany SCA JSON-RPC Binding Runtime ....... SUCCESS [5.617s]
[INFO] Apache Tuscany SCA Interface Java For JAX_RS ...... SUCCESS [4.470s]
[INFO] Apache Tuscany SCA REST Binding Runtime ........... SUCCESS [5.752s]
[INFO] Apache Tuscany SCA RMI Host Extension Point ....... SUCCESS [4.462s]
[INFO] Apache Tuscany SCA RMI Binding Extension .......... SUCCESS [4.933s]
[INFO] Apache Tuscany SCA Websocket Binding Extension .... SUCCESS [6.659s]
[INFO] Apache Tuscany SCA Policy WS-Policy Model ......... SUCCESS [5.096s]
[INFO] Apache Tuscany SCA Data Binding for Axiom ......... SUCCESS [5.203s]
[INFO] Apache Tuscany SCA Data Binding for JAXB-AXIOM .... SUCCESS [5.174s]
[INFO] Apache Tuscany SCA Axis2-1.5-based WS Binding Runtime  SUCCESS [6.183s]
[INFO] Apache Tuscany SCA Resource Import/Export Model ... SUCCESS [5.651s]
[INFO] Apache Tuscany SCA Data Binding for SDO ........... SUCCESS [7.619s]
[INFO] Apache Tuscany SCA Data Binding for SDO/AXIOM ..... SUCCESS [5.872s]
[INFO] Apache Tuscany SCA Tomcat Tribes Based EndPoint Registry  SUCCESS [5.063s]
[INFO] Apache Tuscany SCA Extensibility for Eclipse Equinox  SUCCESS [5.563s]
[INFO] Apache Tuscany SCA Node Equinox OSGi Launcher ..... SUCCESS [8.571s]
[INFO] Apache Tuscany SCA OSGi HTTP Service Based Servlet Host Extension  SUCCESS [5.247s]
[INFO] Apache Tuscany SCA BPEL ODE Implementation Extension  SUCCESS [18.563s]
[INFO] Apache Tuscany SCA JAX-RS Implementation Runtime .. SUCCESS [21.064s]
[INFO] Apache Tuscany SCA Python Implementation Extension  SUCCESS [10.237s]
[INFO] Apache Tuscany SCA Script Implementation Extension  SUCCESS [11.237s]
[INFO] Apache Tuscany SCA Spring Implementation Runtime Model  SUCCESS [26.776s]
[INFO] Apache Tuscany SCA Spring Implementation WebApp Integration  SUCCESS [11.176s]
[INFO] Apache Tuscany SCA Spring Implementation Runtime Stub  SUCCESS [14.902s]
[INFO] Apache Tuscany SCA Spring Implementation Runtime Tie  SUCCESS [11.564s]
[INFO] Apache Tuscany SCA Web Implementation Client ...... SUCCESS [12.616s]
[INFO] Apache Tuscany SCA Widget Implementation Runtime .. SUCCESS [8.828s]
[INFO] Apache Tuscany SCA Web JavaScript for DOJO ........ SUCCESS [47.108s]
[INFO] Apache Tuscany SCA Widget Implementation Runtime (Dojo)  SUCCESS [36.909s]
[INFO] Apache Tuscany SCA MyFaces JSF Integration ........ SUCCESS [5.344s]
[INFO] Apache Tuscany SCA Node Launcher .................. SUCCESS [5.353s]
[INFO] Apache Tuscany SCA Node Manager ................... SUCCESS [4.980s]
[INFO] Apache Tuscany SCA Extension Policy Logging Model . SUCCESS [5.524s]
[INFO] Apache Tuscany SCA Java JSR250 Implementation ..... SUCCESS [5.615s]
[INFO] Apache Tuscany SCA Transaction Policy Model ....... SUCCESS [10.933s]
[INFO] Apache Tuscany SCA Transaction Policy Runtime ..... SUCCESS [4.526s]
[INFO] Apache Tuscany SCA Transaction Policy Runtime (Geronimo)  SUCCESS [6.629s]
[INFO] Apache Tuscany SCA AOP-based Logging and Tracing .. SUCCESS [4.919s]
[INFO] Apache Tuscany SCA Contribution OSGi Bundle ....... SUCCESS [4.021s]
[INFO] Apache Tuscany SCA OSGi Implementation Extension .. SUCCESS [4.990s]
[INFO] Apache Tuscany SCA OSGi Implementation Extension Runtime  SUCCESS [4.543s]
[INFO] Apache Tuscany SCA OSGi Node Implementation ....... SUCCESS [6.760s]
[INFO] Apache Tuscany SCA JSE built-in CORBA Host ........ SUCCESS [4.869s]
[INFO] Apache Tuscany SCA JEE environment CORBA Host ..... SUCCESS [6.690s]
[INFO] Apache Tuscany SCA CORBA Binding Runtime .......... SUCCESS [5.957s]
[INFO] Apache Tuscany SCA Transient Name Server CORBA Host  SUCCESS [5.972s]
[INFO] Apache Tuscany SCA Composite Diagram Generator Application  SUCCESS [6.605s]
[INFO] Apache Tuscany SCA OSGi Runtime POM ............... SUCCESS [3.941s]
[INFO] Apache Tuscany SCA Samples ........................ SUCCESS [1.642s]
[INFO] Apache Tuscany SCA Samples Helloworld ............. SUCCESS [3.972s]
[INFO] Apache Tuscany SCA Samples Helloworld JAX-RS ...... SUCCESS [3.783s]
[INFO] Apache Tuscany SCA Samples Helloworld JSONP ....... SUCCESS [4.902s]
[INFO] Apache Tuscany SCA Samples Helloworld JSON-RPC .... SUCCESS [4.685s]
[INFO] Apache Tuscany SCA Samples Helloworld SCAClient ... SUCCESS [3.902s]
[INFO] Apache Tuscany SCA Samples Helloworld Spring ...... SUCCESS [4.252s]
[INFO] Apache Tuscany SCA Samples Helloworld WebApp ...... FAILURE [4.680s]
[INFO] Apache Tuscany SCA Samples Helloworld Web Service . SKIPPED
[INFO] Apache Tuscany SCA Samples Helloworld With Dependencies  SKIPPED
[INFO] Apache Tuscany SCA Samples Getting Started ........ SKIPPED
[INFO] Apache Tuscany SCA Samples Running Tuscany ........ SKIPPED
[INFO] Apache Tuscany SCA Samples JSE .................... SKIPPED
[INFO] Apache Tuscany SCA Samples JUnit .................. SKIPPED
[INFO] Apache Tuscany SCA Sample Async Invocation ........ SKIPPED
[INFO] Apache Tuscany SCA Sample Learning More ........... SKIPPED
[INFO] Apache Tuscany SCA Sample binding.comet ........... SKIPPED
[INFO] Apache Tuscany SCA Sample binding.comet Real-Time Suggestions Webapp  SKIPPED
[INFO] Apache Tuscany SCA Sample binding.comet Weather Monitor Webapp  SKIPPED
[INFO] Apache Tuscany SCA Sample binding.comet PubSub Webapp  SKIPPED
[INFO] Apache Tuscany SCA Sample binding.comet Chat Webapp  SKIPPED
[INFO] Apache Tuscany SCA Sample binding.websocket ....... SKIPPED
[INFO] Apache Tuscany SCA Sample binding.websocket Autocomplete Webapp  SKIPPED
[INFO] Apache Tuscany SCA Sample binding.websocket Weather Monitor Webapp  SKIPPED
[INFO] Apache Tuscany SCA Sample binding.websocket Chat Webapp  SKIPPED
[INFO] Apache Tuscany SCA Sample binding.websocket PubSub Webapp  SKIPPED
[INFO] Apache Tuscany SCA Sample Calculator OSGi ......... SKIPPED
[INFO] Apache Tuscany SCA Sample OSGi Remote Services Calculator  SKIPPED
[INFO] Apache Tuscany SCA Sample OSGi Remote Services Calculator Operations  SKIPPED
[INFO] Apache Tuscany SCA Distributed OSGI Statically Configured Samples  SKIPPED
[INFO] Apache Tuscany SCA All-in-one Distribution ........ SKIPPED
[INFO] ------------------------------------------------------------------------
[INFO] BUILD FAILURE
[INFO] ------------------------------------------------------------------------
[INFO] Total time: 18:48.878s
[INFO] Finished at: Sat Dec 31 00:29:55 UTC 2011
[INFO] Final Memory: 88M/744M
[INFO] ------------------------------------------------------------------------
Waiting for Jenkins to finish collecting data
mavenExecutionResult exceptions not empty
message : Internal error: java.lang.NullPointerException
cause : null
Stack trace : 
org.apache.maven.InternalErrorException: Internal error: java.lang.NullPointerException
	at org.apache.maven.lifecycle.internal.BuilderCommon.handleBuildError(BuilderCommon.java:128)
	at org.apache.maven.lifecycle.internal.LifecycleModuleBuilder.buildProject(LifecycleModuleBuilder.java:95)
	at org.apache.maven.lifecycle.internal.LifecycleModuleBuilder.buildProject(LifecycleModuleBuilder.java:59)
	at org.apache.maven.lifecycle.internal.LifecycleStarter.singleThreadedBuild(LifecycleStarter.java:183)
	at org.apache.maven.lifecycle.internal.LifecycleStarter.execute(LifecycleStarter.java:161)
	at org.apache.maven.DefaultMaven.doExecute(DefaultMaven.java:319)
	at org.apache.maven.DefaultMaven.execute(DefaultMaven.java:156)
	at org.jvnet.hudson.maven3.launcher.Maven3Launcher.main(Maven3Launcher.java:79)
	at sun.reflect.NativeMethodAccessorImpl.invoke0(Native Method)
	at sun.reflect.NativeMethodAccessorImpl.invoke(NativeMethodAccessorImpl.java:39)
	at sun.reflect.DelegatingMethodAccessorImpl.invoke(DelegatingMethodAccessorImpl.java:25)
	at java.lang.reflect.Method.invoke(Method.java:597)
	at org.codehaus.plexus.classworlds.launcher.Launcher.launchStandard(Launcher.java:329)
	at org.codehaus.plexus.classworlds.launcher.Launcher.launch(Launcher.java:239)
	at org.jvnet.hudson.maven3.agent.Maven3Main.launch(Maven3Main.java:158)
	at hudson.maven.Maven3Builder.call(Maven3Builder.java:112)
	at hudson.maven.Maven3Builder.call(Maven3Builder.java:70)
	at hudson.remoting.UserRequest.perform(UserRequest.java:118)
	at hudson.remoting.UserRequest.perform(UserRequest.java:48)
	at hudson.remoting.Request$2.run(Request.java:287)
	at java.util.concurrent.Executors$RunnableAdapter.call(Executors.java:441)
	at java.util.concurrent.FutureTask$Sync.innerRun(FutureTask.java:303)
	at java.util.concurrent.FutureTask.run(FutureTask.java:138)
	at java.util.concurrent.ThreadPoolExecutor$Worker.runTask(ThreadPoolExecutor.java:886)
	at java.util.concurrent.ThreadPoolExecutor$Worker.run(ThreadPoolExecutor.java:908)
	at java.lang.Thread.run(Thread.java:662)
Caused by: java.lang.NullPointerException
	at hudson.maven.ExecutedMojo.getMojoClass(ExecutedMojo.java:114)
	at hudson.maven.ExecutedMojo.<init>(ExecutedMojo.java:99)
	at hudson.maven.Maven3Builder$MavenExecutionListener.recordExecutionTime(Maven3Builder.java:524)
	at hudson.maven.Maven3Builder$MavenExecutionListener.recordMojoSucceeded(Maven3Builder.java:493)
	at hudson.maven.Maven3Builder$MavenExecutionListener.forkSucceeded(Maven3Builder.java:601)
	at org.apache.maven.lifecycle.internal.DefaultExecutionEventCatapult.fire(DefaultExecutionEventCatapult.java:97)
	at org.apache.maven.lifecycle.internal.DefaultExecutionEventCatapult.fire(DefaultExecutionEventCatapult.java:42)
	at org.apache.maven.lifecycle.internal.MojoExecutor.executeForkedExecutions(MojoExecutor.java:383)
	at org.apache.maven.lifecycle.internal.MojoExecutor.execute(MojoExecutor.java:199)
	at org.apache.maven.lifecycle.internal.MojoExecutor.execute(MojoExecutor.java:153)
	at org.apache.maven.lifecycle.internal.MojoExecutor.execute(MojoExecutor.java:145)
	at org.apache.maven.lifecycle.internal.LifecycleModuleBuilder.buildProject(LifecycleModuleBuilder.java:84)
	... 24 more
Sending e-mails to: commits@tuscany.apache.org
channel stopped


Mime
View raw message