tuscany-commits mailing list archives

Site index · List index
Message view « Date » · « Thread »
Top « Date » · « Thread »
From Apache Jenkins Server <jenk...@builds.apache.org>
Subject Build failed in Jenkins: Tuscany-2x » Apache Tuscany SCA Interface Java For JAXWS #270
Date Fri, 01 Jul 2011 00:13:55 GMT
See <https://builds.apache.org/job/Tuscany-2x/org.apache.tuscany.sca$tuscany-interface-java-jaxws/270/>

------------------------------------------
[INFO] ------------------------------------------------------------------------
[INFO] Building Apache Tuscany SCA Interface Java For JAXWS
[INFO]    task-segment: [clean, install]
[INFO] ------------------------------------------------------------------------
Downloading: http://repo1.maven.org/maven2/org/codehaus/mojo/jaxws-maven-plugin/1.10/jaxws-maven-plugin-1.10.pom

Downloading: http://repo1.maven.org/maven2/org/jvnet/jax-ws-commons/pom/1.0/pom-1.0.pom

Downloading: http://repo1.maven.org/maven2/org/codehaus/mojo/jaxws-maven-plugin/1.10/jaxws-maven-plugin-1.10.jar

[INFO] [clean:clean {execution: default-clean}]
Downloading: http://svn.apache.org/repos/asf/tuscany/maven/asm/asm-util/3.1/asm-util-3.1.pom
[INFO] Unable to find resource 'asm:asm-util:pom:3.1' in repository tuscany.repo (http://svn.apache.org/repos/asf/tuscany/maven)
Downloading: http://repo1.maven.org/maven2/asm/asm-util/3.1/asm-util-3.1.pom

Downloading: http://svn.apache.org/repos/asf/tuscany/maven/asm/asm-tree/3.1/asm-tree-3.1.pom
[INFO] Unable to find resource 'asm:asm-tree:pom:3.1' in repository tuscany.repo (http://svn.apache.org/repos/asf/tuscany/maven)
Downloading: http://repo1.maven.org/maven2/asm/asm-tree/3.1/asm-tree-3.1.pom

Downloading: http://svn.apache.org/repos/asf/tuscany/maven/asm/asm-analysis/3.1/asm-analysis-3.1.pom
[INFO] Unable to find resource 'asm:asm-analysis:pom:3.1' in repository tuscany.repo (http://svn.apache.org/repos/asf/tuscany/maven)
Downloading: http://repo1.maven.org/maven2/asm/asm-analysis/3.1/asm-analysis-3.1.pom

Downloading: http://svn.apache.org/repos/asf/tuscany/maven/asm/asm-util/3.1/asm-util-3.1.jar
[INFO] Unable to find resource 'asm:asm-util:jar:3.1' in repository tuscany.repo (http://svn.apache.org/repos/asf/tuscany/maven)
Downloading: http://repo1.maven.org/maven2/asm/asm-util/3.1/asm-util-3.1.jar

Downloading: http://svn.apache.org/repos/asf/tuscany/maven/asm/asm-tree/3.1/asm-tree-3.1.jar
[INFO] Unable to find resource 'asm:asm-tree:jar:3.1' in repository tuscany.repo (http://svn.apache.org/repos/asf/tuscany/maven)
Downloading: http://repo1.maven.org/maven2/asm/asm-tree/3.1/asm-tree-3.1.jar

Downloading: http://svn.apache.org/repos/asf/tuscany/maven/asm/asm-analysis/3.1/asm-analysis-3.1.jar
[INFO] Unable to find resource 'asm:asm-analysis:jar:3.1' in repository tuscany.repo (http://svn.apache.org/repos/asf/tuscany/maven)
Downloading: http://repo1.maven.org/maven2/asm/asm-analysis/3.1/asm-analysis-3.1.jar

[INFO] [enforcer:enforce {execution: enforce-plugin-versions}]
[INFO] [build-helper:add-test-source {execution: add-test-source}]
[INFO] Test Source directory: <https://builds.apache.org/job/Tuscany-2x/org.apache.tuscany.sca$tuscany-interface-java-jaxws/ws/target/jaxws-source>
added.
[INFO] [remote-resources:process {execution: default}]
[INFO] [resources:resources {execution: default-resources}]
[INFO] Using 'UTF-8' encoding to copy filtered resources.
[INFO] Copying 2 resources
[INFO] Copying 3 resources
[INFO] Copying 3 resources
[INFO] [compiler:compile {execution: default-compile}]
[INFO] Compiling 11 source files to <https://builds.apache.org/job/Tuscany-2x/org.apache.tuscany.sca$tuscany-interface-java-jaxws/ws/target/classes>
[INFO] -------------------------------------------------------------
[ERROR] COMPILATION ERROR : 
[INFO] -------------------------------------------------------------
[ERROR] Failure executing javac,  but could not parse the error:
Segmentation fault

[INFO] 1error
[INFO] -------------------------------------------------------------
[JENKINS] Archiving disabled - not archiving <https://builds.apache.org/job/Tuscany-2x/org.apache.tuscany.sca$tuscany-interface-java-jaxws/ws/pom.xml>
[INFO] ------------------------------------------------------------------------
[ERROR] BUILD FAILURE
[INFO] ------------------------------------------------------------------------
[INFO] Compilation failure
Failure executing javac,  but could not parse the error:
Segmentation fault


[INFO] ------------------------------------------------------------------------
[INFO] For more information, run Maven with the -e switch
[INFO] ------------------------------------------------------------------------
[INFO] Total time: 6 minutes 10 seconds
[INFO] Finished at: Thu Jun 30 17:13:53 PDT 2011
[INFO] Final Memory: 66M/717M
[INFO] ------------------------------------------------------------------------


Mime
View raw message