tuscany-commits mailing list archives

Site index · List index
Message view « Date » · « Thread »
Top « Date » · « Thread »
From Apache Jenkins Server <hud...@hudson.apache.org>
Subject Build failed in Jenkins: Tuscany-2x-deploy #282
Date Fri, 03 Jun 2011 00:40:00 GMT
See <https://builds.apache.org/hudson/job/Tuscany-2x-deploy/282/changes>

Changes:

[antelder] Look at a reuseable way of calculating a contributions dependencies without having
to process and validate the entire contribution

------------------------------------------
[...truncated 1351 lines...]
Uploading: https://repository.apache.org/content/repositories/snapshots/org/apache/tuscany/sca/tuscany-implementation-java-runtime/2.0-SNAPSHOT/tuscany-implementation-java-runtime-2.0-SNAPSHOT.jar
85K uploaded  (tuscany-implementation-java-runtime-2.0-SNAPSHOT.jar)
[INFO] Retrieving previous metadata from apache.snapshots.https
[INFO] Uploading repository metadata for: 'artifact org.apache.tuscany.sca:tuscany-implementation-java-runtime'
[INFO] Retrieving previous metadata from apache.snapshots.https
[INFO] Uploading repository metadata for: 'snapshot org.apache.tuscany.sca:tuscany-implementation-java-runtime:2.0-SNAPSHOT'
[INFO] Uploading project information for tuscany-implementation-java-runtime 2.0-SNAPSHOT
[INFO] Retrieving previous build number from apache.snapshots.https
Uploading: https://repository.apache.org/content/repositories/snapshots/org/apache/tuscany/sca/tuscany-implementation-java-runtime/2.0-SNAPSHOT/tuscany-implementation-java-runtime-2.0-SNAPSHOT-sources.jar
69K uploaded  (tuscany-implementation-java-runtime-2.0-SNAPSHOT-sources.jar)
[JENKINS] Archiving disabled - not archiving <https://builds.apache.org/hudson/job/Tuscany-2x-deploy/ws/sca-2x/modules/implementation-java-runtime/pom.xml>
[JENKINS] Archiving disabled - not archiving <https://builds.apache.org/hudson/job/Tuscany-2x-deploy/ws/sca-2x/modules/implementation-java-runtime/target/tuscany-implementation-java-runtime-2.0-SNAPSHOT.jar>
[JENKINS] Archiving disabled - not archiving <https://builds.apache.org/hudson/job/Tuscany-2x-deploy/ws/sca-2x/modules/implementation-java-runtime/target/tuscany-implementation-java-runtime-2.0-SNAPSHOT-sources.jar>
[INFO] ------------------------------------------------------------------------
[INFO] Building Apache Tuscany SCA Web Service binding WSDL Generator
[INFO]    task-segment: [clean, deploy]
[INFO] ------------------------------------------------------------------------
[INFO] [clean:clean {execution: default-clean}]
[INFO] Deleting <https://builds.apache.org/hudson/job/Tuscany-2x-deploy/ws/sca-2x/modules/binding-ws-wsdlgen/target>
[INFO] [enforcer:enforce {execution: enforce-plugin-versions}]
[INFO] [remote-resources:process {execution: default}]
[INFO] [resources:resources {execution: default-resources}]
[INFO] Using 'UTF-8' encoding to copy filtered resources.
[INFO] Copying 3 resources
[INFO] Copying 3 resources
[INFO] Copying 3 resources
[INFO] [compiler:compile {execution: default-compile}]
[INFO] Compiling 7 source files to <https://builds.apache.org/hudson/job/Tuscany-2x-deploy/ws/sca-2x/modules/binding-ws-wsdlgen/target/classes>
[INFO] [resources:testResources {execution: default-testResources}]
[INFO] Using 'UTF-8' encoding to copy filtered resources.
[INFO] skip non existing resourceDirectory <https://builds.apache.org/hudson/job/Tuscany-2x-deploy/ws/sca-2x/modules/binding-ws-wsdlgen/src/test/resources>
[INFO] Copying 3 resources
[INFO] [compiler:testCompile {execution: default-testCompile}]
[INFO] Compiling 9 source files to <https://builds.apache.org/hudson/job/Tuscany-2x-deploy/ws/sca-2x/modules/binding-ws-wsdlgen/target/test-classes>
[INFO] [surefire:test {execution: default-test}]
[INFO] Tests are skipped.
[INFO] [jar:jar {execution: default-jar}]
[INFO] Building jar: <https://builds.apache.org/hudson/job/Tuscany-2x-deploy/ws/sca-2x/modules/binding-ws-wsdlgen/target/tuscany-binding-ws-wsdlgen-2.0-SNAPSHOT.jar>
[INFO] [source:jar-no-fork {execution: attach-sources}]
[INFO] Building jar: <https://builds.apache.org/hudson/job/Tuscany-2x-deploy/ws/sca-2x/modules/binding-ws-wsdlgen/target/tuscany-binding-ws-wsdlgen-2.0-SNAPSHOT-sources.jar>
[INFO] [install:install {execution: default-install}]
[INFO] Installing <https://builds.apache.org/hudson/job/Tuscany-2x-deploy/ws/sca-2x/modules/binding-ws-wsdlgen/target/tuscany-binding-ws-wsdlgen-2.0-SNAPSHOT.jar>
to <https://builds.apache.org/hudson/job/Tuscany-2x-deploy/ws/.repository/org/apache/tuscany/sca/tuscany-binding-ws-wsdlgen/2.0-SNAPSHOT/tuscany-binding-ws-wsdlgen-2.0-SNAPSHOT.jar>
[INFO] Installing <https://builds.apache.org/hudson/job/Tuscany-2x-deploy/ws/sca-2x/modules/binding-ws-wsdlgen/target/tuscany-binding-ws-wsdlgen-2.0-SNAPSHOT-sources.jar>
to <https://builds.apache.org/hudson/job/Tuscany-2x-deploy/ws/.repository/org/apache/tuscany/sca/tuscany-binding-ws-wsdlgen/2.0-SNAPSHOT/tuscany-binding-ws-wsdlgen-2.0-SNAPSHOT-sources.jar>
[INFO] [deploy:deploy {execution: default-deploy}]
[INFO] Retrieving previous build number from apache.snapshots.https
Uploading: https://repository.apache.org/content/repositories/snapshots/org/apache/tuscany/sca/tuscany-binding-ws-wsdlgen/2.0-SNAPSHOT/tuscany-binding-ws-wsdlgen-2.0-SNAPSHOT.jar
51K uploaded  (tuscany-binding-ws-wsdlgen-2.0-SNAPSHOT.jar)
[INFO] Uploading project information for tuscany-binding-ws-wsdlgen 2.0-SNAPSHOT
[INFO] Retrieving previous metadata from apache.snapshots.https
[INFO] Uploading repository metadata for: 'snapshot org.apache.tuscany.sca:tuscany-binding-ws-wsdlgen:2.0-SNAPSHOT'
[INFO] Retrieving previous metadata from apache.snapshots.https
[INFO] Uploading repository metadata for: 'artifact org.apache.tuscany.sca:tuscany-binding-ws-wsdlgen'
[INFO] Retrieving previous build number from apache.snapshots.https
Uploading: https://repository.apache.org/content/repositories/snapshots/org/apache/tuscany/sca/tuscany-binding-ws-wsdlgen/2.0-SNAPSHOT/tuscany-binding-ws-wsdlgen-2.0-SNAPSHOT-sources.jar
36K uploaded  (tuscany-binding-ws-wsdlgen-2.0-SNAPSHOT-sources.jar)
[JENKINS] Archiving disabled - not archiving <https://builds.apache.org/hudson/job/Tuscany-2x-deploy/ws/sca-2x/modules/binding-ws-wsdlgen/pom.xml>
[JENKINS] Archiving disabled - not archiving <https://builds.apache.org/hudson/job/Tuscany-2x-deploy/ws/sca-2x/modules/binding-ws-wsdlgen/target/tuscany-binding-ws-wsdlgen-2.0-SNAPSHOT.jar>
[JENKINS] Archiving disabled - not archiving <https://builds.apache.org/hudson/job/Tuscany-2x-deploy/ws/sca-2x/modules/binding-ws-wsdlgen/target/tuscany-binding-ws-wsdlgen-2.0-SNAPSHOT-sources.jar>
[INFO] ------------------------------------------------------------------------
[INFO] Building Apache Tuscany SCA Node Implementation
[INFO]    task-segment: [clean, deploy]
[INFO] ------------------------------------------------------------------------
[INFO] [clean:clean {execution: default-clean}]
[INFO] Deleting <https://builds.apache.org/hudson/job/Tuscany-2x-deploy/ws/sca-2x/modules/node-impl/target>
[INFO] [enforcer:enforce {execution: enforce-plugin-versions}]
[INFO] [remote-resources:process {execution: default}]
[INFO] [resources:resources {execution: default-resources}]
[INFO] Using 'UTF-8' encoding to copy filtered resources.
[INFO] Copying 5 resources
[INFO] Copying 3 resources
[INFO] Copying 3 resources
[INFO] [compiler:compile {execution: default-compile}]
[INFO] Compiling 8 source files to <https://builds.apache.org/hudson/job/Tuscany-2x-deploy/ws/sca-2x/modules/node-impl/target/classes>
[INFO] [resources:testResources {execution: default-testResources}]
[INFO] Using 'UTF-8' encoding to copy filtered resources.
[INFO] Copying 5 resources
[INFO] Copying 3 resources
[INFO] [compiler:testCompile {execution: default-testCompile}]
[INFO] Compiling 7 source files to <https://builds.apache.org/hudson/job/Tuscany-2x-deploy/ws/sca-2x/modules/node-impl/target/test-classes>
[INFO] [surefire:test {execution: default-test}]
[INFO] Tests are skipped.
[INFO] [jar:jar {execution: default-jar}]
[INFO] Building jar: <https://builds.apache.org/hudson/job/Tuscany-2x-deploy/ws/sca-2x/modules/node-impl/target/tuscany-node-impl-2.0-SNAPSHOT.jar>
[INFO] [source:jar-no-fork {execution: attach-sources}]
[INFO] Building jar: <https://builds.apache.org/hudson/job/Tuscany-2x-deploy/ws/sca-2x/modules/node-impl/target/tuscany-node-impl-2.0-SNAPSHOT-sources.jar>
[INFO] [install:install {execution: default-install}]
[INFO] Installing <https://builds.apache.org/hudson/job/Tuscany-2x-deploy/ws/sca-2x/modules/node-impl/target/tuscany-node-impl-2.0-SNAPSHOT.jar>
to <https://builds.apache.org/hudson/job/Tuscany-2x-deploy/ws/.repository/org/apache/tuscany/sca/tuscany-node-impl/2.0-SNAPSHOT/tuscany-node-impl-2.0-SNAPSHOT.jar>
[INFO] Installing <https://builds.apache.org/hudson/job/Tuscany-2x-deploy/ws/sca-2x/modules/node-impl/target/tuscany-node-impl-2.0-SNAPSHOT-sources.jar>
to <https://builds.apache.org/hudson/job/Tuscany-2x-deploy/ws/.repository/org/apache/tuscany/sca/tuscany-node-impl/2.0-SNAPSHOT/tuscany-node-impl-2.0-SNAPSHOT-sources.jar>
[INFO] [deploy:deploy {execution: default-deploy}]
[INFO] Retrieving previous build number from apache.snapshots.https
Uploading: https://repository.apache.org/content/repositories/snapshots/org/apache/tuscany/sca/tuscany-node-impl/2.0-SNAPSHOT/tuscany-node-impl-2.0-SNAPSHOT.jar
43K uploaded  (tuscany-node-impl-2.0-SNAPSHOT.jar)
[INFO] Retrieving previous metadata from apache.snapshots.https
[INFO] Uploading repository metadata for: 'artifact org.apache.tuscany.sca:tuscany-node-impl'
[INFO] Uploading project information for tuscany-node-impl 2.0-SNAPSHOT
[INFO] Retrieving previous metadata from apache.snapshots.https
[INFO] Uploading repository metadata for: 'snapshot org.apache.tuscany.sca:tuscany-node-impl:2.0-SNAPSHOT'
[INFO] Retrieving previous build number from apache.snapshots.https
Uploading: https://repository.apache.org/content/repositories/snapshots/org/apache/tuscany/sca/tuscany-node-impl/2.0-SNAPSHOT/tuscany-node-impl-2.0-SNAPSHOT-sources.jar
32K uploaded  (tuscany-node-impl-2.0-SNAPSHOT-sources.jar)
[JENKINS] Archiving disabled - not archiving <https://builds.apache.org/hudson/job/Tuscany-2x-deploy/ws/sca-2x/modules/node-impl/pom.xml>
[JENKINS] Archiving disabled - not archiving <https://builds.apache.org/hudson/job/Tuscany-2x-deploy/ws/sca-2x/modules/node-impl/target/tuscany-node-impl-2.0-SNAPSHOT.jar>
[JENKINS] Archiving disabled - not archiving <https://builds.apache.org/hudson/job/Tuscany-2x-deploy/ws/sca-2x/modules/node-impl/target/tuscany-node-impl-2.0-SNAPSHOT-sources.jar>
[INFO] ------------------------------------------------------------------------
[INFO] Building Apache Tuscany SCA Data API
[INFO]    task-segment: [clean, deploy]
[INFO] ------------------------------------------------------------------------
[INFO] [clean:clean {execution: default-clean}]
[INFO] Deleting <https://builds.apache.org/hudson/job/Tuscany-2x-deploy/ws/sca-2x/modules/data-api/target>
[INFO] [enforcer:enforce {execution: enforce-plugin-versions}]
[INFO] [remote-resources:process {execution: default}]
[INFO] [resources:resources {execution: default-resources}]
[INFO] Using 'UTF-8' encoding to copy filtered resources.
[INFO] skip non existing resourceDirectory <https://builds.apache.org/hudson/job/Tuscany-2x-deploy/ws/sca-2x/modules/data-api/src/main/resources>
[INFO] Copying 3 resources
[INFO] Copying 3 resources
[INFO] [compiler:compile {execution: default-compile}]
[INFO] Compiling 6 source files to <https://builds.apache.org/hudson/job/Tuscany-2x-deploy/ws/sca-2x/modules/data-api/target/classes>
[INFO] [resources:testResources {execution: default-testResources}]
[INFO] Using 'UTF-8' encoding to copy filtered resources.
[INFO] skip non existing resourceDirectory <https://builds.apache.org/hudson/job/Tuscany-2x-deploy/ws/sca-2x/modules/data-api/src/test/resources>
[INFO] Copying 3 resources
[INFO] [compiler:testCompile {execution: default-testCompile}]
[INFO] No sources to compile
[INFO] [surefire:test {execution: default-test}]
[INFO] Tests are skipped.
[INFO] [jar:jar {execution: default-jar}]
[INFO] Building jar: <https://builds.apache.org/hudson/job/Tuscany-2x-deploy/ws/sca-2x/modules/data-api/target/tuscany-data-api-2.0-SNAPSHOT.jar>
[INFO] [source:jar-no-fork {execution: attach-sources}]
[INFO] Building jar: <https://builds.apache.org/hudson/job/Tuscany-2x-deploy/ws/sca-2x/modules/data-api/target/tuscany-data-api-2.0-SNAPSHOT-sources.jar>
[INFO] [install:install {execution: default-install}]
[INFO] Installing <https://builds.apache.org/hudson/job/Tuscany-2x-deploy/ws/sca-2x/modules/data-api/target/tuscany-data-api-2.0-SNAPSHOT.jar>
to <https://builds.apache.org/hudson/job/Tuscany-2x-deploy/ws/.repository/org/apache/tuscany/sca/tuscany-data-api/2.0-SNAPSHOT/tuscany-data-api-2.0-SNAPSHOT.jar>
[INFO] Installing <https://builds.apache.org/hudson/job/Tuscany-2x-deploy/ws/sca-2x/modules/data-api/target/tuscany-data-api-2.0-SNAPSHOT-sources.jar>
to <https://builds.apache.org/hudson/job/Tuscany-2x-deploy/ws/.repository/org/apache/tuscany/sca/tuscany-data-api/2.0-SNAPSHOT/tuscany-data-api-2.0-SNAPSHOT-sources.jar>
[INFO] [deploy:deploy {execution: default-deploy}]
[INFO] Retrieving previous build number from apache.snapshots.https
Uploading: https://repository.apache.org/content/repositories/snapshots/org/apache/tuscany/sca/tuscany-data-api/2.0-SNAPSHOT/tuscany-data-api-2.0-SNAPSHOT.jar
15K uploaded  (tuscany-data-api-2.0-SNAPSHOT.jar)
[INFO] Retrieving previous metadata from apache.snapshots.https
[INFO] Uploading repository metadata for: 'artifact org.apache.tuscany.sca:tuscany-data-api'
[INFO] Uploading project information for tuscany-data-api 2.0-SNAPSHOT
[INFO] Retrieving previous metadata from apache.snapshots.https
[INFO] Uploading repository metadata for: 'snapshot org.apache.tuscany.sca:tuscany-data-api:2.0-SNAPSHOT'
[INFO] Retrieving previous build number from apache.snapshots.https
Uploading: https://repository.apache.org/content/repositories/snapshots/org/apache/tuscany/sca/tuscany-data-api/2.0-SNAPSHOT/tuscany-data-api-2.0-SNAPSHOT-sources.jar
15K uploaded  (tuscany-data-api-2.0-SNAPSHOT-sources.jar)
[JENKINS] Archiving disabled - not archiving <https://builds.apache.org/hudson/job/Tuscany-2x-deploy/ws/sca-2x/modules/data-api/pom.xml>
[JENKINS] Archiving disabled - not archiving <https://builds.apache.org/hudson/job/Tuscany-2x-deploy/ws/sca-2x/modules/data-api/target/tuscany-data-api-2.0-SNAPSHOT.jar>
[JENKINS] Archiving disabled - not archiving <https://builds.apache.org/hudson/job/Tuscany-2x-deploy/ws/sca-2x/modules/data-api/target/tuscany-data-api-2.0-SNAPSHOT-sources.jar>
[INFO] ------------------------------------------------------------------------
[INFO] Building Apache Tuscany SCA EndPoint Registry using Hazelcast
[INFO]    task-segment: [clean, deploy]
[INFO] ------------------------------------------------------------------------
[INFO] [clean:clean {execution: default-clean}]
[INFO] Deleting <https://builds.apache.org/hudson/job/Tuscany-2x-deploy/ws/sca-2x/modules/domain-hazelcast/target>
[INFO] [enforcer:enforce {execution: enforce-plugin-versions}]
[INFO] [remote-resources:process {execution: default}]
[INFO] [resources:resources {execution: default-resources}]
[INFO] Using 'UTF-8' encoding to copy filtered resources.
[INFO] Copying 3 resources
[INFO] Copying 1 resource
[INFO] Copying 3 resources
[INFO] [compiler:compile {execution: default-compile}]
[INFO] Compiling 12 source files to <https://builds.apache.org/hudson/job/Tuscany-2x-deploy/ws/sca-2x/modules/domain-hazelcast/target/classes>
[INFO] [resources:testResources {execution: default-testResources}]
[INFO] Using 'UTF-8' encoding to copy filtered resources.
[INFO] Copying 3 resources
[INFO] Copying 3 resources
[INFO] [compiler:testCompile {execution: default-testCompile}]
[INFO] Compiling 8 source files to <https://builds.apache.org/hudson/job/Tuscany-2x-deploy/ws/sca-2x/modules/domain-hazelcast/target/test-classes>
[INFO] [surefire:test {execution: default-test}]
[INFO] Tests are skipped.
[INFO] [jar:jar {execution: default-jar}]
[INFO] Building jar: <https://builds.apache.org/hudson/job/Tuscany-2x-deploy/ws/sca-2x/modules/domain-hazelcast/target/tuscany-domain-hazelcast-2.0-SNAPSHOT.jar>
[INFO] [source:jar-no-fork {execution: attach-sources}]
[INFO] Building jar: <https://builds.apache.org/hudson/job/Tuscany-2x-deploy/ws/sca-2x/modules/domain-hazelcast/target/tuscany-domain-hazelcast-2.0-SNAPSHOT-sources.jar>
[INFO] [install:install {execution: default-install}]
[INFO] Installing <https://builds.apache.org/hudson/job/Tuscany-2x-deploy/ws/sca-2x/modules/domain-hazelcast/target/tuscany-domain-hazelcast-2.0-SNAPSHOT.jar>
to <https://builds.apache.org/hudson/job/Tuscany-2x-deploy/ws/.repository/org/apache/tuscany/sca/tuscany-domain-hazelcast/2.0-SNAPSHOT/tuscany-domain-hazelcast-2.0-SNAPSHOT.jar>
[INFO] Installing <https://builds.apache.org/hudson/job/Tuscany-2x-deploy/ws/sca-2x/modules/domain-hazelcast/target/tuscany-domain-hazelcast-2.0-SNAPSHOT-sources.jar>
to <https://builds.apache.org/hudson/job/Tuscany-2x-deploy/ws/.repository/org/apache/tuscany/sca/tuscany-domain-hazelcast/2.0-SNAPSHOT/tuscany-domain-hazelcast-2.0-SNAPSHOT-sources.jar>
[INFO] [deploy:deploy {execution: default-deploy}]
[INFO] Retrieving previous build number from apache.snapshots.https
Uploading: https://repository.apache.org/content/repositories/snapshots/org/apache/tuscany/sca/tuscany-domain-hazelcast/2.0-SNAPSHOT/tuscany-domain-hazelcast-2.0-SNAPSHOT.jar
40K uploaded  (tuscany-domain-hazelcast-2.0-SNAPSHOT.jar)
[INFO] Retrieving previous metadata from apache.snapshots.https
[INFO] Uploading repository metadata for: 'artifact org.apache.tuscany.sca:tuscany-domain-hazelcast'
[INFO] Retrieving previous metadata from apache.snapshots.https
[INFO] Uploading repository metadata for: 'snapshot org.apache.tuscany.sca:tuscany-domain-hazelcast:2.0-SNAPSHOT'
[INFO] Uploading project information for tuscany-domain-hazelcast 2.0-SNAPSHOT
[INFO] Retrieving previous build number from apache.snapshots.https
Uploading: https://repository.apache.org/content/repositories/snapshots/org/apache/tuscany/sca/tuscany-domain-hazelcast/2.0-SNAPSHOT/tuscany-domain-hazelcast-2.0-SNAPSHOT-sources.jar
29K uploaded  (tuscany-domain-hazelcast-2.0-SNAPSHOT-sources.jar)
[JENKINS] Archiving disabled - not archiving <https://builds.apache.org/hudson/job/Tuscany-2x-deploy/ws/sca-2x/modules/domain-hazelcast/pom.xml>
[JENKINS] Archiving disabled - not archiving <https://builds.apache.org/hudson/job/Tuscany-2x-deploy/ws/sca-2x/modules/domain-hazelcast/target/tuscany-domain-hazelcast-2.0-SNAPSHOT.jar>
[JENKINS] Archiving disabled - not archiving <https://builds.apache.org/hudson/job/Tuscany-2x-deploy/ws/sca-2x/modules/domain-hazelcast/target/tuscany-domain-hazelcast-2.0-SNAPSHOT-sources.jar>
[INFO] ------------------------------------------------------------------------
[INFO] Building Apache Tuscany SCA Domain Node
[INFO]    task-segment: [clean, deploy]
[INFO] ------------------------------------------------------------------------
[INFO] [clean:clean {execution: default-clean}]
[INFO] Deleting <https://builds.apache.org/hudson/job/Tuscany-2x-deploy/ws/sca-2x/modules/domain-node/target>
[INFO] [enforcer:enforce {execution: enforce-plugin-versions}]
[INFO] [remote-resources:process {execution: default}]
[INFO] [resources:resources {execution: default-resources}]
[INFO] Using 'UTF-8' encoding to copy filtered resources.
[INFO] Copying 0 resource
[INFO] Copying 3 resources
[INFO] Copying 3 resources
[INFO] [compiler:compile {execution: default-compile}]
[INFO] Compiling 7 source files to <https://builds.apache.org/hudson/job/Tuscany-2x-deploy/ws/sca-2x/modules/domain-node/target/classes>
[INFO] -------------------------------------------------------------
[ERROR] COMPILATION ERROR : 
[INFO] -------------------------------------------------------------
[ERROR] <https://builds.apache.org/hudson/job/Tuscany-2x-deploy/ws/sca-2x/modules/domain-node/src/main/java/org/apache/tuscany/sca/impl/DependencyUtils.java>:[46,23]
package com.ibm.jvm.util does not exist

[ERROR] <https://builds.apache.org/hudson/job/Tuscany-2x-deploy/ws/sca-2x/modules/domain-node/src/main/java/org/apache/tuscany/sca/impl/DependencyUtils.java>:[60,20]
cannot find symbol
symbol  : class ByteArrayOutputStream
location: class org.apache.tuscany.sca.impl.DependencyUtils

[ERROR] <https://builds.apache.org/hudson/job/Tuscany-2x-deploy/ws/sca-2x/modules/domain-node/src/main/java/org/apache/tuscany/sca/impl/DependencyUtils.java>:[60,53]
cannot find symbol
symbol  : class ByteArrayOutputStream
location: class org.apache.tuscany.sca.impl.DependencyUtils

[INFO] 3 errors 
[INFO] -------------------------------------------------------------
[JENKINS] Archiving disabled - not archiving <https://builds.apache.org/hudson/job/Tuscany-2x-deploy/ws/sca-2x/modules/domain-node/pom.xml>
[INFO] ------------------------------------------------------------------------
[ERROR] BUILD FAILURE
[INFO] ------------------------------------------------------------------------
[INFO] Compilation failure

<https://builds.apache.org/hudson/job/Tuscany-2x-deploy/ws/sca-2x/modules/domain-node/src/main/java/org/apache/tuscany/sca/impl/DependencyUtils.java>:[46,23]
package com.ibm.jvm.util does not exist

<https://builds.apache.org/hudson/job/Tuscany-2x-deploy/ws/sca-2x/modules/domain-node/src/main/java/org/apache/tuscany/sca/impl/DependencyUtils.java>:[60,20]
cannot find symbol
symbol  : class ByteArrayOutputStream
location: class org.apache.tuscany.sca.impl.DependencyUtils

<https://builds.apache.org/hudson/job/Tuscany-2x-deploy/ws/sca-2x/modules/domain-node/src/main/java/org/apache/tuscany/sca/impl/DependencyUtils.java>:[60,53]
cannot find symbol
symbol  : class ByteArrayOutputStream
location: class org.apache.tuscany.sca.impl.DependencyUtils


[INFO] ------------------------------------------------------------------------
[INFO] For more information, run Maven with the -e switch
[INFO] ------------------------------------------------------------------------
[INFO] Total time: 8 minutes 59 seconds
[INFO] Finished at: Fri Jun 03 00:42:15 GMT+00:00 2011
[INFO] Final Memory: 57M/719M
[INFO] ------------------------------------------------------------------------
Sending e-mails to: commits@tuscany.apache.org
channel stopped


Mime
View raw message