tuscany-commits mailing list archives

Site index · List index
Message view « Date » · « Thread »
Top « Date » · « Thread »
From Apache Jenkins Server <hud...@hudson.apache.org>
Subject Build failed in Jenkins: Tuscany-2x #227
Date Fri, 03 Jun 2011 00:39:07 GMT
See <https://builds.apache.org/hudson/job/Tuscany-2x/227/changes>

Changes:

[antelder] Look at a reuseable way of calculating a contributions dependencies without having
to process and validate the entire contribution

------------------------------------------
[...truncated 18471 lines...]
Jun 3, 2011 12:38:49 AM com.hazelcast.cluster.ClusterManager
INFO: [foo] 

Members [2] {
	Member [127.0.0.1:9877] this
	Member [127.0.0.1:9878]
}

Jun 3, 2011 12:38:49 AM org.apache.tuscany.sca.registry.hazelcast.HazelcastDomainRegistry
entryRemoved
INFO:  Remote endpoint removed: (@1340650)Endpoint:  URI = ep1uri
Jun 3, 2011 12:38:49 AM org.apache.tuscany.sca.registry.hazelcast.HazelcastDomainRegistry
entryRemoved
INFO:  Remote endpoint removed: (@17284365)Endpoint:  URI = ep1uri
Starting reg1
Jun 3, 2011 12:38:49 AM com.hazelcast.impl.Node
WARNING: [foo] Neither multicast nor tcp/ip join is enabled! Trying tcp/ip join...
Jun 3, 2011 12:38:52 AM com.hazelcast.cluster.ClusterManager
INFO: [foo] 

Members [3] {
	Member [127.0.0.1:9877] this
	Member [127.0.0.1:9878]
	Member [127.0.0.1:9876]
}

Jun 3, 2011 12:38:52 AM com.hazelcast.cluster.ClusterManager
INFO: [foo] 

Members [3] {
	Member [127.0.0.1:9877]
	Member [127.0.0.1:9878] this
	Member [127.0.0.1:9876]
}

Jun 3, 2011 12:38:53 AM com.hazelcast.cluster.ClusterManager
INFO: [foo] 

Members [3] {
	Member [127.0.0.1:9877]
	Member [127.0.0.1:9878]
	Member [127.0.0.1:9876] this
}

Jun 3, 2011 12:38:54 AM org.apache.tuscany.sca.registry.hazelcast.HazelcastDomainRegistry
initHazelcastInstance
INFO: started node in domain 'bar' + at: /127.0.0.1:9876
adding ep1
Jun 3, 2011 12:38:55 AM org.apache.tuscany.sca.registry.hazelcast.HazelcastDomainRegistry
entryAdded
INFO:  Remote endpoint added: (@10202458)Endpoint:  URI = ep1uri
Jun 3, 2011 12:38:55 AM org.apache.tuscany.sca.registry.hazelcast.HazelcastDomainRegistry
entryAdded
INFO:  Remote endpoint added: (@9564165)Endpoint:  URI = ep1uri
Jun 3, 2011 12:38:55 AM org.apache.tuscany.sca.registry.hazelcast.HazelcastDomainRegistry
addEndpoint
INFO: Add endpoint - (@1947116)Endpoint:  URI = ep1uri
Stopping reg1
Stopping reg2
Jun 3, 2011 12:38:55 AM com.hazelcast.cluster.ClusterManager
INFO: [foo] 

Members [2] {
	Member [127.0.0.1:9877]
	Member [127.0.0.1:9878] this
}

Jun 3, 2011 12:38:55 AM com.hazelcast.cluster.ClusterManager
INFO: [foo] 

Members [2] {
	Member [127.0.0.1:9877] this
	Member [127.0.0.1:9878]
}

org.oasisopen.sca.ServiceRuntimeException: java.lang.RuntimeException: java.lang.reflect.InvocationTargetException
	at org.apache.tuscany.sca.registry.hazelcast.HazelcastDomainRegistry.memberRemoved(HazelcastDomainRegistry.java:493)
	at com.hazelcast.cluster.ClusterImpl$2.run(ClusterImpl.java:165)
	at com.hazelcast.impl.executor.ParallelExecutorService$ParallelExecutorImpl$ExecutionSegment.run(ParallelExecutorService.java:179)
	at java.util.concurrent.ThreadPoolExecutor$Worker.runTask(ThreadPoolExecutor.java:886)
	at java.util.concurrent.ThreadPoolExecutor$Worker.run(ThreadPoolExecutor.java:908)
	at java.lang.Thread.run(Thread.java:619)
Caused by: java.lang.RuntimeException: java.lang.reflect.InvocationTargetException
	at com.hazelcast.impl.FactoryImpl$MProxyImpl$DynamicInvoker.invoke(FactoryImpl.java:1909)
	at $Proxy6.containsKey(Unknown Source)
	at com.hazelcast.impl.FactoryImpl$MProxyImpl.containsKey(FactoryImpl.java:2109)
	at com.hazelcast.impl.FactoryImpl$MultiMapProxyImpl$MultiMapReal.containsKey(FactoryImpl.java:1775)
	at com.hazelcast.impl.FactoryImpl$MultiMapProxyImpl.containsKey(FactoryImpl.java:1673)
	at org.apache.tuscany.sca.registry.hazelcast.HazelcastDomainRegistry.memberRemoved(HazelcastDomainRegistry.java:463)
	... 5 more
Caused by: java.lang.reflect.InvocationTargetException
	at sun.reflect.NativeMethodAccessorImpl.invoke0(Native Method)
	at sun.reflect.NativeMethodAccessorImpl.invoke(NativeMethodAccessorImpl.java:39)
	at sun.reflect.DelegatingMethodAccessorImpl.invoke(DelegatingMethodAccessorImpl.java:25)
	at java.lang.reflect.Method.invoke(Method.java:597)
	at com.hazelcast.impl.FactoryImpl$MProxyImpl$DynamicInvoker.invoke(FactoryImpl.java:1902)
	... 10 more
Caused by: com.hazelcast.impl.base.RuntimeInterruptedException
	at com.hazelcast.impl.BaseManager$ResponseQueueCall.handleInterruptedException(BaseManager.java:485)
	at com.hazelcast.impl.BaseManager$ResponseQueueCall.waitAndGetResult(BaseManager.java:476)
	at com.hazelcast.impl.BaseManager$ResponseQueueCall.getRedoAwareResult(BaseManager.java:496)
	at com.hazelcast.impl.BaseManager$ResponseQueueCall.getResult(BaseManager.java:491)
	at com.hazelcast.impl.BaseManager$RequestBasedCall.getResultAsBoolean(BaseManager.java:362)
	at com.hazelcast.impl.BaseManager$ResponseQueueCall.getResultAsBoolean(BaseManager.java:445)
	at com.hazelcast.impl.BaseManager$RequestBasedCall.booleanCall(BaseManager.java:354)
	at com.hazelcast.impl.BaseManager$ResponseQueueCall.booleanCall(BaseManager.java:445)
	at com.hazelcast.impl.ConcurrentMapManager$MContainsKey.containsKey(ConcurrentMapManager.java:363)
	at com.hazelcast.impl.FactoryImpl$MProxyImpl$MProxyReal.containsKey(FactoryImpl.java:2584)
	... 15 more
Stopping reg3
org.oasisopen.sca.ServiceRuntimeException: java.lang.RuntimeException: java.lang.reflect.InvocationTargetException
	at org.apache.tuscany.sca.registry.hazelcast.HazelcastDomainRegistry.memberRemoved(HazelcastDomainRegistry.java:493)
	at com.hazelcast.cluster.ClusterImpl$2.run(ClusterImpl.java:165)
	at com.hazelcast.impl.executor.ParallelExecutorService$ParallelExecutorImpl$ExecutionSegment.run(ParallelExecutorService.java:179)
	at java.util.concurrent.ThreadPoolExecutor$Worker.runTask(ThreadPoolExecutor.java:886)
	at java.util.concurrent.ThreadPoolExecutor$Worker.run(ThreadPoolExecutor.java:908)
	at java.lang.Thread.run(Thread.java:619)
Caused by: java.lang.RuntimeException: java.lang.reflect.InvocationTargetException
	at com.hazelcast.impl.FactoryImpl$MProxyImpl$DynamicInvoker.invoke(FactoryImpl.java:1909)
	at $Proxy6.containsKey(Unknown Source)
	at com.hazelcast.impl.FactoryImpl$MProxyImpl.containsKey(FactoryImpl.java:2109)
	at com.hazelcast.impl.FactoryImpl$MultiMapProxyImpl$MultiMapReal.containsKey(FactoryImpl.java:1775)
	at com.hazelcast.impl.FactoryImpl$MultiMapProxyImpl.containsKey(FactoryImpl.java:1673)
	at org.apache.tuscany.sca.registry.hazelcast.HazelcastDomainRegistry.memberRemoved(HazelcastDomainRegistry.java:463)
	... 5 more
Caused by: java.lang.reflect.InvocationTargetException
	at sun.reflect.NativeMethodAccessorImpl.invoke0(Native Method)
	at sun.reflect.NativeMethodAccessorImpl.invoke(NativeMethodAccessorImpl.java:39)
	at sun.reflect.DelegatingMethodAccessorImpl.invoke(DelegatingMethodAccessorImpl.java:25)
	at java.lang.reflect.Method.invoke(Method.java:597)
	at com.hazelcast.impl.FactoryImpl$MProxyImpl$DynamicInvoker.invoke(FactoryImpl.java:1902)
	... 10 more
Caused by: com.hazelcast.impl.base.RuntimeInterruptedException
	at com.hazelcast.impl.BaseManager$ResponseQueueCall.handleInterruptedException(BaseManager.java:485)
	at com.hazelcast.impl.BaseManager$ResponseQueueCall.getRedoAwareResult(BaseManager.java:556)
	at com.hazelcast.impl.BaseManager$ResponseQueueCall.getResult(BaseManager.java:491)
	at com.hazelcast.impl.BaseManager$RequestBasedCall.getResultAsBoolean(BaseManager.java:362)
	at com.hazelcast.impl.BaseManager$ResponseQueueCall.getResultAsBoolean(BaseManager.java:445)
	at com.hazelcast.impl.BaseManager$RequestBasedCall.booleanCall(BaseManager.java:354)
	at com.hazelcast.impl.BaseManager$ResponseQueueCall.booleanCall(BaseManager.java:445)
	at com.hazelcast.impl.ConcurrentMapManager$MContainsKey.containsKey(ConcurrentMapManager.java:363)
	at com.hazelcast.impl.FactoryImpl$MProxyImpl$MProxyReal.containsKey(FactoryImpl.java:2584)
	... 15 more
done
Jun 3, 2011 12:38:55 AM com.hazelcast.impl.Node
WARNING: [foo] Neither multicast nor tcp/ip join is enabled! Trying tcp/ip join...
Jun 3, 2011 12:38:56 AM org.apache.tuscany.sca.registry.hazelcast.HazelcastDomainRegistry
initHazelcastInstance
INFO: started node in domain 'bar' + at: /127.0.0.1:9876
Jun 3, 2011 12:38:56 AM org.apache.tuscany.sca.registry.hazelcast.HazelcastDomainRegistry
addEndpoint
INFO: Add endpoint - (@25640626)Endpoint:  URI = ep1uri
Jun 3, 2011 12:38:59 AM com.hazelcast.cluster.ClusterManager
INFO: [foo] 

Members [2] {
	Member [127.0.0.1:9876] this
	Member [127.0.0.1:9877]
}

Jun 3, 2011 12:38:59 AM com.hazelcast.cluster.ClusterManager
INFO: [foo] 

Members [2] {
	Member [127.0.0.1:9876]
	Member [127.0.0.1:9877] this
}

Jun 3, 2011 12:39:01 AM org.apache.tuscany.sca.registry.hazelcast.HazelcastDomainRegistry
initHazelcastInstance
INFO: started node in domain 'bar' + at: /127.0.0.1:9877
Jun 3, 2011 12:39:01 AM com.hazelcast.cluster.ClusterManager
INFO: [foo] 

Members [1] {
	Member [127.0.0.1:9877] this
}

Jun 3, 2011 12:39:01 AM org.apache.tuscany.sca.registry.hazelcast.HazelcastDomainRegistry
entryRemoved
INFO:  Remote endpoint removed: (@11442116)Endpoint:  URI = ep1uri
Jun 3, 2011 12:39:01 AM org.apache.tuscany.sca.registry.hazelcast.HazelcastDomainRegistry
addEndpoint
INFO: Add endpoint - (@25640626)Endpoint:  URI = ep1uri
Tests run: 2, Failures: 0, Errors: 0, Skipped: 0, Time elapsed: 24.123 sec
Running org.apache.tuscany.sca.binding.hazelcast.HazelcastBindingTestCase
Tests run: 1, Failures: 0, Errors: 0, Skipped: 1, Time elapsed: 0.005 sec
Running org.apache.tuscany.sca.registry.hazelcast.RegistryTestCase
Tests run: 1, Failures: 0, Errors: 0, Skipped: 1, Time elapsed: 0.003 sec

Results :

Tests run: 4, Failures: 0, Errors: 0, Skipped: 2

[JENKINS] Recording test results
[INFO] [jar:jar {execution: default-jar}]
[INFO] Building jar: <https://builds.apache.org/hudson/job/Tuscany-2x/ws/sca-2x/modules/domain-hazelcast/target/tuscany-domain-hazelcast-2.0-SNAPSHOT.jar>
[INFO] [source:jar-no-fork {execution: attach-sources}]
[INFO] Building jar: <https://builds.apache.org/hudson/job/Tuscany-2x/ws/sca-2x/modules/domain-hazelcast/target/tuscany-domain-hazelcast-2.0-SNAPSHOT-sources.jar>
[INFO] [install:install {execution: default-install}]
[INFO] Installing <https://builds.apache.org/hudson/job/Tuscany-2x/ws/sca-2x/modules/domain-hazelcast/target/tuscany-domain-hazelcast-2.0-SNAPSHOT.jar>
to <https://builds.apache.org/hudson/job/Tuscany-2x/ws/.repository/org/apache/tuscany/sca/tuscany-domain-hazelcast/2.0-SNAPSHOT/tuscany-domain-hazelcast-2.0-SNAPSHOT.jar>
[INFO] Installing <https://builds.apache.org/hudson/job/Tuscany-2x/ws/sca-2x/modules/domain-hazelcast/target/tuscany-domain-hazelcast-2.0-SNAPSHOT-sources.jar>
to <https://builds.apache.org/hudson/job/Tuscany-2x/ws/.repository/org/apache/tuscany/sca/tuscany-domain-hazelcast/2.0-SNAPSHOT/tuscany-domain-hazelcast-2.0-SNAPSHOT-sources.jar>
[JENKINS] Archiving disabled - not archiving <https://builds.apache.org/hudson/job/Tuscany-2x/ws/sca-2x/modules/domain-hazelcast/pom.xml>
[JENKINS] Archiving disabled - not archiving <https://builds.apache.org/hudson/job/Tuscany-2x/ws/sca-2x/modules/domain-hazelcast/target/tuscany-domain-hazelcast-2.0-SNAPSHOT.jar>
[JENKINS] Archiving disabled - not archiving <https://builds.apache.org/hudson/job/Tuscany-2x/ws/sca-2x/modules/domain-hazelcast/target/tuscany-domain-hazelcast-2.0-SNAPSHOT-sources.jar>
[INFO] ------------------------------------------------------------------------
[INFO] Building Apache Tuscany SCA Domain Node
[INFO]    task-segment: [clean, install]
[INFO] ------------------------------------------------------------------------
[INFO] [clean:clean {execution: default-clean}]
[INFO] [enforcer:enforce {execution: enforce-plugin-versions}]
[INFO] [remote-resources:process {execution: default}]
[INFO] [resources:resources {execution: default-resources}]
[INFO] Using 'UTF-8' encoding to copy filtered resources.
[INFO] Copying 0 resource
[INFO] Copying 3 resources
[INFO] Copying 3 resources
[INFO] [compiler:compile {execution: default-compile}]
[INFO] Compiling 7 source files to <https://builds.apache.org/hudson/job/Tuscany-2x/ws/sca-2x/modules/domain-node/target/classes>
[INFO] -------------------------------------------------------------
[ERROR] COMPILATION ERROR : 
[INFO] -------------------------------------------------------------
[ERROR] <https://builds.apache.org/hudson/job/Tuscany-2x/ws/sca-2x/modules/domain-node/src/main/java/org/apache/tuscany/sca/impl/DependencyUtils.java>:[46,23]
package com.ibm.jvm.util does not exist

[ERROR] <https://builds.apache.org/hudson/job/Tuscany-2x/ws/sca-2x/modules/domain-node/src/main/java/org/apache/tuscany/sca/impl/DependencyUtils.java>:[60,20]
cannot find symbol
symbol  : class ByteArrayOutputStream
location: class org.apache.tuscany.sca.impl.DependencyUtils

[ERROR] <https://builds.apache.org/hudson/job/Tuscany-2x/ws/sca-2x/modules/domain-node/src/main/java/org/apache/tuscany/sca/impl/DependencyUtils.java>:[60,53]
cannot find symbol
symbol  : class ByteArrayOutputStream
location: class org.apache.tuscany.sca.impl.DependencyUtils

[INFO] 3 errors 
[INFO] -------------------------------------------------------------
[JENKINS] Archiving disabled - not archiving <https://builds.apache.org/hudson/job/Tuscany-2x/ws/sca-2x/modules/domain-node/pom.xml>
[INFO] ------------------------------------------------------------------------
[ERROR] BUILD FAILURE
[INFO] ------------------------------------------------------------------------
[INFO] Compilation failure

<https://builds.apache.org/hudson/job/Tuscany-2x/ws/sca-2x/modules/domain-node/src/main/java/org/apache/tuscany/sca/impl/DependencyUtils.java>:[46,23]
package com.ibm.jvm.util does not exist

<https://builds.apache.org/hudson/job/Tuscany-2x/ws/sca-2x/modules/domain-node/src/main/java/org/apache/tuscany/sca/impl/DependencyUtils.java>:[60,20]
cannot find symbol
symbol  : class ByteArrayOutputStream
location: class org.apache.tuscany.sca.impl.DependencyUtils

<https://builds.apache.org/hudson/job/Tuscany-2x/ws/sca-2x/modules/domain-node/src/main/java/org/apache/tuscany/sca/impl/DependencyUtils.java>:[60,53]
cannot find symbol
symbol  : class ByteArrayOutputStream
location: class org.apache.tuscany.sca.impl.DependencyUtils


[INFO] ------------------------------------------------------------------------
[INFO] For more information, run Maven with the -e switch
[INFO] ------------------------------------------------------------------------
[INFO] Total time: 7 minutes 26 seconds
[INFO] Finished at: Fri Jun 03 00:39:04 UTC 2011
[INFO] Final Memory: 67M/722M
[INFO] ------------------------------------------------------------------------
Sending e-mails to: commits@tuscany.apache.org
channel stopped


Mime
View raw message