tuscany-commits mailing list archives

Site index · List index
Message view « Date » · « Thread »
Top « Date » · « Thread »
From Apache Jenkins Server <hud...@hudson.apache.org>
Subject Build failed in Jenkins: Tuscany-2x-deploy » Apache Tuscany SCA Domain Node #282
Date Fri, 03 Jun 2011 00:39:53 GMT
See <https://builds.apache.org/hudson/job/Tuscany-2x-deploy/org.apache.tuscany.sca$tuscany-domain-node/282/changes>

Changes:

[antelder] Look at a reuseable way of calculating a contributions dependencies without having
to process and validate the entire contribution

------------------------------------------
[INFO] ------------------------------------------------------------------------
[INFO] Building Apache Tuscany SCA Domain Node
[INFO]    task-segment: [clean, deploy]
[INFO] ------------------------------------------------------------------------
[INFO] [clean:clean {execution: default-clean}]
[INFO] Deleting <https://builds.apache.org/hudson/job/Tuscany-2x-deploy/org.apache.tuscany.sca$tuscany-domain-node/ws/target>
[INFO] [enforcer:enforce {execution: enforce-plugin-versions}]
[INFO] [remote-resources:process {execution: default}]
[INFO] [resources:resources {execution: default-resources}]
[INFO] Using 'UTF-8' encoding to copy filtered resources.
[INFO] Copying 0 resource
[INFO] Copying 3 resources
[INFO] Copying 3 resources
[INFO] [compiler:compile {execution: default-compile}]
[INFO] Compiling 7 source files to <https://builds.apache.org/hudson/job/Tuscany-2x-deploy/org.apache.tuscany.sca$tuscany-domain-node/ws/target/classes>
[INFO] -------------------------------------------------------------
[ERROR] COMPILATION ERROR : 
[INFO] -------------------------------------------------------------
[ERROR] <https://builds.apache.org/hudson/job/Tuscany-2x-deploy/org.apache.tuscany.sca$tuscany-domain-node/ws/src/main/java/org/apache/tuscany/sca/impl/DependencyUtils.java>:[46,23]
package com.ibm.jvm.util does not exist

[ERROR] <https://builds.apache.org/hudson/job/Tuscany-2x-deploy/org.apache.tuscany.sca$tuscany-domain-node/ws/src/main/java/org/apache/tuscany/sca/impl/DependencyUtils.java>:[60,20]
cannot find symbol
symbol  : class ByteArrayOutputStream
location: class org.apache.tuscany.sca.impl.DependencyUtils

[ERROR] <https://builds.apache.org/hudson/job/Tuscany-2x-deploy/org.apache.tuscany.sca$tuscany-domain-node/ws/src/main/java/org/apache/tuscany/sca/impl/DependencyUtils.java>:[60,53]
cannot find symbol
symbol  : class ByteArrayOutputStream
location: class org.apache.tuscany.sca.impl.DependencyUtils

[INFO] 3 errors 
[INFO] -------------------------------------------------------------
[JENKINS] Archiving disabled - not archiving <https://builds.apache.org/hudson/job/Tuscany-2x-deploy/org.apache.tuscany.sca$tuscany-domain-node/ws/pom.xml>
[INFO] ------------------------------------------------------------------------
[ERROR] BUILD FAILURE
[INFO] ------------------------------------------------------------------------
[INFO] Compilation failure

<https://builds.apache.org/hudson/job/Tuscany-2x-deploy/org.apache.tuscany.sca$tuscany-domain-node/ws/src/main/java/org/apache/tuscany/sca/impl/DependencyUtils.java>:[46,23]
package com.ibm.jvm.util does not exist

<https://builds.apache.org/hudson/job/Tuscany-2x-deploy/org.apache.tuscany.sca$tuscany-domain-node/ws/src/main/java/org/apache/tuscany/sca/impl/DependencyUtils.java>:[60,20]
cannot find symbol
symbol  : class ByteArrayOutputStream
location: class org.apache.tuscany.sca.impl.DependencyUtils

<https://builds.apache.org/hudson/job/Tuscany-2x-deploy/org.apache.tuscany.sca$tuscany-domain-node/ws/src/main/java/org/apache/tuscany/sca/impl/DependencyUtils.java>:[60,53]
cannot find symbol
symbol  : class ByteArrayOutputStream
location: class org.apache.tuscany.sca.impl.DependencyUtils


[INFO] ------------------------------------------------------------------------
[INFO] For more information, run Maven with the -e switch
[INFO] ------------------------------------------------------------------------
[INFO] Total time: 8 minutes 59 seconds
[INFO] Finished at: Fri Jun 03 00:42:15 GMT+00:00 2011
[INFO] Final Memory: 57M/719M
[INFO] ------------------------------------------------------------------------


Mime
View raw message