tuscany-commits mailing list archives

Site index · List index
Message view « Date » · « Thread »
Top « Date » · « Thread »
From Apache Hudson Server <hud...@hudson.apache.org>
Subject Build failed in Hudson: Tuscany-2x » Apache Tuscany SCA Specification Compliance Tests Java CAA #978
Date Wed, 01 Dec 2010 02:59:24 GMT
See <https://hudson.apache.org/hudson/job/Tuscany-2x/org.apache.tuscany.sca$tuscany-compliance-test-java-caa/978/>

------------------------------------------
[INFO] ------------------------------------------------------------------------
[INFO] Building Apache Tuscany SCA Specification Compliance Tests Java CAA
[INFO]    task-segment: [clean, install]
[INFO] ------------------------------------------------------------------------
[INFO] [clean:clean {execution: default-clean}]
[INFO] [enforcer:enforce {execution: enforce-plugin-versions}]
[INFO] [remote-resources:process {execution: default}]
[INFO] [resources:resources {execution: default-resources}]
[INFO] Using 'UTF-8' encoding to copy filtered resources.
[INFO] skip non existing resourceDirectory <https://hudson.apache.org/hudson/job/Tuscany-2x/org.apache.tuscany.sca$tuscany-compliance-test-java-caa/ws/src/main/resources>
[INFO] Copying 0 resource
[INFO] Copying 3 resources
[INFO] [compiler:compile {execution: default-compile}]
[INFO] No sources to compile
[INFO] [dependency:unpack {execution: unpack}]
[INFO] Configured Artifact: org.apache.tuscany.sca:oasis-javacaa-contributions:2.0-SNAPSHOT:zip
[INFO] snapshot org.apache.tuscany.sca:oasis-javacaa-contributions:2.0-SNAPSHOT: checking
for updates from oasis.contributions
[INFO] snapshot org.apache.tuscany.sca:oasis-javacaa-contributions:2.0-SNAPSHOT: checking
for updates from apache.snapshots
Downloading: http://svn.apache.org/repos/asf/tuscany/maven/org/apache/tuscany/sca/oasis-javacaa-contributions/2.0-SNAPSHOT/oasis-javacaa-contributions-2.0-SNAPSHOT.zip
[INFO] Configured Artifact: org.apache.tuscany.sca:tuscany-otests-sca-j-caa-tests:2.0-SNAPSHOT:jar
[INFO] snapshot org.apache.tuscany.sca:tuscany-otests-sca-j-caa-tests:2.0-SNAPSHOT: checking
for updates from oasis.contributions
[INFO] snapshot org.apache.tuscany.sca:tuscany-otests-sca-j-caa-tests:2.0-SNAPSHOT: checking
for updates from apache.snapshots
[INFO] Unpacking /export/home/hudson/.m2/repository/org/apache/tuscany/sca/oasis-javacaa-contributions/2.0-SNAPSHOT/oasis-javacaa-contributions-2.0-SNAPSHOT.zip
to
  <https://hudson.apache.org/hudson/job/Tuscany-2x/org.apache.tuscany.sca$tuscany-compliance-test-java-caa/ws/target/oasis-contributions>
   with includes null and excludes:null
[INFO] Unpacking /export/home/hudson/.m2/repository/org/apache/tuscany/sca/tuscany-otests-sca-j-caa-tests/2.0-SNAPSHOT/tuscany-otests-sca-j-caa-tests-2.0-SNAPSHOT.jar
to
  <https://hudson.apache.org/hudson/job/Tuscany-2x/org.apache.tuscany.sca$tuscany-compliance-test-java-caa/ws/target/test-classes>
   with includes null and excludes:commons-logging.properties,oasis-sca-tests.properties,tuscany-oasis-sca-tests-errors.properties
[INFO] [resources:testResources {execution: default-testResources}]
[INFO] Using 'UTF-8' encoding to copy filtered resources.
[INFO] Copying 2 resources
[INFO] Copying 3 resources
[INFO] [compiler:testCompile {execution: default-testCompile}]
[INFO] Compiling 1 source file to <https://hudson.apache.org/hudson/job/Tuscany-2x/org.apache.tuscany.sca$tuscany-compliance-test-java-caa/ws/target/test-classes>
[INFO] -------------------------------------------------------------
[ERROR] COMPILATION ERROR : 
[INFO] -------------------------------------------------------------
[ERROR] <https://hudson.apache.org/hudson/job/Tuscany-2x/org.apache.tuscany.sca$tuscany-compliance-test-java-caa/ws/src/test/java/org/apache/tuscany/sca/otest/TuscanyRuntimeBridge.java>:[36,17]
package testClient does not exist

[ERROR] <https://hudson.apache.org/hudson/job/Tuscany-2x/org.apache.tuscany.sca$tuscany-compliance-test-java-caa/ws/src/test/java/org/apache/tuscany/sca/otest/TuscanyRuntimeBridge.java>:[37,13]
package client does not exist

[ERROR] <https://hudson.apache.org/hudson/job/Tuscany-2x/org.apache.tuscany.sca$tuscany-compliance-test-java-caa/ws/src/test/java/org/apache/tuscany/sca/otest/TuscanyRuntimeBridge.java>:[43,45]
cannot find symbol
symbol: class RuntimeBridge
public class TuscanyRuntimeBridge implements RuntimeBridge {

[ERROR] <https://hudson.apache.org/hudson/job/Tuscany-2x/org.apache.tuscany.sca$tuscany-compliance-test-java-caa/ws/src/test/java/org/apache/tuscany/sca/otest/TuscanyRuntimeBridge.java>:[215,26]
cannot find symbol
symbol  : class TestException_Exception
location: class org.apache.tuscany.sca.otest.TuscanyRuntimeBridge

[ERROR] <https://hudson.apache.org/hudson/job/Tuscany-2x/org.apache.tuscany.sca$tuscany-compliance-test-java-caa/ws/src/test/java/org/apache/tuscany/sca/otest/TuscanyRuntimeBridge.java>:[216,12]
cannot find symbol
symbol  : class TestException_Exception
location: class org.apache.tuscany.sca.otest.TuscanyRuntimeBridge

[ERROR] <https://hudson.apache.org/hudson/job/Tuscany-2x/org.apache.tuscany.sca$tuscany-compliance-test-java-caa/ws/src/test/java/org/apache/tuscany/sca/otest/TuscanyRuntimeBridge.java>:[216,42]
cannot find symbol
symbol  : class TestException_Exception
location: class org.apache.tuscany.sca.otest.TuscanyRuntimeBridge

[INFO] 6 errors 
[INFO] -------------------------------------------------------------
[HUDSON] Archiving <https://hudson.apache.org/hudson/job/Tuscany-2x/org.apache.tuscany.sca$tuscany-compliance-test-java-caa/ws/pom.xml>
to /home/hudson/hudson/jobs/Tuscany-2x/modules/org.apache.tuscany.sca$tuscany-compliance-test-java-caa/builds/2010-12-01_01-07-05/archive/org.apache.tuscany.sca/tuscany-compliance-test-java-caa/2.0-SNAPSHOT/pom.xml
[INFO] ------------------------------------------------------------------------
[ERROR] BUILD FAILURE
[INFO] ------------------------------------------------------------------------
[INFO] Compilation failure

<https://hudson.apache.org/hudson/job/Tuscany-2x/org.apache.tuscany.sca$tuscany-compliance-test-java-caa/ws/src/test/java/org/apache/tuscany/sca/otest/TuscanyRuntimeBridge.java>:[36,17]
package testClient does not exist

<https://hudson.apache.org/hudson/job/Tuscany-2x/org.apache.tuscany.sca$tuscany-compliance-test-java-caa/ws/src/test/java/org/apache/tuscany/sca/otest/TuscanyRuntimeBridge.java>:[37,13]
package client does not exist

<https://hudson.apache.org/hudson/job/Tuscany-2x/org.apache.tuscany.sca$tuscany-compliance-test-java-caa/ws/src/test/java/org/apache/tuscany/sca/otest/TuscanyRuntimeBridge.java>:[43,45]
cannot find symbol
symbol: class RuntimeBridge
public class TuscanyRuntimeBridge implements RuntimeBridge {

<https://hudson.apache.org/hudson/job/Tuscany-2x/org.apache.tuscany.sca$tuscany-compliance-test-java-caa/ws/src/test/java/org/apache/tuscany/sca/otest/TuscanyRuntimeBridge.java>:[215,26]
cannot find symbol
symbol  : class TestException_Exception
location: class org.apache.tuscany.sca.otest.TuscanyRuntimeBridge

<https://hudson.apache.org/hudson/job/Tuscany-2x/org.apache.tuscany.sca$tuscany-compliance-test-java-caa/ws/src/test/java/org/apache/tuscany/sca/otest/TuscanyRuntimeBridge.java>:[216,12]
cannot find symbol
symbol  : class TestException_Exception
location: class org.apache.tuscany.sca.otest.TuscanyRuntimeBridge

<https://hudson.apache.org/hudson/job/Tuscany-2x/org.apache.tuscany.sca$tuscany-compliance-test-java-caa/ws/src/test/java/org/apache/tuscany/sca/otest/TuscanyRuntimeBridge.java>:[216,42]
cannot find symbol
symbol  : class TestException_Exception
location: class org.apache.tuscany.sca.otest.TuscanyRuntimeBridge


[INFO] ------------------------------------------------------------------------
[INFO] For more information, run Maven with the -e switch
[INFO] ------------------------------------------------------------------------
[INFO] Total time: 111 minutes 24 seconds
[INFO] Finished at: Tue Nov 30 21:58:32 EST 2010
[INFO] Final Memory: 218M/738M
[INFO] ------------------------------------------------------------------------


Mime
View raw message