tuscany-commits mailing list archives

Site index · List index
Message view « Date » · « Thread »
Top « Date » · « Thread »
From Apache Hudson Server <hud...@hudson.apache.org>
Subject Build failed in Hudson: Tuscany-2x #926
Date Sun, 07 Nov 2010 01:49:14 GMT
See <https://hudson.apache.org/hudson/job/Tuscany-2x/926/>

------------------------------------------
[...truncated 57058 lines...]
[INFO] Copying 0 resource
[INFO] Copying 3 resources
[INFO] [compiler:compile {execution: default-compile}]
[INFO] No sources to compile
[INFO] [resources:testResources {execution: default-testResources}]
[INFO] Using 'UTF-8' encoding to copy filtered resources.
[INFO] Copying 2 resources
[INFO] Copying 3 resources
[INFO] [dependency:unpack {execution: unpack}]
[INFO] Configured Artifact: org.apache.tuscany.sca:oasis-javacaa-contributions:2.0-SNAPSHOT:zip
[INFO] snapshot org.apache.tuscany.sca:oasis-javacaa-contributions:2.0-SNAPSHOT: checking
for updates from oasis.contributions
[INFO] snapshot org.apache.tuscany.sca:oasis-javacaa-contributions:2.0-SNAPSHOT: checking
for updates from apache.snapshots
Downloading: http://svn.apache.org/repos/asf/tuscany/maven/org/apache/tuscany/sca/oasis-javacaa-contributions/2.0-SNAPSHOT/oasis-javacaa-contributions-2.0-SNAPSHOT.zip
[INFO] Configured Artifact: org.apache.tuscany.sca:tuscany-otests-sca-j-caa-tests:2.0-SNAPSHOT:jar
[INFO] Unpacking /home/hudson/.m2/repository/org/apache/tuscany/sca/oasis-javacaa-contributions/2.0-SNAPSHOT/oasis-javacaa-contributions-2.0-SNAPSHOT.zip
to
  <https://hudson.apache.org/hudson/job/Tuscany-2x/ws/sca-2x/testing/compliance-tests/java-caa/target/oasis-contributions>
   with includes null and excludes:null
[INFO] Unpacking /home/hudson/.m2/repository/org/apache/tuscany/sca/tuscany-otests-sca-j-caa-tests/2.0-SNAPSHOT/tuscany-otests-sca-j-caa-tests-2.0-SNAPSHOT.jar
to
  <https://hudson.apache.org/hudson/job/Tuscany-2x/ws/sca-2x/testing/compliance-tests/java-caa/target/test-classes>
   with includes null and excludes:commons-logging.properties,oasis-sca-tests.properties,tuscany-oasis-sca-tests-errors.properties
[INFO] [compiler:testCompile {execution: default-testCompile}]
[INFO] Compiling 1 source file to <https://hudson.apache.org/hudson/job/Tuscany-2x/ws/sca-2x/testing/compliance-tests/java-caa/target/test-classes>
[INFO] -------------------------------------------------------------
[ERROR] COMPILATION ERROR : 
[INFO] -------------------------------------------------------------
[ERROR] <https://hudson.apache.org/hudson/job/Tuscany-2x/ws/sca-2x/testing/compliance-tests/java-caa/src/test/java/org/apache/tuscany/sca/otest/TuscanyRuntimeBridge.java>:[36,17]
package testClient does not exist

[ERROR] <https://hudson.apache.org/hudson/job/Tuscany-2x/ws/sca-2x/testing/compliance-tests/java-caa/src/test/java/org/apache/tuscany/sca/otest/TuscanyRuntimeBridge.java>:[37,13]
package client does not exist

[ERROR] <https://hudson.apache.org/hudson/job/Tuscany-2x/ws/sca-2x/testing/compliance-tests/java-caa/src/test/java/org/apache/tuscany/sca/otest/TuscanyRuntimeBridge.java>:[43,45]
cannot find symbol
symbol: class RuntimeBridge
public class TuscanyRuntimeBridge implements RuntimeBridge {

[ERROR] <https://hudson.apache.org/hudson/job/Tuscany-2x/ws/sca-2x/testing/compliance-tests/java-caa/src/test/java/org/apache/tuscany/sca/otest/TuscanyRuntimeBridge.java>:[215,26]
cannot find symbol
symbol  : class TestException_Exception
location: class org.apache.tuscany.sca.otest.TuscanyRuntimeBridge

[ERROR] <https://hudson.apache.org/hudson/job/Tuscany-2x/ws/sca-2x/testing/compliance-tests/java-caa/src/test/java/org/apache/tuscany/sca/otest/TuscanyRuntimeBridge.java>:[216,12]
cannot find symbol
symbol  : class TestException_Exception
location: class org.apache.tuscany.sca.otest.TuscanyRuntimeBridge

[ERROR] <https://hudson.apache.org/hudson/job/Tuscany-2x/ws/sca-2x/testing/compliance-tests/java-caa/src/test/java/org/apache/tuscany/sca/otest/TuscanyRuntimeBridge.java>:[216,42]
cannot find symbol
symbol  : class TestException_Exception
location: class org.apache.tuscany.sca.otest.TuscanyRuntimeBridge

[INFO] 6 errors 
[INFO] -------------------------------------------------------------
[HUDSON] Archiving <https://hudson.apache.org/hudson/job/Tuscany-2x/ws/sca-2x/testing/compliance-tests/java-caa/pom.xml>
to /home/hudson/hudson/jobs/Tuscany-2x/modules/org.apache.tuscany.sca$tuscany-compliance-test-java-caa/builds/2010-11-07_00-54-41/archive/org.apache.tuscany.sca/tuscany-compliance-test-java-caa/2.0-SNAPSHOT/pom.xml
[INFO] ------------------------------------------------------------------------
[ERROR] BUILD FAILURE
[INFO] ------------------------------------------------------------------------
[INFO] Compilation failure

<https://hudson.apache.org/hudson/job/Tuscany-2x/ws/sca-2x/testing/compliance-tests/java-caa/src/test/java/org/apache/tuscany/sca/otest/TuscanyRuntimeBridge.java>:[36,17]
package testClient does not exist

<https://hudson.apache.org/hudson/job/Tuscany-2x/ws/sca-2x/testing/compliance-tests/java-caa/src/test/java/org/apache/tuscany/sca/otest/TuscanyRuntimeBridge.java>:[37,13]
package client does not exist

<https://hudson.apache.org/hudson/job/Tuscany-2x/ws/sca-2x/testing/compliance-tests/java-caa/src/test/java/org/apache/tuscany/sca/otest/TuscanyRuntimeBridge.java>:[43,45]
cannot find symbol
symbol: class RuntimeBridge
public class TuscanyRuntimeBridge implements RuntimeBridge {

<https://hudson.apache.org/hudson/job/Tuscany-2x/ws/sca-2x/testing/compliance-tests/java-caa/src/test/java/org/apache/tuscany/sca/otest/TuscanyRuntimeBridge.java>:[215,26]
cannot find symbol
symbol  : class TestException_Exception
location: class org.apache.tuscany.sca.otest.TuscanyRuntimeBridge

<https://hudson.apache.org/hudson/job/Tuscany-2x/ws/sca-2x/testing/compliance-tests/java-caa/src/test/java/org/apache/tuscany/sca/otest/TuscanyRuntimeBridge.java>:[216,12]
cannot find symbol
symbol  : class TestException_Exception
location: class org.apache.tuscany.sca.otest.TuscanyRuntimeBridge

<https://hudson.apache.org/hudson/job/Tuscany-2x/ws/sca-2x/testing/compliance-tests/java-caa/src/test/java/org/apache/tuscany/sca/otest/TuscanyRuntimeBridge.java>:[216,42]
cannot find symbol
symbol  : class TestException_Exception
location: class org.apache.tuscany.sca.otest.TuscanyRuntimeBridge


[INFO] ------------------------------------------------------------------------
[INFO] For more information, run Maven with the -e switch
[INFO] ------------------------------------------------------------------------
[INFO] Total time: 54 minutes 12 seconds
[INFO] Finished at: Sun Nov 07 01:49:02 UTC 2010
[INFO] Final Memory: 212M/740M
[INFO] ------------------------------------------------------------------------
Sending e-mails to: commits@tuscany.apache.org
channel stopped
2010-11-07 01:49:04.361::INFO:  Shutdown hook executing
2010-11-07 01:49:04.361::INFO:  Shutdown hook complete
2010-11-07 01:49:05.361::INFO:  Shutdown hook complete
2010-11-07 01:49:06.361::INFO:  Shutdown hook complete
2010-11-07 01:49:07.362::INFO:  Shutdown hook complete
2010-11-07 01:49:08.362::INFO:  Shutdown hook complete
2010-11-07 01:49:09.362::INFO:  Shutdown hook complete
2010-11-07 01:49:10.865::WARN:  failed org.mortbay.jetty.plugin.Jetty6PluginWebAppContext@75ece8{/helloworld-jsf,<https://hudson.apache.org/hudson/job/Tuscany-2x/ws/sca-2x/samples/learning-more/implementation-web/helloworld-jsf/src/main/webapp}>
java.lang.LinkageError: loader constraint violation: loader (instance of org/mortbay/jetty/webapp/WebAppClassLoader)
previously initiated loading for a different type with name "javax/el/ExpressionFactory"
	at java.lang.ClassLoader.defineClass1(Native Method)
	at java.lang.ClassLoader.defineClassCond(ClassLoader.java:632)
	at java.lang.ClassLoader.defineClass(ClassLoader.java:616)
	at java.security.SecureClassLoader.defineClass(SecureClassLoader.java:141)
	at java.net.URLClassLoader.defineClass(URLClassLoader.java:283)
	at java.net.URLClassLoader.access$000(URLClassLoader.java:58)
	at java.net.URLClassLoader$1.run(URLClassLoader.java:197)
	at java.security.AccessController.doPrivileged(Native Method)
	at java.net.URLClassLoader.findClass(URLClassLoader.java:190)
	at org.mortbay.jetty.webapp.WebAppClassLoader.loadClass(WebAppClassLoader.java:392)
	at org.mortbay.jetty.webapp.WebAppClassLoader.loadClass(WebAppClassLoader.java:363)
	at java.lang.Class.getDeclaredMethods0(Native Method)
	at java.lang.Class.privateGetDeclaredMethods(Class.java:2427)
	at java.lang.Class.getDeclaredMethods(Class.java:1791)
	at org.apache.myfaces.config.annotation.NoInjectionAnnotationLifecycleProvider.destroyInstance(NoInjectionAnnotationLifecycleProvider.java:90)
	at org.apache.myfaces.webapp.AbstractMyFacesListener.doPreDestroy(AbstractMyFacesListener.java:59)
	at org.apache.myfaces.webapp.StartupServletContextListener.doPredestroy(StartupServletContextListener.java:123)
	at org.apache.myfaces.webapp.StartupServletContextListener.contextDestroyed(StartupServletContextListener.java:104)
	at org.mortbay.jetty.handler.ContextHandler.doStop(ContextHandler.java:599)
	at org.mortbay.jetty.webapp.WebAppContext.doStop(WebAppContext.java:504)
	at org.mortbay.jetty.plugin.Jetty6PluginWebAppContext.doStop(Jetty6PluginWebAppContext.java:132)
	at org.mortbay.component.AbstractLifeCycle.stop(AbstractLifeCycle.java:78)
	at org.mortbay.jetty.handler.HandlerCollection.doStop(HandlerCollection.java:169)
	at org.mortbay.component.AbstractLifeCycle.stop(AbstractLifeCycle.java:78)
	at org.mortbay.jetty.handler.HandlerCollection.doStop(HandlerCollection.java:169)
	at org.mortbay.component.AbstractLifeCycle.stop(AbstractLifeCycle.java:78)
	at org.mortbay.jetty.handler.HandlerWrapper.doStop(HandlerWrapper.java:142)
	at org.mortbay.jetty.Server.doStop(Server.java:283)
	at org.mortbay.component.AbstractLifeCycle.stop(AbstractLifeCycle.java:78)
	at org.mortbay.jetty.Server$ShutdownHookThread.run(Server.java:561)
2010-11-07 01:49:10.866::WARN:  failed ContextHandlerCollection@1d37a85
java.lang.LinkageError: loader constraint violation: loader (instance of org/mortbay/jetty/webapp/WebAppClassLoader)
previously initiated loading for a different type with name "javax/el/ExpressionFactory"
	at java.lang.ClassLoader.defineClass1(Native Method)
	at java.lang.ClassLoader.defineClassCond(ClassLoader.java:632)
	at java.lang.ClassLoader.defineClass(ClassLoader.java:616)
	at java.security.SecureClassLoader.defineClass(SecureClassLoader.java:141)
	at java.net.URLClassLoader.defineClass(URLClassLoader.java:283)
	at java.net.URLClassLoader.access$000(URLClassLoader.java:58)
	at java.net.URLClassLoader$1.run(URLClassLoader.java:197)
	at java.security.AccessController.doPrivileged(Native Method)
	at java.net.URLClassLoader.findClass(URLClassLoader.java:190)
	at org.mortbay.jetty.webapp.WebAppClassLoader.loadClass(WebAppClassLoader.java:392)
	at org.mortbay.jetty.webapp.WebAppClassLoader.loadClass(WebAppClassLoader.java:363)
	at java.lang.Class.getDeclaredMethods0(Native Method)
	at java.lang.Class.privateGetDeclaredMethods(Class.java:2427)
	at java.lang.Class.getDeclaredMethods(Class.java:1791)
	at org.apache.myfaces.config.annotation.NoInjectionAnnotationLifecycleProvider.destroyInstance(NoInjectionAnnotationLifecycleProvider.java:90)
	at org.apache.myfaces.webapp.AbstractMyFacesListener.doPreDestroy(AbstractMyFacesListener.java:59)
	at org.apache.myfaces.webapp.StartupServletContextListener.doPredestroy(StartupServletContextListener.java:123)
	at org.apache.myfaces.webapp.StartupServletContextListener.contextDestroyed(StartupServletContextListener.java:104)
	at org.mortbay.jetty.handler.ContextHandler.doStop(ContextHandler.java:599)
	at org.mortbay.jetty.webapp.WebAppContext.doStop(WebAppContext.java:504)
	at org.mortbay.jetty.plugin.Jetty6PluginWebAppContext.doStop(Jetty6PluginWebAppContext.java:132)
	at org.mortbay.component.AbstractLifeCycle.stop(AbstractLifeCycle.java:78)
	at org.mortbay.jetty.handler.HandlerCollection.doStop(HandlerCollection.java:169)
	at org.mortbay.component.AbstractLifeCycle.stop(AbstractLifeCycle.java:78)
	at org.mortbay.jetty.handler.HandlerCollection.doStop(HandlerCollection.java:169)
	at org.mortbay.component.AbstractLifeCycle.stop(AbstractLifeCycle.java:78)
	at org.mortbay.jetty.handler.HandlerWrapper.doStop(HandlerWrapper.java:142)
	at org.mortbay.jetty.Server.doStop(Server.java:283)
	at org.mortbay.component.AbstractLifeCycle.stop(AbstractLifeCycle.java:78)
	at org.mortbay.jetty.Server$ShutdownHookThread.run(Server.java:561)
2010-11-07 01:49:10.866::WARN:  failed HandlerCollection@110b7d3
java.lang.LinkageError: loader constraint violation: loader (instance of org/mortbay/jetty/webapp/WebAppClassLoader)
previously initiated loading for a different type with name "javax/el/ExpressionFactory"
	at java.lang.ClassLoader.defineClass1(Native Method)
	at java.lang.ClassLoader.defineClassCond(ClassLoader.java:632)
	at java.lang.ClassLoader.defineClass(ClassLoader.java:616)
	at java.security.SecureClassLoader.defineClass(SecureClassLoader.java:141)
	at java.net.URLClassLoader.defineClass(URLClassLoader.java:283)
	at java.net.URLClassLoader.access$000(URLClassLoader.java:58)
	at java.net.URLClassLoader$1.run(URLClassLoader.java:197)
	at java.security.AccessController.doPrivileged(Native Method)
	at java.net.URLClassLoader.findClass(URLClassLoader.java:190)
	at org.mortbay.jetty.webapp.WebAppClassLoader.loadClass(WebAppClassLoader.java:392)
	at org.mortbay.jetty.webapp.WebAppClassLoader.loadClass(WebAppClassLoader.java:363)
	at java.lang.Class.getDeclaredMethods0(Native Method)
	at java.lang.Class.privateGetDeclaredMethods(Class.java:2427)
	at java.lang.Class.getDeclaredMethods(Class.java:1791)
	at org.apache.myfaces.config.annotation.NoInjectionAnnotationLifecycleProvider.destroyInstance(NoInjectionAnnotationLifecycleProvider.java:90)
	at org.apache.myfaces.webapp.AbstractMyFacesListener.doPreDestroy(AbstractMyFacesListener.java:59)
	at org.apache.myfaces.webapp.StartupServletContextListener.doPredestroy(StartupServletContextListener.java:123)
	at org.apache.myfaces.webapp.StartupServletContextListener.contextDestroyed(StartupServletContextListener.java:104)
	at org.mortbay.jetty.handler.ContextHandler.doStop(ContextHandler.java:599)
	at org.mortbay.jetty.webapp.WebAppContext.doStop(WebAppContext.java:504)
	at org.mortbay.jetty.plugin.Jetty6PluginWebAppContext.doStop(Jetty6PluginWebAppContext.java:132)
	at org.mortbay.component.AbstractLifeCycle.stop(AbstractLifeCycle.java:78)
	at org.mortbay.jetty.handler.HandlerCollection.doStop(HandlerCollection.java:169)
	at org.mortbay.component.AbstractLifeCycle.stop(AbstractLifeCycle.java:78)
	at org.mortbay.jetty.handler.HandlerCollection.doStop(HandlerCollection.java:169)
	at org.mortbay.component.AbstractLifeCycle.stop(AbstractLifeCycle.java:78)
	at org.mortbay.jetty.handler.HandlerWrapper.doStop(HandlerWrapper.java:142)
	at org.mortbay.jetty.Server.doStop(Server.java:283)
	at org.mortbay.component.AbstractLifeCycle.stop(AbstractLifeCycle.java:78)
	at org.mortbay.jetty.Server$ShutdownHookThread.run(Server.java:561)
2010-11-07 01:49:10.866::WARN:  failed Server@14dfa74
java.lang.LinkageError: loader constraint violation: loader (instance of org/mortbay/jetty/webapp/WebAppClassLoader)
previously initiated loading for a different type with name "javax/el/ExpressionFactory"
	at java.lang.ClassLoader.defineClass1(Native Method)
	at java.lang.ClassLoader.defineClassCond(ClassLoader.java:632)
	at java.lang.ClassLoader.defineClass(ClassLoader.java:616)
	at java.security.SecureClassLoader.defineClass(SecureClassLoader.java:141)
	at java.net.URLClassLoader.defineClass(URLClassLoader.java:283)
	at java.net.URLClassLoader.access$000(URLClassLoader.java:58)
	at java.net.URLClassLoader$1.run(URLClassLoader.java:197)
	at java.security.AccessController.doPrivileged(Native Method)
	at java.net.URLClassLoader.findClass(URLClassLoader.java:190)
	at org.mortbay.jetty.webapp.WebAppClassLoader.loadClass(WebAppClassLoader.java:392)
	at org.mortbay.jetty.webapp.WebAppClassLoader.loadClass(WebAppClassLoader.java:363)
	at java.lang.Class.getDeclaredMethods0(Native Method)
	at java.lang.Class.privateGetDeclaredMethods(Class.java:2427)
	at java.lang.Class.getDeclaredMethods(Class.java:1791)
	at org.apache.myfaces.config.annotation.NoInjectionAnnotationLifecycleProvider.destroyInstance(NoInjectionAnnotationLifecycleProvider.java:90)
	at org.apache.myfaces.webapp.AbstractMyFacesListener.doPreDestroy(AbstractMyFacesListener.java:59)
	at org.apache.myfaces.webapp.StartupServletContextListener.doPredestroy(StartupServletContextListener.java:123)
	at org.apache.myfaces.webapp.StartupServletContextListener.contextDestroyed(StartupServletContextListener.java:104)
	at org.mortbay.jetty.handler.ContextHandler.doStop(ContextHandler.java:599)
	at org.mortbay.jetty.webapp.WebAppContext.doStop(WebAppContext.java:504)
	at org.mortbay.jetty.plugin.Jetty6PluginWebAppContext.doStop(Jetty6PluginWebAppContext.java:132)
	at org.mortbay.component.AbstractLifeCycle.stop(AbstractLifeCycle.java:78)
	at org.mortbay.jetty.handler.HandlerCollection.doStop(HandlerCollection.java:169)
	at org.mortbay.component.AbstractLifeCycle.stop(AbstractLifeCycle.java:78)
	at org.mortbay.jetty.handler.HandlerCollection.doStop(HandlerCollection.java:169)
	at org.mortbay.component.AbstractLifeCycle.stop(AbstractLifeCycle.java:78)
	at org.mortbay.jetty.handler.HandlerWrapper.doStop(HandlerWrapper.java:142)
	at org.mortbay.jetty.Server.doStop(Server.java:283)
	at org.mortbay.component.AbstractLifeCycle.stop(AbstractLifeCycle.java:78)
	at org.mortbay.jetty.Server$ShutdownHookThread.run(Server.java:561)
Exception in thread "Shutdown" java.lang.LinkageError: loader constraint violation: loader
(instance of org/mortbay/jetty/webapp/WebAppClassLoader) previously initiated loading for
a different type with name "javax/el/ExpressionFactory"
	at java.lang.ClassLoader.defineClass1(Native Method)
	at java.lang.ClassLoader.defineClassCond(ClassLoader.java:632)
	at java.lang.ClassLoader.defineClass(ClassLoader.java:616)
	at java.security.SecureClassLoader.defineClass(SecureClassLoader.java:141)
	at java.net.URLClassLoader.defineClass(URLClassLoader.java:283)
	at java.net.URLClassLoader.access$000(URLClassLoader.java:58)
	at java.net.URLClassLoader$1.run(URLClassLoader.java:197)
	at java.security.AccessController.doPrivileged(Native Method)
	at java.net.URLClassLoader.findClass(URLClassLoader.java:190)
	at org.mortbay.jetty.webapp.WebAppClassLoader.loadClass(WebAppClassLoader.java:392)
	at org.mortbay.jetty.webapp.WebAppClassLoader.loadClass(WebAppClassLoader.java:363)
	at java.lang.Class.getDeclaredMethods0(Native Method)
	at java.lang.Class.privateGetDeclaredMethods(Class.java:2427)
	at java.lang.Class.getDeclaredMethods(Class.java:1791)
	at org.apache.myfaces.config.annotation.NoInjectionAnnotationLifecycleProvider.destroyInstance(NoInjectionAnnotationLifecycleProvider.java:90)
	at org.apache.myfaces.webapp.AbstractMyFacesListener.doPreDestroy(AbstractMyFacesListener.java:59)
	at org.apache.myfaces.webapp.StartupServletContextListener.doPredestroy(StartupServletContextListener.java:123)
	at org.apache.myfaces.webapp.StartupServletContextListener.contextDestroyed(StartupServletContextListener.java:104)
	at org.mortbay.jetty.handler.ContextHandler.doStop(ContextHandler.java:599)
	at org.mortbay.jetty.webapp.WebAppContext.doStop(WebAppContext.java:504)
	at org.mortbay.jetty.plugin.Jetty6PluginWebAppContext.doStop(Jetty6PluginWebAppContext.java:132)
	at org.mortbay.component.AbstractLifeCycle.stop(AbstractLifeCycle.java:78)
	at org.mortbay.jetty.handler.HandlerCollection.doStop(HandlerCollection.java:169)
	at org.mortbay.component.AbstractLifeCycle.stop(AbstractLifeCycle.java:78)
	at org.mortbay.jetty.handler.HandlerCollection.doStop(HandlerCollection.java:169)
	at org.mortbay.component.AbstractLifeCycle.stop(AbstractLifeCycle.java:78)
	at org.mortbay.jetty.handler.HandlerWrapper.doStop(HandlerWrapper.java:142)
	at org.mortbay.jetty.Server.doStop(Server.java:283)
	at org.mortbay.component.AbstractLifeCycle.stop(AbstractLifeCycle.java:78)
	at org.mortbay.jetty.Server$ShutdownHookThread.run(Server.java:561)


Mime
View raw message