tuscany-commits mailing list archives

Site index · List index
Message view « Date » · « Thread »
Top « Date » · « Thread »
From Apache Hudson Server <hud...@hudson.apache.org>
Subject Build failed in Hudson: Tuscany-2x #824
Date Mon, 30 Aug 2010 01:07:06 GMT
See <https://hudson.apache.org/hudson/job/Tuscany-2x/824/>

------------------------------------------
[...truncated 11242 lines...]
[INFO] Unable to find resource 'org.apache.maven.surefire:surefire-api:pom:2.6' in repository
apache.incubator (http://people.apache.org/repo/m2-incubating-repository)
Downloading: http://repository.apache.org/snapshots/org/apache/maven/surefire/surefire-api/2.6/surefire-api-2.6.pom
[INFO] Unable to find resource 'org.apache.maven.surefire:surefire-api:pom:2.6' in repository
apache.snapshots (http://repository.apache.org/snapshots)
Downloading: http://snapshots.repository.codehaus.org/org/apache/maven/surefire/surefire-api/2.6/surefire-api-2.6.pom
[INFO] Unable to find resource 'org.apache.maven.surefire:surefire-api:pom:2.6' in repository
codehaus-snapshot (http://snapshots.repository.codehaus.org)
Downloading: http://repo2.maven.org/maven2/org/apache/maven/surefire/surefire-api/2.6/surefire-api-2.6.pom

Downloading: http://people.apache.org/repo/m2-ibiblio-rsync-repository/org/apache/maven/surefire/maven-surefire-common/2.6/maven-surefire-common-2.6.pom
[INFO] Unable to find resource 'org.apache.maven.surefire:maven-surefire-common:pom:2.6' in
repository apache (http://people.apache.org/repo/m2-ibiblio-rsync-repository)
Downloading: http://people.apache.org/repo/m2-incubating-repository/org/apache/maven/surefire/maven-surefire-common/2.6/maven-surefire-common-2.6.pom
[INFO] Unable to find resource 'org.apache.maven.surefire:maven-surefire-common:pom:2.6' in
repository apache.incubator (http://people.apache.org/repo/m2-incubating-repository)
Downloading: http://repository.apache.org/snapshots/org/apache/maven/surefire/maven-surefire-common/2.6/maven-surefire-common-2.6.pom
[INFO] Unable to find resource 'org.apache.maven.surefire:maven-surefire-common:pom:2.6' in
repository apache.snapshots (http://repository.apache.org/snapshots)
Downloading: http://snapshots.repository.codehaus.org/org/apache/maven/surefire/maven-surefire-common/2.6/maven-surefire-common-2.6.pom
[INFO] Unable to find resource 'org.apache.maven.surefire:maven-surefire-common:pom:2.6' in
repository codehaus-snapshot (http://snapshots.repository.codehaus.org)
Downloading: http://repo2.maven.org/maven2/org/apache/maven/surefire/maven-surefire-common/2.6/maven-surefire-common-2.6.pom

Downloading: http://people.apache.org/repo/m2-ibiblio-rsync-repository/org/apache/maven/surefire/surefire-booter/2.6/surefire-booter-2.6.jar
[INFO] Unable to find resource 'org.apache.maven.surefire:surefire-booter:jar:2.6' in repository
apache (http://people.apache.org/repo/m2-ibiblio-rsync-repository)
Downloading: http://people.apache.org/repo/m2-incubating-repository/org/apache/maven/surefire/surefire-booter/2.6/surefire-booter-2.6.jar
[INFO] Unable to find resource 'org.apache.maven.surefire:surefire-booter:jar:2.6' in repository
apache.incubator (http://people.apache.org/repo/m2-incubating-repository)
Downloading: http://repository.apache.org/snapshots/org/apache/maven/surefire/surefire-booter/2.6/surefire-booter-2.6.jar
[INFO] Unable to find resource 'org.apache.maven.surefire:surefire-booter:jar:2.6' in repository
apache.snapshots (http://repository.apache.org/snapshots)
Downloading: http://snapshots.repository.codehaus.org/org/apache/maven/surefire/surefire-booter/2.6/surefire-booter-2.6.jar
[INFO] Unable to find resource 'org.apache.maven.surefire:surefire-booter:jar:2.6' in repository
codehaus-snapshot (http://snapshots.repository.codehaus.org)
Downloading: http://repo2.maven.org/maven2/org/apache/maven/surefire/surefire-booter/2.6/surefire-booter-2.6.jar

Downloading: http://people.apache.org/repo/m2-ibiblio-rsync-repository/org/apache/maven/surefire/surefire-api/2.6/surefire-api-2.6.jar
[INFO] Unable to find resource 'org.apache.maven.surefire:surefire-api:jar:2.6' in repository
apache (http://people.apache.org/repo/m2-ibiblio-rsync-repository)
Downloading: http://people.apache.org/repo/m2-incubating-repository/org/apache/maven/surefire/surefire-api/2.6/surefire-api-2.6.jar
[INFO] Unable to find resource 'org.apache.maven.surefire:surefire-api:jar:2.6' in repository
apache.incubator (http://people.apache.org/repo/m2-incubating-repository)
Downloading: http://repository.apache.org/snapshots/org/apache/maven/surefire/surefire-api/2.6/surefire-api-2.6.jar
[INFO] Unable to find resource 'org.apache.maven.surefire:surefire-api:jar:2.6' in repository
apache.snapshots (http://repository.apache.org/snapshots)
Downloading: http://snapshots.repository.codehaus.org/org/apache/maven/surefire/surefire-api/2.6/surefire-api-2.6.jar
[INFO] Unable to find resource 'org.apache.maven.surefire:surefire-api:jar:2.6' in repository
codehaus-snapshot (http://snapshots.repository.codehaus.org)
Downloading: http://repo2.maven.org/maven2/org/apache/maven/surefire/surefire-api/2.6/surefire-api-2.6.jar

Downloading: http://people.apache.org/repo/m2-ibiblio-rsync-repository/org/apache/maven/surefire/maven-surefire-common/2.6/maven-surefire-common-2.6.jar
[INFO] Unable to find resource 'org.apache.maven.surefire:maven-surefire-common:jar:2.6' in
repository apache (http://people.apache.org/repo/m2-ibiblio-rsync-repository)
Downloading: http://people.apache.org/repo/m2-incubating-repository/org/apache/maven/surefire/maven-surefire-common/2.6/maven-surefire-common-2.6.jar
[INFO] Unable to find resource 'org.apache.maven.surefire:maven-surefire-common:jar:2.6' in
repository apache.incubator (http://people.apache.org/repo/m2-incubating-repository)
Downloading: http://repository.apache.org/snapshots/org/apache/maven/surefire/maven-surefire-common/2.6/maven-surefire-common-2.6.jar
[INFO] Unable to find resource 'org.apache.maven.surefire:maven-surefire-common:jar:2.6' in
repository apache.snapshots (http://repository.apache.org/snapshots)
Downloading: http://snapshots.repository.codehaus.org/org/apache/maven/surefire/maven-surefire-common/2.6/maven-surefire-common-2.6.jar
[INFO] Unable to find resource 'org.apache.maven.surefire:maven-surefire-common:jar:2.6' in
repository codehaus-snapshot (http://snapshots.repository.codehaus.org)
Downloading: http://repo2.maven.org/maven2/org/apache/maven/surefire/maven-surefire-common/2.6/maven-surefire-common-2.6.jar

[INFO] [surefire:test {execution: default-test}]
[INFO] Tests are skipped.
[INFO] [osgi-junit:test {execution: osgi-test}]
[INFO] Generating <https://hudson.apache.org/hudson/job/Tuscany-2x/ws/sca-2x/samples/calculator-rest-osgi/target/sample-calculator-rest-osgi-osgi.jar>
[INFO] Generating <https://hudson.apache.org/hudson/job/Tuscany-2x/ws/sca-2x/samples/calculator-rest-osgi/target/sample-calculator-rest-osgi-osgi-tests.jar>
[INFO] Surefire report directory: <https://hudson.apache.org/hudson/job/Tuscany-2x/ws/sca-2x/samples/calculator-rest-osgi/target/surefire-osgi-reports>
Aug 30, 2010 1:07:47 AM org.apache.tuscany.sca.node.equinox.launcher.EquinoxHost start
INFO: Checking for manfiests customized by Tuscany in node-launcher-equinox/resources

-------------------------------------------------------
 T E S T S
-------------------------------------------------------
Running calculator.CalculatorTestCase
SCA Node API ClassLoader: org.eclipse.osgi.internal.baseadaptor.DefaultClassLoader@8046f4
Aug 30, 2010 1:07:48 AM org.apache.tuscany.sca.node.impl.NodeImpl start
INFO: Starting node: http://tuscany.apache.org/sca/1.1/nodes/default0 domain: default
Aug 30, 2010 1:07:48 AM org.apache.tuscany.sca.node.impl.NodeFactoryImpl loadContributions
INFO: Loading contribution: bundleresource://53.fwk22634321/
Aug 30, 2010 1:07:49 AM org.apache.tuscany.sca.binding.sca.provider.DefaultSCABindingMapper
<init>
WARNING: Mapped binding for binding.sca is not supported: {http://docs.oasis-open.org/ns/opencsa/sca/200912}binding.ws
Aug 30, 2010 1:07:49 AM org.mortbay.log.Slf4jLog info
INFO: Logging to org.slf4j.impl.JDK14LoggerAdapter(org.mortbay.log) via org.mortbay.log.Slf4jLog
Aug 30, 2010 1:07:49 AM org.apache.tuscany.sca.http.jetty.JettyLogger info
INFO: jetty-6.1.x
Aug 30, 2010 1:07:49 AM org.apache.tuscany.sca.http.jetty.JettyLogger info
INFO: Started SelectChannelConnector@localhost:8085
Aug 30, 2010 1:07:50 AM org.apache.wink.server.internal.DeploymentConfiguration initAlternateShortcutMap
SEVERE: Failed to load alternateShortcutMap
java.io.FileNotFoundException: META-INF/wink-alternate-shortcuts.properties
	at org.apache.wink.common.internal.utils.FileLoader.loadFileAsStream(FileLoader.java:102)
	at org.apache.wink.server.internal.DeploymentConfiguration.initAlternateShortcutMap(DeploymentConfiguration.java:314)
	at org.apache.wink.server.internal.DeploymentConfiguration.init(DeploymentConfiguration.java:158)
	at org.apache.wink.server.internal.servlet.RestServlet.getDeploymentConfiguration(RestServlet.java:140)
	at org.apache.tuscany.sca.binding.rest.provider.TuscanyRESTServlet.getDeploymentConfiguration(TuscanyRESTServlet.java:73)
	at org.apache.wink.server.internal.servlet.RestServlet.createRequestProcessor(RestServlet.java:121)
	at org.apache.wink.server.internal.servlet.RestServlet.init(RestServlet.java:91)
	at javax.servlet.GenericServlet.init(GenericServlet.java:241)
	at org.mortbay.jetty.servlet.ServletHolder.initServlet(ServletHolder.java:431)
	at org.mortbay.jetty.servlet.ServletHolder.doStart(ServletHolder.java:263)
	at org.mortbay.component.AbstractLifeCycle.start(AbstractLifeCycle.java:50)
	at org.mortbay.jetty.servlet.ServletHandler.initialize(ServletHandler.java:676)
	at org.mortbay.jetty.servlet.ServletHandler.updateMappings(ServletHandler.java:1044)
	at org.mortbay.jetty.servlet.ServletHandler.setServletMappings(ServletHandler.java:1101)
	at org.mortbay.jetty.servlet.ServletHandler.addServletMapping(ServletHandler.java:800)
	at org.apache.tuscany.sca.http.jetty.JettyServer.addServletMapping(JettyServer.java:335)
	at org.apache.tuscany.sca.http.jetty.JettyServer.addServletMapping(JettyServer.java:212)
	at org.apache.tuscany.sca.host.http.DefaultServletHostExtensionPoint$LazyServletHost.addServletMapping(DefaultServletHostExtensionPoint.java:124)
	at org.apache.tuscany.sca.binding.rest.provider.RESTServiceBindingProvider.registerWithJAXRS(RESTServiceBindingProvider.java:271)
	at org.apache.tuscany.sca.binding.rest.provider.RESTServiceBindingProvider.start(RESTServiceBindingProvider.java:163)
	at org.apache.tuscany.sca.core.assembly.impl.CompositeActivatorImpl$1.run(CompositeActivatorImpl.java:454)
	at java.security.AccessController.doPrivileged(Native Method)
	at org.apache.tuscany.sca.core.assembly.impl.CompositeActivatorImpl.startEndpoint(CompositeActivatorImpl.java:452)
	at org.apache.tuscany.sca.core.assembly.impl.CompositeActivatorImpl.start(CompositeActivatorImpl.java:408)
	at org.apache.tuscany.sca.core.assembly.impl.CompositeActivatorImpl.start(CompositeActivatorImpl.java:340)
	at org.apache.tuscany.sca.node.impl.NodeImpl.start(NodeImpl.java:147)
	at calculator.CalculatorTestCase.setUpBeforeClass(CalculatorTestCase.java:50)
	at sun.reflect.NativeMethodAccessorImpl.invoke0(Native Method)
	at sun.reflect.NativeMethodAccessorImpl.invoke(NativeMethodAccessorImpl.java:39)
	at sun.reflect.DelegatingMethodAccessorImpl.invoke(DelegatingMethodAccessorImpl.java:25)
	at java.lang.reflect.Method.invoke(Method.java:597)
	at org.junit.runners.model.FrameworkMethod$1.runReflectiveCall(FrameworkMethod.java:44)
	at org.junit.internal.runners.model.ReflectiveCallable.run(ReflectiveCallable.java:15)
	at org.junit.runners.model.FrameworkMethod.invokeExplosively(FrameworkMethod.java:41)
	at org.junit.internal.runners.statements.RunBefores.evaluate(RunBefores.java:27)
	at org.junit.internal.runners.statements.RunAfters.evaluate(RunAfters.java:31)
	at org.junit.runners.ParentRunner.run(ParentRunner.java:236)
	at org.apache.maven.surefire.junit4.JUnit4TestSet.execute(JUnit4TestSet.java:62)
	at org.apache.maven.surefire.suite.AbstractDirectoryTestSuite.executeTestSet(AbstractDirectoryTestSuite.java:140)
	at org.apache.maven.surefire.suite.AbstractDirectoryTestSuite.execute(AbstractDirectoryTestSuite.java:127)
	at org.apache.maven.surefire.Surefire.run(Surefire.java:177)
	at sun.reflect.NativeMethodAccessorImpl.invoke0(Native Method)
	at sun.reflect.NativeMethodAccessorImpl.invoke(NativeMethodAccessorImpl.java:39)
	at sun.reflect.DelegatingMethodAccessorImpl.invoke(DelegatingMethodAccessorImpl.java:25)
	at java.lang.reflect.Method.invoke(Method.java:597)
	at org.apache.tuscany.maven.plugin.surefire.OSGiSurefireBooter.runSuitesInProcess(OSGiSurefireBooter.java:355)
	at org.apache.tuscany.maven.plugin.surefire.OSGiSurefireBooter.main(OSGiSurefireBooter.java:852)
Aug 30, 2010 1:07:50 AM org.apache.wink.server.internal.servlet.RestServlet init
SEVERE: java.io.FileNotFoundException: META-INF/wink-alternate-shortcuts.properties
javax.ws.rs.WebApplicationException: java.io.FileNotFoundException: META-INF/wink-alternate-shortcuts.properties
	at org.apache.wink.server.internal.DeploymentConfiguration.initAlternateShortcutMap(DeploymentConfiguration.java:326)
	at org.apache.wink.server.internal.DeploymentConfiguration.init(DeploymentConfiguration.java:158)
	at org.apache.wink.server.internal.servlet.RestServlet.getDeploymentConfiguration(RestServlet.java:140)
	at org.apache.tuscany.sca.binding.rest.provider.TuscanyRESTServlet.getDeploymentConfiguration(TuscanyRESTServlet.java:73)
	at org.apache.wink.server.internal.servlet.RestServlet.createRequestProcessor(RestServlet.java:121)
	at org.apache.wink.server.internal.servlet.RestServlet.init(RestServlet.java:91)
	at javax.servlet.GenericServlet.init(GenericServlet.java:241)
	at org.mortbay.jetty.servlet.ServletHolder.initServlet(ServletHolder.java:431)
	at org.mortbay.jetty.servlet.ServletHolder.doStart(ServletHolder.java:263)
	at org.mortbay.component.AbstractLifeCycle.start(AbstractLifeCycle.java:50)
	at org.mortbay.jetty.servlet.ServletHandler.initialize(ServletHandler.java:676)
	at org.mortbay.jetty.servlet.ServletHandler.updateMappings(ServletHandler.java:1044)
	at org.mortbay.jetty.servlet.ServletHandler.setServletMappings(ServletHandler.java:1101)
	at org.mortbay.jetty.servlet.ServletHandler.addServletMapping(ServletHandler.java:800)
	at org.apache.tuscany.sca.http.jetty.JettyServer.addServletMapping(JettyServer.java:335)
	at org.apache.tuscany.sca.http.jetty.JettyServer.addServletMapping(JettyServer.java:212)
	at org.apache.tuscany.sca.host.http.DefaultServletHostExtensionPoint$LazyServletHost.addServletMapping(DefaultServletHostExtensionPoint.java:124)
	at org.apache.tuscany.sca.binding.rest.provider.RESTServiceBindingProvider.registerWithJAXRS(RESTServiceBindingProvider.java:271)
	at org.apache.tuscany.sca.binding.rest.provider.RESTServiceBindingProvider.start(RESTServiceBindingProvider.java:163)
	at org.apache.tuscany.sca.core.assembly.impl.CompositeActivatorImpl$1.run(CompositeActivatorImpl.java:454)
	at java.security.AccessController.doPrivileged(Native Method)
	at org.apache.tuscany.sca.core.assembly.impl.CompositeActivatorImpl.startEndpoint(CompositeActivatorImpl.java:452)
	at org.apache.tuscany.sca.core.assembly.impl.CompositeActivatorImpl.start(CompositeActivatorImpl.java:408)
	at org.apache.tuscany.sca.core.assembly.impl.CompositeActivatorImpl.start(CompositeActivatorImpl.java:340)
	at org.apache.tuscany.sca.node.impl.NodeImpl.start(NodeImpl.java:147)
	at calculator.CalculatorTestCase.setUpBeforeClass(CalculatorTestCase.java:50)
	at sun.reflect.NativeMethodAccessorImpl.invoke0(Native Method)
	at sun.reflect.NativeMethodAccessorImpl.invoke(NativeMethodAccessorImpl.java:39)
	at sun.reflect.DelegatingMethodAccessorImpl.invoke(DelegatingMethodAccessorImpl.java:25)
	at java.lang.reflect.Method.invoke(Method.java:597)
	at org.junit.runners.model.FrameworkMethod$1.runReflectiveCall(FrameworkMethod.java:44)
	at org.junit.internal.runners.model.ReflectiveCallable.run(ReflectiveCallable.java:15)
	at org.junit.runners.model.FrameworkMethod.invokeExplosively(FrameworkMethod.java:41)
	at org.junit.internal.runners.statements.RunBefores.evaluate(RunBefores.java:27)
	at org.junit.internal.runners.statements.RunAfters.evaluate(RunAfters.java:31)
	at org.junit.runners.ParentRunner.run(ParentRunner.java:236)
	at org.apache.maven.surefire.junit4.JUnit4TestSet.execute(JUnit4TestSet.java:62)
	at org.apache.maven.surefire.suite.AbstractDirectoryTestSuite.executeTestSet(AbstractDirectoryTestSuite.java:140)
	at org.apache.maven.surefire.suite.AbstractDirectoryTestSuite.execute(AbstractDirectoryTestSuite.java:127)
	at org.apache.maven.surefire.Surefire.run(Surefire.java:177)
	at sun.reflect.NativeMethodAccessorImpl.invoke0(Native Method)
	at sun.reflect.NativeMethodAccessorImpl.invoke(NativeMethodAccessorImpl.java:39)
	at sun.reflect.DelegatingMethodAccessorImpl.invoke(DelegatingMethodAccessorImpl.java:25)
	at java.lang.reflect.Method.invoke(Method.java:597)
	at org.apache.tuscany.maven.plugin.surefire.OSGiSurefireBooter.runSuitesInProcess(OSGiSurefireBooter.java:355)
	at org.apache.tuscany.maven.plugin.surefire.OSGiSurefireBooter.main(OSGiSurefireBooter.java:852)
Caused by: java.io.FileNotFoundException: META-INF/wink-alternate-shortcuts.properties
	at org.apache.wink.common.internal.utils.FileLoader.loadFileAsStream(FileLoader.java:102)
	at org.apache.wink.server.internal.DeploymentConfiguration.initAlternateShortcutMap(DeploymentConfiguration.java:314)
	... 45 more
Aug 30, 2010 1:07:50 AM org.apache.tuscany.sca.http.jetty.JettyLogger warn
WARNING: unavailable
javax.servlet.UnavailableException: java.io.FileNotFoundException: META-INF/wink-alternate-shortcuts.properties
	at org.apache.wink.server.internal.servlet.RestServlet.init(RestServlet.java:108)
	at javax.servlet.GenericServlet.init(GenericServlet.java:241)
	at org.mortbay.jetty.servlet.ServletHolder.initServlet(ServletHolder.java:431)
	at org.mortbay.jetty.servlet.ServletHolder.doStart(ServletHolder.java:263)
	at org.mortbay.component.AbstractLifeCycle.start(AbstractLifeCycle.java:50)
	at org.mortbay.jetty.servlet.ServletHandler.initialize(ServletHandler.java:676)
	at org.mortbay.jetty.servlet.ServletHandler.updateMappings(ServletHandler.java:1044)
	at org.mortbay.jetty.servlet.ServletHandler.setServletMappings(ServletHandler.java:1101)
	at org.mortbay.jetty.servlet.ServletHandler.addServletMapping(ServletHandler.java:800)
	at org.apache.tuscany.sca.http.jetty.JettyServer.addServletMapping(JettyServer.java:335)
	at org.apache.tuscany.sca.http.jetty.JettyServer.addServletMapping(JettyServer.java:212)
	at org.apache.tuscany.sca.host.http.DefaultServletHostExtensionPoint$LazyServletHost.addServletMapping(DefaultServletHostExtensionPoint.java:124)
	at org.apache.tuscany.sca.binding.rest.provider.RESTServiceBindingProvider.registerWithJAXRS(RESTServiceBindingProvider.java:271)
	at org.apache.tuscany.sca.binding.rest.provider.RESTServiceBindingProvider.start(RESTServiceBindingProvider.java:163)
	at org.apache.tuscany.sca.core.assembly.impl.CompositeActivatorImpl$1.run(CompositeActivatorImpl.java:454)
	at java.security.AccessController.doPrivileged(Native Method)
	at org.apache.tuscany.sca.core.assembly.impl.CompositeActivatorImpl.startEndpoint(CompositeActivatorImpl.java:452)
	at org.apache.tuscany.sca.core.assembly.impl.CompositeActivatorImpl.start(CompositeActivatorImpl.java:408)
	at org.apache.tuscany.sca.core.assembly.impl.CompositeActivatorImpl.start(CompositeActivatorImpl.java:340)
	at org.apache.tuscany.sca.node.impl.NodeImpl.start(NodeImpl.java:147)
	at calculator.CalculatorTestCase.setUpBeforeClass(CalculatorTestCase.java:50)
	at sun.reflect.NativeMethodAccessorImpl.invoke0(Native Method)
	at sun.reflect.NativeMethodAccessorImpl.invoke(NativeMethodAccessorImpl.java:39)
	at sun.reflect.DelegatingMethodAccessorImpl.invoke(DelegatingMethodAccessorImpl.java:25)
	at java.lang.reflect.Method.invoke(Method.java:597)
	at org.junit.runners.model.FrameworkMethod$1.runReflectiveCall(FrameworkMethod.java:44)
	at org.junit.internal.runners.model.ReflectiveCallable.run(ReflectiveCallable.java:15)
	at org.junit.runners.model.FrameworkMethod.invokeExplosively(FrameworkMethod.java:41)
	at org.junit.internal.runners.statements.RunBefores.evaluate(RunBefores.java:27)
	at org.junit.internal.runners.statements.RunAfters.evaluate(RunAfters.java:31)
	at org.junit.runners.ParentRunner.run(ParentRunner.java:236)
	at org.apache.maven.surefire.junit4.JUnit4TestSet.execute(JUnit4TestSet.java:62)
	at org.apache.maven.surefire.suite.AbstractDirectoryTestSuite.executeTestSet(AbstractDirectoryTestSuite.java:140)
	at org.apache.maven.surefire.suite.AbstractDirectoryTestSuite.execute(AbstractDirectoryTestSuite.java:127)
	at org.apache.maven.surefire.Surefire.run(Surefire.java:177)
	at sun.reflect.NativeMethodAccessorImpl.invoke0(Native Method)
	at sun.reflect.NativeMethodAccessorImpl.invoke(NativeMethodAccessorImpl.java:39)
	at sun.reflect.DelegatingMethodAccessorImpl.invoke(DelegatingMethodAccessorImpl.java:25)
	at java.lang.reflect.Method.invoke(Method.java:597)
	at org.apache.tuscany.maven.plugin.surefire.OSGiSurefireBooter.runSuitesInProcess(OSGiSurefireBooter.java:355)
	at org.apache.tuscany.maven.plugin.surefire.OSGiSurefireBooter.main(OSGiSurefireBooter.java:852)
Aug 30, 2010 1:07:50 AM org.apache.tuscany.sca.http.jetty.JettyServer addServletMapping
INFO: Added Servlet mapping: http://localhost:8085/calculator/*
Aug 30, 2010 1:07:50 AM org.apache.tuscany.sca.node.impl.NodeImpl stop
INFO: Stopping node: http://tuscany.apache.org/sca/1.1/nodes/default0
Tests run: 1, Failures: 0, Errors: 1, Skipped: 0, Time elapsed: 1.477 sec <<< FAILURE!

Results :

Tests in error: 
  calculator.CalculatorTestCase

Tests run: 1, Failures: 0, Errors: 1, Skipped: 0

[HUDSON] Archiving <https://hudson.apache.org/hudson/job/Tuscany-2x/ws/sca-2x/samples/calculator-rest-osgi/pom.xml>
to /home/hudson/hudson/jobs/Tuscany-2x/modules/org.apache.tuscany.sca$sample-calculator-rest-osgi/builds/2010-08-30_00-08-40/archive/org.apache.tuscany.sca/sample-calculator-rest-osgi/2.0-SNAPSHOT/pom.xml
[INFO] ------------------------------------------------------------------------
[ERROR] BUILD FAILURE
[INFO] ------------------------------------------------------------------------
[INFO] There are test failures.

Please refer to <https://hudson.apache.org/hudson/job/Tuscany-2x/ws/sca-2x/samples/calculator-rest-osgi/target/surefire-osgi-reports>
for the individual test results.
[INFO] ------------------------------------------------------------------------
[INFO] For more information, run Maven with the -e switch
[INFO] ------------------------------------------------------------------------
[INFO] Total time: 57 minutes 22 seconds
[INFO] Finished at: Mon Aug 30 01:07:56 GMT+00:00 2010
[INFO] Final Memory: 118M/751M
[INFO] ------------------------------------------------------------------------
Sending e-mails to: commits@tuscany.apache.org
channel stopped


Mime
View raw message