tuscany-commits mailing list archives

Site index · List index
Message view « Date » · « Thread »
Top « Date » · « Thread »
From Apache Hudson Server <hud...@hudson.apache.org>
Subject Build failed in Hudson: Tuscany-2x #825
Date Tue, 31 Aug 2010 00:51:46 GMT
See <https://hudson.apache.org/hudson/job/Tuscany-2x/825/changes>

Changes:

[bdaniel] Add support for ActivationSpec error conditions

[bdaniel] Don't try to lookup a destination if the jndiName is null

[bdaniel] BJM_3037A Add validation for ActivationSpec with "always" create and no JNDI name

[lresende] TUSCANY-3595 - Disabling test case as it's still failing

[antelder] Start of the runtime code to support wireFormat.httpXml, still needs code to turn
query parameters into xml

[antelder] Add http binding model for wireFormat.httpXml

[antelder] Add wireFormat.httpXml schema definition

[antelder] Update the http binding to use default wireFormat and operationSelector that work
as being discussed on the ML to expose arbitrary sca services as http endpoints. See http://apache.markmail.org/message/ix3vvyomronellmi

[antelder] Update jms conection factory look up to check the type of the looked up object

[antelder] Set svn ignores

[antelder] Set svn ignores

[antelder] Update for SCAClientFactory NoSuchDomainException changes

[antelder] Update for SCAClientFactory NoSuchDomainException changes

[lresende] Updating maven-surefire-plugin to avoid issues on hudson build

------------------------------------------
[...truncated 6677 lines...]
[INFO]    task-segment: [clean, install]
[INFO] ------------------------------------------------------------------------
[INFO] [clean:clean {execution: default-clean}]
[INFO] Deleting <https://hudson.apache.org/hudson/job/Tuscany-2x/ws/sca-2x/modules/binding-ejb/target>
[INFO] [enforcer:enforce {execution: enforce-plugin-versions}]
[INFO] [remote-resources:process {execution: default}]
[INFO] [resources:resources {execution: default-resources}]
[INFO] Using 'UTF-8' encoding to copy filtered resources.
[INFO] Copying 5 resources
[INFO] Copying 3 resources
[INFO] Copying 3 resources
[INFO] [compiler:compile {execution: default-compile}]
[INFO] Compiling 6 source files to <https://hudson.apache.org/hudson/job/Tuscany-2x/ws/sca-2x/modules/binding-ejb/target/classes>
[INFO] [resources:testResources {execution: default-testResources}]
[INFO] Using 'UTF-8' encoding to copy filtered resources.
[INFO] skip non existing resourceDirectory <https://hudson.apache.org/hudson/job/Tuscany-2x/ws/sca-2x/modules/binding-ejb/src/test/resources>
[INFO] Copying 3 resources
[INFO] [compiler:testCompile {execution: default-testCompile}]
[INFO] No sources to compile
[INFO] [surefire:test {execution: default-test}]
[INFO] Surefire report directory: <https://hudson.apache.org/hudson/job/Tuscany-2x/ws/sca-2x/modules/binding-ejb/target/surefire-reports>

-------------------------------------------------------
 T E S T S
-------------------------------------------------------
There are no tests to run.

Results :

Tests run: 0, Failures: 0, Errors: 0, Skipped: 0

[HUDSON] Recording test results
[INFO] [jar:jar {execution: default-jar}]
[INFO] Building jar: <https://hudson.apache.org/hudson/job/Tuscany-2x/ws/sca-2x/modules/binding-ejb/target/tuscany-binding-ejb-2.0-SNAPSHOT.jar>
[INFO] [install:install {execution: default-install}]
[INFO] Installing <https://hudson.apache.org/hudson/job/Tuscany-2x/ws/sca-2x/modules/binding-ejb/target/tuscany-binding-ejb-2.0-SNAPSHOT.jar>
to /export/home/hudson/.m2/repository/org/apache/tuscany/sca/tuscany-binding-ejb/2.0-SNAPSHOT/tuscany-binding-ejb-2.0-SNAPSHOT.jar
[HUDSON] Archiving <https://hudson.apache.org/hudson/job/Tuscany-2x/ws/sca-2x/modules/binding-ejb/pom.xml>
to /home/hudson/hudson/jobs/Tuscany-2x/modules/org.apache.tuscany.sca$tuscany-binding-ejb/builds/2010-08-31_00-20-23/archive/org.apache.tuscany.sca/tuscany-binding-ejb/2.0-SNAPSHOT/pom.xml
[HUDSON] Archiving <https://hudson.apache.org/hudson/job/Tuscany-2x/ws/sca-2x/modules/binding-ejb/target/tuscany-binding-ejb-2.0-SNAPSHOT.jar>
to /home/hudson/hudson/jobs/Tuscany-2x/modules/org.apache.tuscany.sca$tuscany-binding-ejb/builds/2010-08-31_00-20-23/archive/org.apache.tuscany.sca/tuscany-binding-ejb/2.0-SNAPSHOT/tuscany-binding-ejb-2.0-SNAPSHOT.jar
[INFO] ------------------------------------------------------------------------
[INFO] Building Apache Tuscany SCA EJB Binding Runtime
[INFO]    task-segment: [clean, install]
[INFO] ------------------------------------------------------------------------
[INFO] [clean:clean {execution: default-clean}]
[INFO] Deleting <https://hudson.apache.org/hudson/job/Tuscany-2x/ws/sca-2x/modules/binding-ejb-runtime/target>
[INFO] [enforcer:enforce {execution: enforce-plugin-versions}]
[INFO] [remote-resources:process {execution: default}]
[INFO] [resources:resources {execution: default-resources}]
[INFO] Using 'UTF-8' encoding to copy filtered resources.
[INFO] Copying 2 resources
[INFO] Copying 3 resources
[INFO] Copying 3 resources
[INFO] [compiler:compile {execution: default-compile}]
[INFO] Compiling 17 source files to <https://hudson.apache.org/hudson/job/Tuscany-2x/ws/sca-2x/modules/binding-ejb-runtime/target/classes>
[INFO] [resources:testResources {execution: default-testResources}]
[INFO] Using 'UTF-8' encoding to copy filtered resources.
[INFO] Copying 1 resource
[INFO] Copying 3 resources
[INFO] [compiler:testCompile {execution: default-testCompile}]
[INFO] Compiling 10 source files to <https://hudson.apache.org/hudson/job/Tuscany-2x/ws/sca-2x/modules/binding-ejb-runtime/target/test-classes>
[INFO] [surefire:test {execution: default-test}]
[INFO] Surefire report directory: <https://hudson.apache.org/hudson/job/Tuscany-2x/ws/sca-2x/modules/binding-ejb-runtime/target/surefire-reports>

-------------------------------------------------------
 T E S T S
-------------------------------------------------------
Running org.apache.tuscany.sca.binding.ejb.tests.EJBReferenceTestCase
Aug 31, 2010 12:51:33 AM org.apache.tuscany.sca.node.impl.NodeImpl start
INFO: Starting node: http://tuscany.apache.org/sca/1.1/nodes/default0 domain: default
Aug 31, 2010 12:51:33 AM org.apache.tuscany.sca.node.impl.NodeFactoryImpl loadContributions
INFO: Loading contribution: <https://hudson.apache.org/hudson/job/Tuscany-2x/ws/sca-2x/modules/binding-ejb-runtime/target/test-classes/>
Aug 31, 2010 12:51:35 AM org.apache.tuscany.sca.binding.sca.provider.DefaultSCABindingMapper
<init>
WARNING: Mapped binding for binding.sca is not supported: {http://docs.oasis-open.org/ns/opencsa/sca/200912}binding.ws
Aug 31, 2010 12:51:35 AM org.apache.tuscany.sca.core.assembly.impl.EndpointRegistryImpl addEndpoint
INFO: Add endpoint - (@28939486)Endpoint:  URI = CustomerComponent#service-binding(Customer/Customer)
In component implementation. Invoking external EJB through EJB reference binding  
Aug 31, 2010 12:51:36 AM org.apache.tuscany.sca.node.impl.NodeImpl stop
INFO: Stopping node: http://tuscany.apache.org/sca/1.1/nodes/default0
Aug 31, 2010 12:51:36 AM org.apache.tuscany.sca.core.assembly.impl.EndpointRegistryImpl removeEndpoint
INFO: Remove endpoint - (@28939486)Endpoint:  URI = CustomerComponent#service-binding(Customer/Customer)
Tests run: 1, Failures: 0, Errors: 0, Skipped: 0, Time elapsed: 3.149 sec

Results :

Tests run: 1, Failures: 0, Errors: 0, Skipped: 0

[HUDSON] Recording test results
[INFO] [jar:jar {execution: default-jar}]
[INFO] Building jar: <https://hudson.apache.org/hudson/job/Tuscany-2x/ws/sca-2x/modules/binding-ejb-runtime/target/tuscany-binding-ejb-runtime-2.0-SNAPSHOT.jar>
[INFO] [install:install {execution: default-install}]
[INFO] Installing <https://hudson.apache.org/hudson/job/Tuscany-2x/ws/sca-2x/modules/binding-ejb-runtime/target/tuscany-binding-ejb-runtime-2.0-SNAPSHOT.jar>
to /export/home/hudson/.m2/repository/org/apache/tuscany/sca/tuscany-binding-ejb-runtime/2.0-SNAPSHOT/tuscany-binding-ejb-runtime-2.0-SNAPSHOT.jar
[HUDSON] Archiving <https://hudson.apache.org/hudson/job/Tuscany-2x/ws/sca-2x/modules/binding-ejb-runtime/pom.xml>
to /home/hudson/hudson/jobs/Tuscany-2x/modules/org.apache.tuscany.sca$tuscany-binding-ejb-runtime/builds/2010-08-31_00-20-23/archive/org.apache.tuscany.sca/tuscany-binding-ejb-runtime/2.0-SNAPSHOT/pom.xml
[HUDSON] Archiving <https://hudson.apache.org/hudson/job/Tuscany-2x/ws/sca-2x/modules/binding-ejb-runtime/target/tuscany-binding-ejb-runtime-2.0-SNAPSHOT.jar>
to /home/hudson/hudson/jobs/Tuscany-2x/modules/org.apache.tuscany.sca$tuscany-binding-ejb-runtime/builds/2010-08-31_00-20-23/archive/org.apache.tuscany.sca/tuscany-binding-ejb-runtime/2.0-SNAPSHOT/tuscany-binding-ejb-runtime-2.0-SNAPSHOT.jar
[INFO] ------------------------------------------------------------------------
[INFO] Building Apache Tuscany SCA HTTP Binding Model
[INFO]    task-segment: [clean, install]
[INFO] ------------------------------------------------------------------------
[INFO] [clean:clean {execution: default-clean}]
[INFO] Deleting <https://hudson.apache.org/hudson/job/Tuscany-2x/ws/sca-2x/modules/binding-http/target>
[INFO] [enforcer:enforce {execution: enforce-plugin-versions}]
[INFO] [remote-resources:process {execution: default}]
[INFO] [resources:resources {execution: default-resources}]
[INFO] Using 'UTF-8' encoding to copy filtered resources.
[INFO] Copying 2 resources
[INFO] Copying 3 resources
[INFO] Copying 3 resources
[INFO] [compiler:compile {execution: default-compile}]
[INFO] Compiling 11 source files to <https://hudson.apache.org/hudson/job/Tuscany-2x/ws/sca-2x/modules/binding-http/target/classes>
[INFO] [resources:testResources {execution: default-testResources}]
[INFO] Using 'UTF-8' encoding to copy filtered resources.
[INFO] Copying 0 resource
[INFO] Copying 3 resources
[INFO] [compiler:testCompile {execution: default-testCompile}]
[INFO] Nothing to compile - all classes are up to date
[INFO] [surefire:test {execution: default-test}]
[INFO] Surefire report directory: <https://hudson.apache.org/hudson/job/Tuscany-2x/ws/sca-2x/modules/binding-http/target/surefire-reports>

-------------------------------------------------------
 T E S T S
-------------------------------------------------------
There are no tests to run.

Results :

Tests run: 0, Failures: 0, Errors: 0, Skipped: 0

[HUDSON] Recording test results
[INFO] [jar:jar {execution: default-jar}]
[INFO] Building jar: <https://hudson.apache.org/hudson/job/Tuscany-2x/ws/sca-2x/modules/binding-http/target/tuscany-binding-http-2.0-SNAPSHOT.jar>
[INFO] [install:install {execution: default-install}]
[INFO] Installing <https://hudson.apache.org/hudson/job/Tuscany-2x/ws/sca-2x/modules/binding-http/target/tuscany-binding-http-2.0-SNAPSHOT.jar>
to /export/home/hudson/.m2/repository/org/apache/tuscany/sca/tuscany-binding-http/2.0-SNAPSHOT/tuscany-binding-http-2.0-SNAPSHOT.jar
[HUDSON] Archiving <https://hudson.apache.org/hudson/job/Tuscany-2x/ws/sca-2x/modules/binding-http/pom.xml>
to /home/hudson/hudson/jobs/Tuscany-2x/modules/org.apache.tuscany.sca$tuscany-binding-http/builds/2010-08-31_00-20-23/archive/org.apache.tuscany.sca/tuscany-binding-http/2.0-SNAPSHOT/pom.xml
[HUDSON] Archiving <https://hudson.apache.org/hudson/job/Tuscany-2x/ws/sca-2x/modules/binding-http/target/tuscany-binding-http-2.0-SNAPSHOT.jar>
to /home/hudson/hudson/jobs/Tuscany-2x/modules/org.apache.tuscany.sca$tuscany-binding-http/builds/2010-08-31_00-20-23/archive/org.apache.tuscany.sca/tuscany-binding-http/2.0-SNAPSHOT/tuscany-binding-http-2.0-SNAPSHOT.jar
[INFO] ------------------------------------------------------------------------
[INFO] Building Apache Tuscany SCA Data Binding for JSON
[INFO]    task-segment: [clean, install]
[INFO] ------------------------------------------------------------------------
[INFO] [clean:clean {execution: default-clean}]
[INFO] Deleting <https://hudson.apache.org/hudson/job/Tuscany-2x/ws/sca-2x/modules/databinding-json/target>
[INFO] [enforcer:enforce {execution: enforce-plugin-versions}]
[INFO] [remote-resources:process {execution: default}]
[INFO] [resources:resources {execution: default-resources}]
[INFO] Using 'UTF-8' encoding to copy filtered resources.
[INFO] Copying 3 resources
[INFO] Copying 3 resources
[INFO] Copying 3 resources
[INFO] [compiler:compile {execution: default-compile}]
[INFO] Compiling 17 source files to <https://hudson.apache.org/hudson/job/Tuscany-2x/ws/sca-2x/modules/databinding-json/target/classes>
[INFO] [resources:testResources {execution: default-testResources}]
[INFO] Using 'UTF-8' encoding to copy filtered resources.
[INFO] Copying 1 resource
[INFO] Copying 3 resources
[INFO] [compiler:testCompile {execution: default-testCompile}]
[INFO] Compiling 8 source files to <https://hudson.apache.org/hudson/job/Tuscany-2x/ws/sca-2x/modules/databinding-json/target/test-classes>
[INFO] [surefire:test {execution: default-test}]
[INFO] Surefire report directory: <https://hudson.apache.org/hudson/job/Tuscany-2x/ws/sca-2x/modules/databinding-json/target/surefire-reports>

-------------------------------------------------------
 T E S T S
-------------------------------------------------------
Running org.apache.tuscany.sca.databinding.json.jackson.JacksonTestCase
"ABC"
null
["123","ABC"]
"QUJD"
123
Tests run: 5, Failures: 0, Errors: 0, Skipped: 0, Time elapsed: 0.746 sec
Running org.apache.tuscany.sca.databinding.json.jackson.Object2JSONTestCase
"ABC"
{"name":"Me","age":30,"vip":true,"friends":["John","Mike"],"books":[],"you":{"name":null,"id":123}}
["ABC","DF"]
Tests run: 3, Failures: 0, Errors: 0, Skipped: 0, Time elapsed: 0.062 sec
Running org.apache.tuscany.sca.databinding.json.JavaBean2JSONTestCase
ABC
Aug 31, 2010 12:52:17 AM org.jabsorb.serializer.impl.BeanSerializer analyzeBean
INFO: analyzing org.apache.tuscany.sca.databinding.json.JavaBean2JSONTestCase$MyBean
Aug 31, 2010 12:52:17 AM org.jabsorb.serializer.impl.BeanSerializer analyzeBean
INFO: analyzing org.apache.tuscany.sca.databinding.json.JavaBean2JSONTestCase$YourBean
{"books":{"javaClass":"java.util.ArrayList","list":[]},"vip":true,"friends":["John","Mike"],"age":30,"name":"Me","javaClass":"org.apache.tuscany.sca.databinding.json.JavaBean2JSONTestCase$MyBean","you":{"id":123,"name":null,"javaClass":"org.apache.tuscany.sca.databinding.json.JavaBean2JSONTestCase$YourBean"}}
["ABC","DF"]
Tests run: 3, Failures: 0, Errors: 0, Skipped: 0, Time elapsed: 0.083 sec
Running org.apache.tuscany.sca.databinding.json.POJOTestCase
ABC
null
["123","ABC"]
ABC
123
Tests run: 5, Failures: 0, Errors: 0, Skipped: 0, Time elapsed: 0.008 sec
Running org.apache.tuscany.sca.databinding.json.JSONTransformerTestCase
Tests run: 4, Failures: 0, Errors: 0, Skipped: 0, Time elapsed: 0.205 sec

Results :

Tests run: 20, Failures: 0, Errors: 0, Skipped: 0

[HUDSON] Recording test results
[INFO] [jar:jar {execution: default-jar}]
[INFO] Building jar: <https://hudson.apache.org/hudson/job/Tuscany-2x/ws/sca-2x/modules/databinding-json/target/tuscany-databinding-json-2.0-SNAPSHOT.jar>
[INFO] [install:install {execution: default-install}]
[INFO] Installing <https://hudson.apache.org/hudson/job/Tuscany-2x/ws/sca-2x/modules/databinding-json/target/tuscany-databinding-json-2.0-SNAPSHOT.jar>
to /export/home/hudson/.m2/repository/org/apache/tuscany/sca/tuscany-databinding-json/2.0-SNAPSHOT/tuscany-databinding-json-2.0-SNAPSHOT.jar
[HUDSON] Archiving <https://hudson.apache.org/hudson/job/Tuscany-2x/ws/sca-2x/modules/databinding-json/pom.xml>
to /home/hudson/hudson/jobs/Tuscany-2x/modules/org.apache.tuscany.sca$tuscany-databinding-json/builds/2010-08-31_00-20-23/archive/org.apache.tuscany.sca/tuscany-databinding-json/2.0-SNAPSHOT/pom.xml
[HUDSON] Archiving <https://hudson.apache.org/hudson/job/Tuscany-2x/ws/sca-2x/modules/databinding-json/target/tuscany-databinding-json-2.0-SNAPSHOT.jar>
to /home/hudson/hudson/jobs/Tuscany-2x/modules/org.apache.tuscany.sca$tuscany-databinding-json/builds/2010-08-31_00-20-23/archive/org.apache.tuscany.sca/tuscany-databinding-json/2.0-SNAPSHOT/tuscany-databinding-json-2.0-SNAPSHOT.jar
[INFO] ------------------------------------------------------------------------
[INFO] Building Apache Tuscany SCA HTTP Binding Runtime
[INFO]    task-segment: [clean, install]
[INFO] ------------------------------------------------------------------------
[INFO] [clean:clean {execution: default-clean}]
[INFO] Deleting <https://hudson.apache.org/hudson/job/Tuscany-2x/ws/sca-2x/modules/binding-http-runtime/target>
[INFO] [enforcer:enforce {execution: enforce-plugin-versions}]
[INFO] [remote-resources:process {execution: default}]
[INFO] [resources:resources {execution: default-resources}]
[INFO] Using 'UTF-8' encoding to copy filtered resources.
[INFO] Copying 3 resources
[INFO] Copying 3 resources
[INFO] Copying 3 resources
[INFO] [compiler:compile {execution: default-compile}]
[INFO] Compiling 11 source files to <https://hudson.apache.org/hudson/job/Tuscany-2x/ws/sca-2x/modules/binding-http-runtime/target/classes>
[INFO] -------------------------------------------------------------
[ERROR] COMPILATION ERROR : 
[INFO] -------------------------------------------------------------
[ERROR] <https://hudson.apache.org/hudson/job/Tuscany-2x/ws/sca-2x/modules/binding-http-runtime/src/main/java/org/apache/tuscany/sca/binding/http/format/HTTPXMLWireFormatProviderFactory.java>:[25,45]
package org.apache.tuscany.sca.databinding.xml does not exist

[ERROR] <https://hudson.apache.org/hudson/job/Tuscany-2x/ws/sca-2x/modules/binding-http-runtime/src/main/java/org/apache/tuscany/sca/binding/http/format/HTTPXMLWireFormatProviderFactory.java>:[57,66]
cannot find symbol
symbol: variable DOMDataBinding
                interfaceContract.getInterface().resetDataBinding(DOMDataBinding.NAME);

[INFO] 2 errors 
[INFO] -------------------------------------------------------------
[HUDSON] Archiving <https://hudson.apache.org/hudson/job/Tuscany-2x/ws/sca-2x/modules/binding-http-runtime/pom.xml>
to /home/hudson/hudson/jobs/Tuscany-2x/modules/org.apache.tuscany.sca$tuscany-binding-http-runtime/builds/2010-08-31_00-20-23/archive/org.apache.tuscany.sca/tuscany-binding-http-runtime/2.0-SNAPSHOT/pom.xml
[INFO] ------------------------------------------------------------------------
[ERROR] BUILD FAILURE
[INFO] ------------------------------------------------------------------------
[INFO] Compilation failure

<https://hudson.apache.org/hudson/job/Tuscany-2x/ws/sca-2x/modules/binding-http-runtime/src/main/java/org/apache/tuscany/sca/binding/http/format/HTTPXMLWireFormatProviderFactory.java>:[25,45]
package org.apache.tuscany.sca.databinding.xml does not exist

<https://hudson.apache.org/hudson/job/Tuscany-2x/ws/sca-2x/modules/binding-http-runtime/src/main/java/org/apache/tuscany/sca/binding/http/format/HTTPXMLWireFormatProviderFactory.java>:[57,66]
cannot find symbol
symbol: variable DOMDataBinding
                interfaceContract.getInterface().resetDataBinding(DOMDataBinding.NAME);


[INFO] ------------------------------------------------------------------------
[INFO] For more information, run Maven with the -e switch
[INFO] ------------------------------------------------------------------------
[INFO] Total time: 30 minutes 22 seconds
[INFO] Finished at: Tue Aug 31 00:52:38 GMT+00:00 2010
[INFO] Final Memory: 91M/751M
[INFO] ------------------------------------------------------------------------
Sending e-mails to: commits@tuscany.apache.org
channel stopped


Mime
View raw message