tuscany-commits mailing list archives

Site index · List index
Message view « Date » · « Thread »
Top « Date » · « Thread »
From Apache Hudson Server <hud...@hudson.zones.apache.org>
Subject Build failed in Hudson: Tuscany-2x #678
Date Sat, 15 May 2010 00:48:04 GMT
See <http://hudson.zones.apache.org/hudson/job/Tuscany-2x/678/changes>

Changes:

[kelvingoodson] error message updates for pojo otests

[slaws] There is nothing to a command line launcher other than a README telling you how to
run contributions from the command line. I haven't actually worked out how to do it yet but
at least this gives the first time user somewhere obvious to look for instructions.

[slaws] Add an OSGi based launcher. Does the same thing as the JSE laucher except using node
launcher equinox

[slaws] Launch binding-sca and binding-ws based contributions.

[slaws] Add a contribution for a binding-sca based calculator app. This is a copy of the existing
calculator module but modified to include a "client" component so we can launch it from JSE,
mvn, OSGi etc without having to worry about how to get a calculator proxy.

[slaws] rename binding-ws-calculator to make it clear that it's a contribution (may decide
to use subdirectories for this but seeing how we feel about this approach first)

[kelvingoodson] error message updates for ci/pojo otests

[slaws] Make ant script work for JSE launcher. compiles with base jar but doesn't run with
it at the moment.

[slaws] simplify the build classpath at this contribution requires very little to compile.

[slaws] remove duplicate entry

[slaws] Add sca-api jar into the lib folder so that it's in a consistent place when the user
is creating simple classpaths. I'd like this to be don't by a feature so that the user always
refers to the same thing (and the same mvn group) regardless of which parts of the system
they are including.

[antelder] Change the phase where oasis artifact unpacking is done from compile to test-compile
to see if that helps with the issue of tests not getting run ocasionally

[antelder] Update to use defaultDomainName

[antelder] Remove exclude for ASM_4005 as its working now

------------------------------------------
[...truncated 6103 lines...]
[INFO] Webapp directory = <http://hudson.zones.apache.org/hudson/job/Tuscany-2x/ws/sca-2x/samples/webapps/helloworld-stripes/src/main/webapp>
[INFO] Starting jetty 6.1.18 ...
2010-05-15 00:45:18.287::INFO:  jetty-6.1.18
2010-05-15 00:45:18.335::INFO:  No Transaction manager found - if your webapp requires one,
please configure one.
May 15, 2010 12:45:18 AM org.apache.tuscany.sca.host.webapp.TuscanyContextListener contextInitialized
INFO: Apache Tuscany Helloworld Stripes Sample is starting.
May 15, 2010 12:45:18 AM org.apache.tuscany.sca.host.webapp.WebAppServletHost initContextPath
INFO: ContextPath: /helloworld-stripes
May 15, 2010 12:45:18 AM org.apache.tuscany.sca.node.impl.NodeImpl start
INFO: Starting node: webapp domain: default
May 15, 2010 12:45:18 AM org.apache.tuscany.sca.node.impl.NodeFactoryImpl loadContributions
INFO: Loading contribution: <http://hudson.zones.apache.org/hudson/job/Tuscany-2x/ws/sca-2x/samples/webapps/helloworld-stripes/src/main/webapp/>
May 15, 2010 12:45:18 AM org.apache.tuscany.sca.core.assembly.impl.EndpointRegistryImpl addEndpoint
INFO: Add endpoint - (@27586736)Endpoint:  URI = HelloworldComponent#service-binding(HelloworldServiceImpl/HelloworldServiceImpl)
May 15, 2010 12:45:19 AM net.sourceforge.stripes.util.Log info
INFO: No locale list specified, defaulting to single locale: en_US
May 15, 2010 12:45:20 AM net.sourceforge.stripes.util.Log warn
WARNING: No MultipartWrapper implementation could be loaded
May 15, 2010 12:45:21 AM net.sourceforge.stripes.util.Log info
INFO: Stripes Initialization Complete. Version: 1.5.2, Build: 1214
2010-05-15 00:45:21.016::INFO:  Started SelectChannelConnector@0.0.0.0:8085
[INFO] Started Jetty Server
[INFO] [surefire:test {execution: default-test}]
[INFO] Tests are skipped.
[INFO] [jetty:stop {execution: stop-jetty}]
[INFO] Stopping server 0
[INFO] [war:war {execution: default-war}]
[INFO] Packaging webapp
[INFO] Assembling webapp[sample-helloworld-stripes-webapp] in [<http://hudson.zones.apache.org/hudson/job/Tuscany-2x/ws/sca-2x/samples/webapps/helloworld-stripes/target/helloworld-stripes]>
[INFO] Processing war project
[INFO] Copying webapp resources[<http://hudson.zones.apache.org/hudson/job/Tuscany-2x/ws/sca-2x/samples/webapps/helloworld-stripes/src/main/webapp]>
[INFO] Webapp assembled in [69 msecs]
[INFO] Building war: <http://hudson.zones.apache.org/hudson/job/Tuscany-2x/ws/sca-2x/samples/webapps/helloworld-stripes/target/helloworld-stripes.war>
May 15, 2010 12:45:21 AM org.apache.tuscany.sca.host.webapp.TuscanyContextListener contextDestroyed
INFO: Apache Tuscany Helloworld Stripes Sample is stopping.
May 15, 2010 12:45:21 AM org.apache.tuscany.sca.node.impl.NodeImpl stop
INFO: Stopping node: webapp
[INFO] [source:jar-no-fork {execution: attach-sources}]
[INFO] Building jar: <http://hudson.zones.apache.org/hudson/job/Tuscany-2x/ws/sca-2x/samples/webapps/helloworld-stripes/target/helloworld-stripes-sources.jar>
[INFO] [install:install {execution: default-install}]
[INFO] Installing <http://hudson.zones.apache.org/hudson/job/Tuscany-2x/ws/sca-2x/samples/webapps/helloworld-stripes/target/helloworld-stripes.war>
to /home/hudson/.m2/repository/org/apache/tuscany/sca/sample-helloworld-stripes-webapp/2.0-SNAPSHOT/sample-helloworld-stripes-webapp-2.0-SNAPSHOT.war
[INFO] Installing <http://hudson.zones.apache.org/hudson/job/Tuscany-2x/ws/sca-2x/samples/webapps/helloworld-stripes/target/helloworld-stripes-sources.jar>
to /home/hudson/.m2/repository/org/apache/tuscany/sca/sample-helloworld-stripes-webapp/2.0-SNAPSHOT/sample-helloworld-stripes-webapp-2.0-SNAPSHOT-sources.jar
[HUDSON] Archiving <http://hudson.zones.apache.org/hudson/job/Tuscany-2x/ws/sca-2x/samples/webapps/helloworld-stripes/target/helloworld-stripes.war>
to /export/home/hudson/hudson/jobs/Tuscany-2x/modules/org.apache.tuscany.sca$sample-helloworld-stripes-webapp/builds/2010-05-15_00-25-37/archive/org.apache.tuscany.sca/sample-helloworld-stripes-webapp/2.0-SNAPSHOT/helloworld-stripes.war
[HUDSON] Archiving <http://hudson.zones.apache.org/hudson/job/Tuscany-2x/ws/sca-2x/samples/webapps/helloworld-stripes/target/helloworld-stripes-sources.jar>
to /export/home/hudson/hudson/jobs/Tuscany-2x/modules/org.apache.tuscany.sca$sample-helloworld-stripes-webapp/builds/2010-05-15_00-25-37/archive/org.apache.tuscany.sca/sample-helloworld-stripes-webapp/2.0-SNAPSHOT/helloworld-stripes-sources.jar
[INFO] ------------------------------------------------------------------------
[INFO] Building Apache Tuscany SCA Sample Helloworld Servlet
[INFO]    task-segment: [clean, install]
[INFO] ------------------------------------------------------------------------
[INFO] [clean:clean {execution: default-clean}]
[INFO] Deleting <http://hudson.zones.apache.org/hudson/job/Tuscany-2x/ws/sca-2x/samples/webapps/helloworld-servlet/target>
[INFO] [enforcer:enforce {execution: enforce-plugin-versions}]
[INFO] [resources:resources {execution: default-resources}]
[INFO] Using 'UTF-8' encoding to copy filtered resources.
[INFO] skip non existing resourceDirectory <http://hudson.zones.apache.org/hudson/job/Tuscany-2x/ws/sca-2x/samples/webapps/helloworld-servlet/src/main/resources>
[INFO] Copying 0 resource
[INFO] [compiler:compile {execution: default-compile}]
[INFO] Compiling 3 source files to <http://hudson.zones.apache.org/hudson/job/Tuscany-2x/ws/sca-2x/samples/webapps/helloworld-servlet/target/classes>
[INFO] [resources:testResources {execution: default-testResources}]
[INFO] Using 'UTF-8' encoding to copy filtered resources.
[INFO] skip non existing resourceDirectory <http://hudson.zones.apache.org/hudson/job/Tuscany-2x/ws/sca-2x/samples/webapps/helloworld-servlet/src/test/resources>
[INFO] [compiler:testCompile {execution: default-testCompile}]
[INFO] Not compiling test sources
[INFO] Preparing jetty:run
[WARNING] Removing: run from forked lifecycle, to prevent recursive invocation.
[HUDSON] Archiving <http://hudson.zones.apache.org/hudson/job/Tuscany-2x/ws/sca-2x/samples/webapps/helloworld-servlet/pom.xml>
to /export/home/hudson/hudson/jobs/Tuscany-2x/modules/org.apache.tuscany.sca$sample-helloworld-servlet-webapp/builds/2010-05-15_00-25-37/archive/org.apache.tuscany.sca/sample-helloworld-servlet-webapp/2.0-SNAPSHOT/pom.xml
[INFO] [enforcer:enforce {execution: enforce-plugin-versions}]
[INFO] [resources:resources {execution: default-resources}]
[INFO] Using 'UTF-8' encoding to copy filtered resources.
[INFO] skip non existing resourceDirectory <http://hudson.zones.apache.org/hudson/job/Tuscany-2x/ws/sca-2x/samples/webapps/helloworld-servlet/src/main/resources>
[INFO] Copying 0 resource
[INFO] [compiler:compile {execution: default-compile}]
[INFO] Nothing to compile - all classes are up to date
[INFO] [resources:testResources {execution: default-testResources}]
[INFO] Using 'UTF-8' encoding to copy filtered resources.
[INFO] skip non existing resourceDirectory <http://hudson.zones.apache.org/hudson/job/Tuscany-2x/ws/sca-2x/samples/webapps/helloworld-servlet/src/test/resources>
[INFO] [compiler:testCompile {execution: default-testCompile}]
[INFO] Not compiling test sources
[INFO] [jetty:run {execution: start-jetty}]
[INFO] Configuring Jetty for project: Apache Tuscany SCA Sample Helloworld Servlet
[INFO] Webapp source directory = <http://hudson.zones.apache.org/hudson/job/Tuscany-2x/ws/sca-2x/samples/webapps/helloworld-servlet/src/main/webapp>
[INFO] Reload Mechanic: automatic
[INFO] web.xml file = <http://hudson.zones.apache.org/hudson/job/Tuscany-2x/ws/sca-2x/samples/webapps/helloworld-servlet/src/main/webapp/WEB-INF/web.xml>
[INFO] Classes = <http://hudson.zones.apache.org/hudson/job/Tuscany-2x/ws/sca-2x/samples/webapps/helloworld-servlet/target/classes>
[INFO] Context path = /helloworld-servlet
[INFO] Tmp directory =  determined at runtime
[INFO] Web defaults = org/mortbay/jetty/webapp/webdefault.xml
[INFO] Web overrides =  none
[INFO] Webapp directory = <http://hudson.zones.apache.org/hudson/job/Tuscany-2x/ws/sca-2x/samples/webapps/helloworld-servlet/src/main/webapp>
[INFO] Starting jetty 6.1.18 ...
2010-05-15 00:45:45.894::INFO:  jetty-6.1.18
2010-05-15 00:45:45.915::INFO:  No Transaction manager found - if your webapp requires one,
please configure one.
May 15, 2010 12:45:45 AM org.apache.tuscany.sca.host.webapp.TuscanyContextListener contextInitialized
INFO: Apache Tuscany Helloworld Servlet Sample is starting.
May 15, 2010 12:45:46 AM org.apache.tuscany.sca.host.webapp.WebAppServletHost initContextPath
INFO: ContextPath: /helloworld-servlet
May 15, 2010 12:45:46 AM org.apache.tuscany.sca.node.impl.NodeImpl start
INFO: Starting node: webapp domain: default
May 15, 2010 12:45:46 AM org.apache.tuscany.sca.node.impl.NodeFactoryImpl loadContributions
INFO: Loading contribution: <http://hudson.zones.apache.org/hudson/job/Tuscany-2x/ws/sca-2x/samples/webapps/helloworld-servlet/src/main/webapp/>
May 15, 2010 12:45:46 AM org.apache.tuscany.sca.core.assembly.impl.EndpointRegistryImpl addEndpoint
INFO: Add endpoint - (@16221987)Endpoint:  URI = HelloworldComponent#service-binding(HelloworldServiceImpl/HelloworldServiceImpl)
2010-05-15 00:45:46.517::INFO:  Started SelectChannelConnector@0.0.0.0:8085
[INFO] Started Jetty Server
[INFO] [surefire:test {execution: default-test}]
[INFO] Tests are skipped.
[INFO] [jetty:stop {execution: stop-jetty}]
[INFO] Stopping server 0
[INFO] [war:war {execution: default-war}]
[INFO] Packaging webapp
[INFO] Assembling webapp[sample-helloworld-servlet-webapp] in [<http://hudson.zones.apache.org/hudson/job/Tuscany-2x/ws/sca-2x/samples/webapps/helloworld-servlet/target/helloworld-servlet]>
[INFO] Processing war project
[INFO] Copying webapp resources[<http://hudson.zones.apache.org/hudson/job/Tuscany-2x/ws/sca-2x/samples/webapps/helloworld-servlet/src/main/webapp]>
[INFO] Webapp assembled in [56 msecs]
[INFO] Building war: <http://hudson.zones.apache.org/hudson/job/Tuscany-2x/ws/sca-2x/samples/webapps/helloworld-servlet/target/helloworld-servlet.war>
[INFO] [source:jar-no-fork {execution: attach-sources}]
[INFO] Building jar: <http://hudson.zones.apache.org/hudson/job/Tuscany-2x/ws/sca-2x/samples/webapps/helloworld-servlet/target/helloworld-servlet-sources.jar>
May 15, 2010 12:45:47 AM org.apache.tuscany.sca.host.webapp.TuscanyContextListener contextDestroyed
INFO: Apache Tuscany Helloworld Servlet Sample is stopping.
May 15, 2010 12:45:47 AM org.apache.tuscany.sca.node.impl.NodeImpl stop
INFO: Stopping node: webapp
[INFO] [install:install {execution: default-install}]
[INFO] Installing <http://hudson.zones.apache.org/hudson/job/Tuscany-2x/ws/sca-2x/samples/webapps/helloworld-servlet/target/helloworld-servlet.war>
to /home/hudson/.m2/repository/org/apache/tuscany/sca/sample-helloworld-servlet-webapp/2.0-SNAPSHOT/sample-helloworld-servlet-webapp-2.0-SNAPSHOT.war
[INFO] Installing <http://hudson.zones.apache.org/hudson/job/Tuscany-2x/ws/sca-2x/samples/webapps/helloworld-servlet/target/helloworld-servlet-sources.jar>
to /home/hudson/.m2/repository/org/apache/tuscany/sca/sample-helloworld-servlet-webapp/2.0-SNAPSHOT/sample-helloworld-servlet-webapp-2.0-SNAPSHOT-sources.jar
[HUDSON] Archiving <http://hudson.zones.apache.org/hudson/job/Tuscany-2x/ws/sca-2x/samples/webapps/helloworld-servlet/target/helloworld-servlet.war>
to /export/home/hudson/hudson/jobs/Tuscany-2x/modules/org.apache.tuscany.sca$sample-helloworld-servlet-webapp/builds/2010-05-15_00-25-37/archive/org.apache.tuscany.sca/sample-helloworld-servlet-webapp/2.0-SNAPSHOT/helloworld-servlet.war
[HUDSON] Archiving <http://hudson.zones.apache.org/hudson/job/Tuscany-2x/ws/sca-2x/samples/webapps/helloworld-servlet/target/helloworld-servlet-sources.jar>
to /export/home/hudson/hudson/jobs/Tuscany-2x/modules/org.apache.tuscany.sca$sample-helloworld-servlet-webapp/builds/2010-05-15_00-25-37/archive/org.apache.tuscany.sca/sample-helloworld-servlet-webapp/2.0-SNAPSHOT/helloworld-servlet-sources.jar
[INFO] ------------------------------------------------------------------------
[INFO] Building Apache Tuscany SCA Sample Binding WS Calculator Contribution
[INFO]    task-segment: [clean, install]
[INFO] ------------------------------------------------------------------------
[INFO] [clean:clean {execution: default-clean}]
[INFO] [enforcer:enforce {execution: enforce-plugin-versions}]
[INFO] [resources:resources {execution: default-resources}]
[INFO] Using 'UTF-8' encoding to copy filtered resources.
[INFO] Copying 2 resources
[INFO] Copying 1 resource
[INFO] [compiler:compile {execution: default-compile}]
[INFO] Compiling 10 source files to <http://hudson.zones.apache.org/hudson/job/Tuscany-2x/ws/sca-2x/samples/contribution-binding-ws-calculator/target/classes>
[INFO] [resources:testResources {execution: default-testResources}]
[INFO] Using 'UTF-8' encoding to copy filtered resources.
[INFO] skip non existing resourceDirectory <http://hudson.zones.apache.org/hudson/job/Tuscany-2x/ws/sca-2x/samples/contribution-binding-ws-calculator/src/test/resources>
[INFO] [compiler:testCompile {execution: default-testCompile}]
[INFO] Not compiling test sources
[INFO] [surefire:test {execution: default-test}]
[INFO] Tests are skipped.
[INFO] [jar:jar {execution: default-jar}]
[INFO] Building jar: <http://hudson.zones.apache.org/hudson/job/Tuscany-2x/ws/sca-2x/samples/contribution-binding-ws-calculator/target/sample-contribution-binding-ws-calculator.jar>
[INFO] [source:jar-no-fork {execution: attach-sources}]
[INFO] Building jar: <http://hudson.zones.apache.org/hudson/job/Tuscany-2x/ws/sca-2x/samples/contribution-binding-ws-calculator/target/sample-contribution-binding-ws-calculator-sources.jar>
[INFO] [install:install {execution: default-install}]
[INFO] Installing <http://hudson.zones.apache.org/hudson/job/Tuscany-2x/ws/sca-2x/samples/contribution-binding-ws-calculator/target/sample-contribution-binding-ws-calculator.jar>
to /home/hudson/.m2/repository/org/apache/tuscany/sca/sample-contribution-binding-ws-calculator/2.0-SNAPSHOT/sample-contribution-binding-ws-calculator-2.0-SNAPSHOT.jar
[INFO] Installing <http://hudson.zones.apache.org/hudson/job/Tuscany-2x/ws/sca-2x/samples/contribution-binding-ws-calculator/target/sample-contribution-binding-ws-calculator-sources.jar>
to /home/hudson/.m2/repository/org/apache/tuscany/sca/sample-contribution-binding-ws-calculator/2.0-SNAPSHOT/sample-contribution-binding-ws-calculator-2.0-SNAPSHOT-sources.jar
[HUDSON] Archiving <http://hudson.zones.apache.org/hudson/job/Tuscany-2x/ws/sca-2x/samples/contribution-binding-ws-calculator/pom.xml>
to /export/home/hudson/hudson/jobs/Tuscany-2x/modules/org.apache.tuscany.sca$sample-contribution-binding-ws-calculator/builds/2010-05-15_00-25-37/archive/org.apache.tuscany.sca/sample-contribution-binding-ws-calculator/2.0-SNAPSHOT/pom.xml
[HUDSON] Archiving <http://hudson.zones.apache.org/hudson/job/Tuscany-2x/ws/sca-2x/samples/contribution-binding-ws-calculator/target/sample-contribution-binding-ws-calculator.jar>
to /export/home/hudson/hudson/jobs/Tuscany-2x/modules/org.apache.tuscany.sca$sample-contribution-binding-ws-calculator/builds/2010-05-15_00-25-37/archive/org.apache.tuscany.sca/sample-contribution-binding-ws-calculator/2.0-SNAPSHOT/sample-contribution-binding-ws-calculator.jar
[HUDSON] Archiving <http://hudson.zones.apache.org/hudson/job/Tuscany-2x/ws/sca-2x/samples/contribution-binding-ws-calculator/target/sample-contribution-binding-ws-calculator-sources.jar>
to /export/home/hudson/hudson/jobs/Tuscany-2x/modules/org.apache.tuscany.sca$sample-contribution-binding-ws-calculator/builds/2010-05-15_00-25-37/archive/org.apache.tuscany.sca/sample-contribution-binding-ws-calculator/2.0-SNAPSHOT/sample-contribution-binding-ws-calculator-sources.jar
[INFO] ------------------------------------------------------------------------
[INFO] Building Apache Tuscany SCA binding.ws Feature
[INFO]    task-segment: [clean, install]
[INFO] ------------------------------------------------------------------------
[INFO] [clean:clean {execution: default-clean}]
[INFO] [enforcer:enforce {execution: enforce-plugin-versions}]
[INFO] [site:attach-descriptor {execution: default-attach-descriptor}]
[INFO] [source:jar-no-fork {execution: attach-sources}]
[INFO] [install:install {execution: default-install}]
[INFO] Installing <http://hudson.zones.apache.org/hudson/job/Tuscany-2x/ws/sca-2x/features/binding-ws/pom.xml>
to /home/hudson/.m2/repository/org/apache/tuscany/sca/tuscany-feature-binding-ws/2.0-SNAPSHOT/tuscany-feature-binding-ws-2.0-SNAPSHOT.pom
[HUDSON] Archiving <http://hudson.zones.apache.org/hudson/job/Tuscany-2x/ws/sca-2x/features/binding-ws/pom.xml>
to /export/home/hudson/hudson/jobs/Tuscany-2x/modules/org.apache.tuscany.sca$tuscany-feature-binding-ws/builds/2010-05-15_00-25-39/archive/org.apache.tuscany.sca/tuscany-feature-binding-ws/2.0-SNAPSHOT/pom.xml
[HUDSON] Archiving /home/hudson/.m2/repository/org/apache/tuscany/sca/tuscany-feature-binding-ws/2.0-SNAPSHOT/tuscany-feature-binding-ws-2.0-SNAPSHOT.pom
to /export/home/hudson/hudson/jobs/Tuscany-2x/modules/org.apache.tuscany.sca$tuscany-feature-binding-ws/builds/2010-05-15_00-25-39/archive/org.apache.tuscany.sca/tuscany-feature-binding-ws/2.0-SNAPSHOT/tuscany-feature-binding-ws-2.0-SNAPSHOT.pom
[INFO] ------------------------------------------------------------------------
[INFO] Building Apache Tuscany SCA Sample Embedded Launcher JSE
[INFO]    task-segment: [clean, install]
[INFO] ------------------------------------------------------------------------
[INFO] [clean:clean {execution: default-clean}]
[INFO] [enforcer:enforce {execution: enforce-plugin-versions}]
[INFO] [resources:resources {execution: default-resources}]
[INFO] Using 'UTF-8' encoding to copy filtered resources.
[INFO] skip non existing resourceDirectory <http://hudson.zones.apache.org/hudson/job/Tuscany-2x/ws/sca-2x/samples/launcher-embedded-jse/src/main/resources>
[INFO] Copying 0 resource
[INFO] [compiler:compile {execution: default-compile}]
[INFO] Compiling 3 source files to <http://hudson.zones.apache.org/hudson/job/Tuscany-2x/ws/sca-2x/samples/launcher-embedded-jse/target/classes>
[INFO] -------------------------------------------------------------
[ERROR] COMPILATION ERROR : 
[INFO] -------------------------------------------------------------
[ERROR] <http://hudson.zones.apache.org/hudson/job/Tuscany-2x/ws/sca-2x/samples/launcher-embedded-jse/src/main/java/launcher/SampleJSELauncher.java>:[32,39]
cannot find symbol
symbol: class RuntimeIntegration
public class SampleJSELauncher extends RuntimeIntegration {

[ERROR] <http://hudson.zones.apache.org/hudson/job/Tuscany-2x/ws/sca-2x/samples/launcher-embedded-jse/src/main/java/launcher/SampleJSELauncher.java>:[61,20]
cannot find symbol
symbol  : method startNode(org.apache.tuscany.sca.node.Contribution)
location: class launcher.SampleJSELauncher

[ERROR] <http://hudson.zones.apache.org/hudson/job/Tuscany-2x/ws/sca-2x/samples/launcher-embedded-jse/src/main/java/launcher/SampleJSELauncher.java>:[70,8]
cannot find symbol
symbol  : method stopNode(org.apache.tuscany.sca.node.Node)
location: class launcher.SampleJSELauncher

[ERROR] <http://hudson.zones.apache.org/hudson/job/Tuscany-2x/ws/sca-2x/samples/launcher-embedded-jse/src/main/java/launcher/SampleJSELauncher.java>:[77,20]
cannot find symbol
symbol  : method startNode(org.apache.tuscany.sca.node.Contribution)
location: class launcher.SampleJSELauncher

[ERROR] <http://hudson.zones.apache.org/hudson/job/Tuscany-2x/ws/sca-2x/samples/launcher-embedded-jse/src/main/java/launcher/SampleJSELauncher.java>:[87,8]
cannot find symbol
symbol  : method stopNode(org.apache.tuscany.sca.node.Node)
location: class launcher.SampleJSELauncher

[INFO] 5 errors 
[INFO] -------------------------------------------------------------
[HUDSON] Archiving <http://hudson.zones.apache.org/hudson/job/Tuscany-2x/ws/sca-2x/samples/launcher-embedded-jse/pom.xml>
to /export/home/hudson/hudson/jobs/Tuscany-2x/modules/org.apache.tuscany.sca$sample-launcher-embedded-jse/builds/2010-05-15_00-25-37/archive/org.apache.tuscany.sca/sample-launcher-embedded-jse/2.0-SNAPSHOT/pom.xml
[INFO] ------------------------------------------------------------------------
[ERROR] BUILD FAILURE
[INFO] ------------------------------------------------------------------------
[INFO] Compilation failure

<http://hudson.zones.apache.org/hudson/job/Tuscany-2x/ws/sca-2x/samples/launcher-embedded-jse/src/main/java/launcher/SampleJSELauncher.java>:[32,39]
cannot find symbol
symbol: class RuntimeIntegration
public class SampleJSELauncher extends RuntimeIntegration {

<http://hudson.zones.apache.org/hudson/job/Tuscany-2x/ws/sca-2x/samples/launcher-embedded-jse/src/main/java/launcher/SampleJSELauncher.java>:[61,20]
cannot find symbol
symbol  : method startNode(org.apache.tuscany.sca.node.Contribution)
location: class launcher.SampleJSELauncher

<http://hudson.zones.apache.org/hudson/job/Tuscany-2x/ws/sca-2x/samples/launcher-embedded-jse/src/main/java/launcher/SampleJSELauncher.java>:[70,8]
cannot find symbol
symbol  : method stopNode(org.apache.tuscany.sca.node.Node)
location: class launcher.SampleJSELauncher

<http://hudson.zones.apache.org/hudson/job/Tuscany-2x/ws/sca-2x/samples/launcher-embedded-jse/src/main/java/launcher/SampleJSELauncher.java>:[77,20]
cannot find symbol
symbol  : method startNode(org.apache.tuscany.sca.node.Contribution)
location: class launcher.SampleJSELauncher

<http://hudson.zones.apache.org/hudson/job/Tuscany-2x/ws/sca-2x/samples/launcher-embedded-jse/src/main/java/launcher/SampleJSELauncher.java>:[87,8]
cannot find symbol
symbol  : method stopNode(org.apache.tuscany.sca.node.Node)
location: class launcher.SampleJSELauncher


[INFO] ------------------------------------------------------------------------
[INFO] For more information, run Maven with the -e switch
[INFO] ------------------------------------------------------------------------
[INFO] Total time: 20 minutes 18 seconds
[INFO] Finished at: Sat May 15 00:46:12 UTC 2010
[INFO] Final Memory: 119M/749M
[INFO] ------------------------------------------------------------------------
Waiting for Hudson to finish collecting data
Sending e-mails to: commits@tuscany.apache.org
channel stopped
2010-05-15 00:47:06.017::INFO:  Shutdown hook executing
2010-05-15 00:47:06.017::INFO:  Shutdown hook complete
2010-05-15 00:47:07.017::INFO:  Shutdown hook complete
2010-05-15 00:47:08.018::INFO:  Shutdown hook complete
2010-05-15 00:47:09.018::INFO:  Shutdown hook complete
2010-05-15 00:47:10.018::INFO:  Shutdown hook complete
2010-05-15 00:47:11.018::INFO:  Shutdown hook complete
2010-05-15 00:47:12.019::INFO:  Shutdown hook complete
2010-05-15 00:47:13.019::INFO:  Shutdown hook complete


Mime
View raw message