tuscany-commits mailing list archives

Site index · List index
Message view « Date » · « Thread »
Top « Date » · « Thread »
From Apache Hudson Server <hud...@hudson.zones.apache.org>
Subject Build failed in Hudson: Tuscany-2x #664
Date Tue, 04 May 2010 06:48:55 GMT
See <http://hudson.zones.apache.org/hudson/job/Tuscany-2x/664/changes>

Changes:

[rfeng] Format the code

[rfeng] Add a utility to generate a JAX-RS resource class from the JAX-RS annotated interface

------------------------------------------
[...truncated 7282 lines...]
[INFO] Writing generated manifest for: org.apache.axis2:axis2-transport-local:jar:1.5.1:compile
to <http://hudson.zones.apache.org/hudson/job/Tuscany-2x/ws/sca-2x/distribution/all/target/modules/axis2-transport-local-1.5.1/META-INF/MANIFEST.MF>
[INFO] Adding JAR artifact: org.apache.ode:ode-bpel-runtime:jar:1.3.2:compile
[INFO] Writing generated manifest for: org.apache.ode:ode-bpel-runtime:jar:1.3.2:compile to
<http://hudson.zones.apache.org/hudson/job/Tuscany-2x/ws/sca-2x/distribution/all/target/modules/ode-bpel-runtime-1.3.2/META-INF/MANIFEST.MF>
[INFO] Adding JAR artifact: org.apache.openjpa:openjpa:jar:1.2.1:compile
[INFO] Writing generated manifest for: org.apache.openjpa:openjpa:jar:1.2.1:compile to <http://hudson.zones.apache.org/hudson/job/Tuscany-2x/ws/sca-2x/distribution/all/target/modules/openjpa-1.2.1/META-INF/MANIFEST.MF>
[INFO] Adding JAR artifact: org.apache.abdera:abdera-extensions-html:jar:0.4.0-incubating:compile
[INFO] Writing generated manifest for: org.apache.abdera:abdera-extensions-html:jar:0.4.0-incubating:compile
to <http://hudson.zones.apache.org/hudson/job/Tuscany-2x/ws/sca-2x/distribution/all/target/modules/abdera-extensions-html-0.4.0-incubating/META-INF/MANIFEST.MF>
[INFO] Adding OSGi bundle artifact: org.codehaus.jackson:jackson-core-asl:jar:1.5.0:compile
[INFO] Adding OSGi bundle artifact: org.eclipse.emf:ecore-change:jar:2.2.3:compile
[INFO] Adding JAR artifact: net.sf.saxon:saxon:jar:9.x:compile
[INFO] Writing generated manifest for: net.sf.saxon:saxon:jar:9.x:compile to <http://hudson.zones.apache.org/hudson/job/Tuscany-2x/ws/sca-2x/distribution/all/target/modules/saxon-9.x/META-INF/MANIFEST.MF>
[INFO] Adding OSGi bundle artifact: org.slf4j:slf4j-simple:jar:1.5.8:compile
[INFO] Adding JAR artifact: org.apache.geronimo.specs:geronimo-jta_1.0.1B_spec:jar:1.0:compile
May 4, 2010 12:25:08 AM org.apache.tuscany.maven.bundle.plugin.BundleUtil libraryManifest
WARNING: Duplicate or system package skipped: javax.transaction;version=1.0.0
May 4, 2010 12:25:08 AM org.apache.tuscany.maven.bundle.plugin.BundleUtil libraryManifest
WARNING: Duplicate or system package skipped: javax.transaction.xa;version=1.0.0
[INFO] Writing generated manifest for: org.apache.geronimo.specs:geronimo-jta_1.0.1B_spec:jar:1.0:compile
to <http://hudson.zones.apache.org/hudson/job/Tuscany-2x/ws/sca-2x/distribution/all/target/modules/geronimo-jta_1.0.1B_spec-1.0/META-INF/MANIFEST.MF>
[INFO] Adding OSGi bundle artifact: org.apache.geronimo.specs:geronimo-ejb_3.0_spec:jar:1.0.1:compile
[INFO] Adding JAR artifact: jdom:jdom:jar:1.0:compile
[INFO] Writing generated manifest for: jdom:jdom:jar:1.0:compile to <http://hudson.zones.apache.org/hudson/job/Tuscany-2x/ws/sca-2x/distribution/all/target/modules/jdom-1.0/META-INF/MANIFEST.MF>
[INFO] Adding JAR artifact: org.apache.abdera:abdera-server:jar:0.4.0-incubating:compile
[INFO] Writing generated manifest for: org.apache.abdera:abdera-server:jar:0.4.0-incubating:compile
to <http://hudson.zones.apache.org/hudson/job/Tuscany-2x/ws/sca-2x/distribution/all/target/modules/abdera-server-0.4.0-incubating/META-INF/MANIFEST.MF>
[INFO] Adding JAR artifact: org.apache.ode:ode-bpel-compiler:jar:1.3.2:compile
[INFO] Writing generated manifest for: org.apache.ode:ode-bpel-compiler:jar:1.3.2:compile
to <http://hudson.zones.apache.org/hudson/job/Tuscany-2x/ws/sca-2x/distribution/all/target/modules/ode-bpel-compiler-1.3.2/META-INF/MANIFEST.MF>
[INFO] Adding JAR artifact: wsdl4j:wsdl4j:jar:1.6.2:compile
[INFO] Writing generated manifest for: wsdl4j:wsdl4j:jar:1.6.2:compile to <http://hudson.zones.apache.org/hudson/job/Tuscany-2x/ws/sca-2x/distribution/all/target/modules/wsdl4j-1.6.2/META-INF/MANIFEST.MF>
[INFO] Generating gateway bundle: <http://hudson.zones.apache.org/hudson/job/Tuscany-2x/ws/sca-2x/distribution/all/target/modules/tuscany-gateway-2.0-SNAPSHOT.jar>
[INFO] Generating target definition: <http://hudson.zones.apache.org/hudson/job/Tuscany-2x/ws/sca-2x/distribution/all/target/features/tuscany.target>
[INFO] Generating target definition: <http://hudson.zones.apache.org/hudson/job/Tuscany-2x/ws/sca-2x/distribution/all/target/features/tuscany-pde35.target>
[INFO] Generating configuation: <http://hudson.zones.apache.org/hudson/job/Tuscany-2x/ws/sca-2x/distribution/all/target/features/configuration/config.ini>
[INFO] Generating manifest jar: <http://hudson.zones.apache.org/hudson/job/Tuscany-2x/ws/sca-2x/distribution/all/target/features/tuscany-sca-manifest.jar>
[INFO] Generating equinox manifest jar: <http://hudson.zones.apache.org/hudson/job/Tuscany-2x/ws/sca-2x/distribution/all/target/features/tuscany-sca-equinox-manifest.jar>
[INFO] Generating ANT build path: <http://hudson.zones.apache.org/hudson/job/Tuscany-2x/ws/sca-2x/distribution/all/target/features/build-path.xml>
[INFO] [site:attach-descriptor {execution: default-attach-descriptor}]
[INFO] [source:jar-no-fork {execution: attach-sources}]
[INFO] [assembly:single {execution: distribution-package}]
[INFO] Reading assembly descriptor: src/main/assembly/bin-distribution.xml
[INFO] Reading assembly descriptor: src/main/assembly/src.xml
[INFO] Processing DependencySet (output=lib)
[WARNING] Cannot include project artifact: org.apache.tuscany.sca:tuscany-distribution-all:pom:2.0-SNAPSHOT;
it doesn't have an associated file or directory.
[INFO] Processing DependencySet (output=bin)
[WARNING] Cannot include project artifact: org.apache.tuscany.sca:tuscany-distribution-all:pom:2.0-SNAPSHOT;
it doesn't have an associated file or directory.
[INFO] Building tar : <http://hudson.zones.apache.org/hudson/job/Tuscany-2x/ws/sca-2x/distribution/all/target/apache-tuscany-sca-all-2.0-SNAPSHOT.tar.gz>
[INFO] Processing DependencySet (output=lib)
[WARNING] Cannot include project artifact: org.apache.tuscany.sca:tuscany-distribution-all:pom:2.0-SNAPSHOT;
it doesn't have an associated file or directory.
[INFO] Processing DependencySet (output=bin)
[WARNING] Cannot include project artifact: org.apache.tuscany.sca:tuscany-distribution-all:pom:2.0-SNAPSHOT;
it doesn't have an associated file or directory.
[INFO] Building zip: <http://hudson.zones.apache.org/hudson/job/Tuscany-2x/ws/sca-2x/distribution/all/target/apache-tuscany-sca-all-2.0-SNAPSHOT.zip>
[INFO] Building tar : <http://hudson.zones.apache.org/hudson/job/Tuscany-2x/ws/sca-2x/distribution/all/target/apache-tuscany-sca-all-2.0-SNAPSHOT-src.tar.gz>
[INFO] Building zip: <http://hudson.zones.apache.org/hudson/job/Tuscany-2x/ws/sca-2x/distribution/all/target/apache-tuscany-sca-all-2.0-SNAPSHOT-src.zip>
[INFO] [install:install {execution: default-install}]
[INFO] Installing <http://hudson.zones.apache.org/hudson/job/Tuscany-2x/ws/sca-2x/distribution/all/pom.xml>
to /home/hudson/.m2/repository/org/apache/tuscany/sca/tuscany-distribution-all/2.0-SNAPSHOT/tuscany-distribution-all-2.0-SNAPSHOT.pom
[INFO] Installing <http://hudson.zones.apache.org/hudson/job/Tuscany-2x/ws/sca-2x/distribution/all/target/apache-tuscany-sca-all-2.0-SNAPSHOT.tar.gz>
to /home/hudson/.m2/repository/org/apache/tuscany/sca/tuscany-distribution-all/2.0-SNAPSHOT/tuscany-distribution-all-2.0-SNAPSHOT.tar.gz
[INFO] Installing <http://hudson.zones.apache.org/hudson/job/Tuscany-2x/ws/sca-2x/distribution/all/target/apache-tuscany-sca-all-2.0-SNAPSHOT.zip>
to /home/hudson/.m2/repository/org/apache/tuscany/sca/tuscany-distribution-all/2.0-SNAPSHOT/tuscany-distribution-all-2.0-SNAPSHOT.zip
[INFO] Installing <http://hudson.zones.apache.org/hudson/job/Tuscany-2x/ws/sca-2x/distribution/all/target/apache-tuscany-sca-all-2.0-SNAPSHOT-src.tar.gz>
to /home/hudson/.m2/repository/org/apache/tuscany/sca/tuscany-distribution-all/2.0-SNAPSHOT/tuscany-distribution-all-2.0-SNAPSHOT-src.tar.gz
[INFO] Installing <http://hudson.zones.apache.org/hudson/job/Tuscany-2x/ws/sca-2x/distribution/all/target/apache-tuscany-sca-all-2.0-SNAPSHOT-src.zip>
to /home/hudson/.m2/repository/org/apache/tuscany/sca/tuscany-distribution-all/2.0-SNAPSHOT/tuscany-distribution-all-2.0-SNAPSHOT-src.zip
[HUDSON] Archiving <http://hudson.zones.apache.org/hudson/job/Tuscany-2x/ws/sca-2x/distribution/all/pom.xml>
to /export/home/hudson/hudson/jobs/Tuscany-2x/modules/org.apache.tuscany.sca$tuscany-distribution-all/builds/2010-05-04_00-08-12/archive/org.apache.tuscany.sca/tuscany-distribution-all/2.0-SNAPSHOT/pom.xml
[HUDSON] Archiving /home/hudson/.m2/repository/org/apache/tuscany/sca/tuscany-distribution-all/2.0-SNAPSHOT/tuscany-distribution-all-2.0-SNAPSHOT.pom
to /export/home/hudson/hudson/jobs/Tuscany-2x/modules/org.apache.tuscany.sca$tuscany-distribution-all/builds/2010-05-04_00-08-12/archive/org.apache.tuscany.sca/tuscany-distribution-all/2.0-SNAPSHOT/tuscany-distribution-all-2.0-SNAPSHOT.pom
[HUDSON] Archiving <http://hudson.zones.apache.org/hudson/job/Tuscany-2x/ws/sca-2x/distribution/all/target/apache-tuscany-sca-all-2.0-SNAPSHOT.tar.gz>
to /export/home/hudson/hudson/jobs/Tuscany-2x/modules/org.apache.tuscany.sca$tuscany-distribution-all/builds/2010-05-04_00-08-12/archive/org.apache.tuscany.sca/tuscany-distribution-all/2.0-SNAPSHOT/apache-tuscany-sca-all-2.0-SNAPSHOT.tar.gz
[HUDSON] Archiving <http://hudson.zones.apache.org/hudson/job/Tuscany-2x/ws/sca-2x/distribution/all/target/apache-tuscany-sca-all-2.0-SNAPSHOT.zip>
to /export/home/hudson/hudson/jobs/Tuscany-2x/modules/org.apache.tuscany.sca$tuscany-distribution-all/builds/2010-05-04_00-08-12/archive/org.apache.tuscany.sca/tuscany-distribution-all/2.0-SNAPSHOT/apache-tuscany-sca-all-2.0-SNAPSHOT.zip
[HUDSON] Archiving <http://hudson.zones.apache.org/hudson/job/Tuscany-2x/ws/sca-2x/distribution/all/target/apache-tuscany-sca-all-2.0-SNAPSHOT-src.tar.gz>
to /export/home/hudson/hudson/jobs/Tuscany-2x/modules/org.apache.tuscany.sca$tuscany-distribution-all/builds/2010-05-04_00-08-12/archive/org.apache.tuscany.sca/tuscany-distribution-all/2.0-SNAPSHOT/apache-tuscany-sca-all-2.0-SNAPSHOT-src.tar.gz
[HUDSON] Archiving <http://hudson.zones.apache.org/hudson/job/Tuscany-2x/ws/sca-2x/distribution/all/target/apache-tuscany-sca-all-2.0-SNAPSHOT-src.zip>
to /export/home/hudson/hudson/jobs/Tuscany-2x/modules/org.apache.tuscany.sca$tuscany-distribution-all/builds/2010-05-04_00-08-12/archive/org.apache.tuscany.sca/tuscany-distribution-all/2.0-SNAPSHOT/apache-tuscany-sca-all-2.0-SNAPSHOT-src.zip
[INFO] ------------------------------------------------------------------------
[INFO] Building Apache Tuscany SCA iTest Distribution
[INFO]    task-segment: [clean, install]
[INFO] ------------------------------------------------------------------------
[INFO] [clean:clean {execution: default-clean}]
[INFO] [enforcer:enforce {execution: enforce-plugin-versions}]
[INFO] [site:attach-descriptor {execution: default-attach-descriptor}]
[INFO] [source:jar-no-fork {execution: attach-sources}]
[INFO] [install:install {execution: default-install}]
[INFO] Installing <http://hudson.zones.apache.org/hudson/job/Tuscany-2x/ws/sca-2x/itest/distribution/pom.xml>
to /home/hudson/.m2/repository/org/apache/tuscany/sca/itest-distribution/2.0-SNAPSHOT/itest-distribution-2.0-SNAPSHOT.pom
[HUDSON] Archiving <http://hudson.zones.apache.org/hudson/job/Tuscany-2x/ws/sca-2x/itest/distribution/pom.xml>
to /export/home/hudson/hudson/jobs/Tuscany-2x/modules/org.apache.tuscany.sca$itest-distribution/builds/2010-05-04_00-08-05/archive/org.apache.tuscany.sca/itest-distribution/2.0-SNAPSHOT/pom.xml
[HUDSON] Archiving /home/hudson/.m2/repository/org/apache/tuscany/sca/itest-distribution/2.0-SNAPSHOT/itest-distribution-2.0-SNAPSHOT.pom
to /export/home/hudson/hudson/jobs/Tuscany-2x/modules/org.apache.tuscany.sca$itest-distribution/builds/2010-05-04_00-08-05/archive/org.apache.tuscany.sca/itest-distribution/2.0-SNAPSHOT/itest-distribution-2.0-SNAPSHOT.pom
[INFO] ------------------------------------------------------------------------
[INFO] Building Apache Tuscany SCA iTest Distribution Bin Distro Unzip
[INFO]    task-segment: [clean, install]
[INFO] ------------------------------------------------------------------------
[INFO] [clean:clean {execution: default-clean}]
[INFO] Deleting <http://hudson.zones.apache.org/hudson/job/Tuscany-2x/ws/sca-2x/itest/distribution/bin-distro-unzip/target>
[INFO] [enforcer:enforce {execution: enforce-plugin-versions}]
[INFO] [resources:resources {execution: default-resources}]
[INFO] Using 'UTF-8' encoding to copy filtered resources.
[INFO] skip non existing resourceDirectory <http://hudson.zones.apache.org/hudson/job/Tuscany-2x/ws/sca-2x/itest/distribution/bin-distro-unzip/src/main/resources>
[INFO] Copying 0 resource
[INFO] [compiler:compile {execution: default-compile}]
[INFO] No sources to compile
[INFO] [resources:testResources {execution: default-testResources}]
[INFO] Using 'UTF-8' encoding to copy filtered resources.
[INFO] skip non existing resourceDirectory <http://hudson.zones.apache.org/hudson/job/Tuscany-2x/ws/sca-2x/itest/distribution/bin-distro-unzip/src/test/resources>
[INFO] [compiler:testCompile {execution: default-testCompile}]
[INFO] Not compiling test sources
[INFO] [surefire:test {execution: default-test}]
[INFO] Tests are skipped.
[INFO] [jar:jar {execution: default-jar}]
[INFO] Building jar: <http://hudson.zones.apache.org/hudson/job/Tuscany-2x/ws/sca-2x/itest/distribution/bin-distro-unzip/target/itest-bin-distro-unzip-2.0-SNAPSHOT.jar>
[INFO] [source:jar-no-fork {execution: attach-sources}]
[INFO] No sources in project. Archive not created.
[INFO] [antrun:run {execution: run-samples}]
[INFO] Executing tasks

unzip:
    [unzip] Expanding: <http://hudson.zones.apache.org/hudson/job/Tuscany-2x/ws/sca-2x/distribution/all/target/apache-tuscany-sca-all-2.0-SNAPSHOT.zip>
into <http://hudson.zones.apache.org/hudson/job/Tuscany-2x/ws/sca-2x/distribution/all/target/apache-tuscany-sca-all-2.0-SNAPSHOT.dir>
[INFO] Executed tasks
[INFO] [install:install {execution: default-install}]
[INFO] Installing <http://hudson.zones.apache.org/hudson/job/Tuscany-2x/ws/sca-2x/itest/distribution/bin-distro-unzip/target/itest-bin-distro-unzip-2.0-SNAPSHOT.jar>
to /home/hudson/.m2/repository/org/apache/tuscany/sca/itest-bin-distro-unzip/2.0-SNAPSHOT/itest-bin-distro-unzip-2.0-SNAPSHOT.jar
[HUDSON] Archiving <http://hudson.zones.apache.org/hudson/job/Tuscany-2x/ws/sca-2x/itest/distribution/bin-distro-unzip/pom.xml>
to /export/home/hudson/hudson/jobs/Tuscany-2x/modules/org.apache.tuscany.sca$itest-bin-distro-unzip/builds/2010-05-04_00-08-05/archive/org.apache.tuscany.sca/itest-bin-distro-unzip/2.0-SNAPSHOT/pom.xml
[HUDSON] Archiving <http://hudson.zones.apache.org/hudson/job/Tuscany-2x/ws/sca-2x/itest/distribution/bin-distro-unzip/target/itest-bin-distro-unzip-2.0-SNAPSHOT.jar>
to /export/home/hudson/hudson/jobs/Tuscany-2x/modules/org.apache.tuscany.sca$itest-bin-distro-unzip/builds/2010-05-04_00-08-05/archive/org.apache.tuscany.sca/itest-bin-distro-unzip/2.0-SNAPSHOT/itest-bin-distro-unzip-2.0-SNAPSHOT.jar
[INFO] ------------------------------------------------------------------------
[INFO] Building Apache Tuscany SCA iTest Distribution binding-ws-calculator
[INFO]    task-segment: [clean, install]
[INFO] ------------------------------------------------------------------------
[INFO] [clean:clean {execution: default-clean}]
[INFO] Deleting <http://hudson.zones.apache.org/hudson/job/Tuscany-2x/ws/sca-2x/itest/distribution/binding-ws-calculator/target>
[INFO] snapshot org.apache.tuscany.sca:itest-bin-distro-unzip:2.0-SNAPSHOT: checking for updates
from apache.snapshots
[INFO] [enforcer:enforce {execution: enforce-plugin-versions}]
[INFO] [resources:resources {execution: default-resources}]
[INFO] Using 'UTF-8' encoding to copy filtered resources.
[INFO] skip non existing resourceDirectory <http://hudson.zones.apache.org/hudson/job/Tuscany-2x/ws/sca-2x/itest/distribution/binding-ws-calculator/src/main/resources>
[INFO] Copying 0 resource
[INFO] [compiler:compile {execution: default-compile}]
[INFO] No sources to compile
[INFO] [resources:testResources {execution: default-testResources}]
[INFO] Using 'UTF-8' encoding to copy filtered resources.
[INFO] skip non existing resourceDirectory <http://hudson.zones.apache.org/hudson/job/Tuscany-2x/ws/sca-2x/itest/distribution/binding-ws-calculator/src/test/resources>
[INFO] [compiler:testCompile {execution: default-testCompile}]
[INFO] Not compiling test sources
[INFO] [surefire:test {execution: default-test}]
[INFO] Tests are skipped.
[INFO] [jar:jar {execution: default-jar}]
[INFO] Building jar: <http://hudson.zones.apache.org/hudson/job/Tuscany-2x/ws/sca-2x/itest/distribution/binding-ws-calculator/target/itest-distribution-binding-ws-calculator-2.0-SNAPSHOT.jar>
[INFO] [source:jar-no-fork {execution: attach-sources}]
[INFO] No sources in project. Archive not created.
[INFO] [antrun:run {execution: run-samples}]
[INFO] Executing tasks
     [echo] /home/hudson/tools/java/jdk1.6.0_17-32/jre

run:

init:
    [mkdir] Created dir: <http://hudson.zones.apache.org/hudson/job/Tuscany-2x/ws/sca-2x/distribution/all/target/apache-tuscany-sca-all-2.0-SNAPSHOT.dir/tuscany-sca-2.0-SNAPSHOT/samples/binding-ws-calculator/target/classes>

compile:
    [javac] Compiling 13 source files to <http://hudson.zones.apache.org/hudson/job/Tuscany-2x/ws/sca-2x/distribution/all/target/apache-tuscany-sca-all-2.0-SNAPSHOT.dir/tuscany-sca-2.0-SNAPSHOT/samples/binding-ws-calculator/target/classes>
     [copy] Copying 2 files to <http://hudson.zones.apache.org/hudson/job/Tuscany-2x/ws/sca-2x/distribution/all/target/apache-tuscany-sca-all-2.0-SNAPSHOT.dir/tuscany-sca-2.0-SNAPSHOT/samples/binding-ws-calculator/target/classes>
      [jar] Building jar: <http://hudson.zones.apache.org/hudson/job/Tuscany-2x/ws/sca-2x/distribution/all/target/apache-tuscany-sca-all-2.0-SNAPSHOT.dir/tuscany-sca-2.0-SNAPSHOT/samples/binding-ws-calculator/target/sample-binding-ws-calculator.jar>

run:
     [java] May 4, 2010 12:39:03 AM org.apache.tuscany.sca.node.impl.NodeImpl start
     [java] INFO: Starting node: http://tuscany.apache.org/sca/1.1/nodes/default0 domain:
default
     [java] SLF4J: Class path contains multiple SLF4J bindings.
     [java] SLF4J: Found binding in [jar:<http://hudson.zones.apache.org/hudson/job/Tuscany-2x/ws/sca-2x/distribution/all/target/apache-tuscany-sca-all-2.0-SNAPSHOT.dir/tuscany-sca-2.0-SNAPSHOT/modules/slf4j-jdk14-1.5.8.jar!/org/slf4j/impl/StaticLoggerBinder.class]>
     [java] SLF4J: Found binding in [jar:<http://hudson.zones.apache.org/hudson/job/Tuscany-2x/ws/sca-2x/distribution/all/target/apache-tuscany-sca-all-2.0-SNAPSHOT.dir/tuscany-sca-2.0-SNAPSHOT/modules/slf4j-simple-1.5.8.jar!/org/slf4j/impl/StaticLoggerBinder.class]>
     [java] SLF4J: See http://www.slf4j.org/codes.html#multiple_bindings for an explanation.
     [java] May 4, 2010 12:39:03 AM org.apache.tuscany.sca.node.impl.NodeFactoryImpl loadContributions
     [java] INFO: Loading contribution: <http://hudson.zones.apache.org/hudson/job/Tuscany-2x/ws/sca-2x/distribution/all/target/apache-tuscany-sca-all-2.0-SNAPSHOT.dir/tuscany-sca-2.0-SNAPSHOT/samples/binding-ws-calculator/target/sample-binding-ws-calculator.jar>
     [java] May 4, 2010 12:39:04 AM org.apache.tuscany.sca.definitions.impl.DefinitionsImpl
[Extension points definitions] (DuplicateIntent)
     [java] SEVERE: [ASM10001,POL30002] Duplicate intent {http://tuscany.apache.org/xmlns/sca/1.1}MTOM
found in domain
     [java] May 4, 2010 12:39:04 AM org.apache.tuscany.sca.definitions.impl.DefinitionsImpl
[Extension points definitions] (DuplicateBindingType)
     [java] SEVERE: [POL40020] Duplicate binding type {http://docs.oasis-open.org/ns/opencsa/sca/200912}binding.ws
found in domain
     [java] May 4, 2010 12:39:05 AM org.apache.tuscany.sca.core.assembly.impl.EndpointRegistryImpl
addEndpoint
     [java] INFO: Add endpoint - (@17683656)Endpoint:  URI = SampleClient#service-binding(CalculatorClientImpl/CalculatorClientImpl)
     [java] May 4, 2010 12:39:05 AM org.apache.tuscany.sca.core.assembly.impl.EndpointRegistryImpl
addEndpoint
     [java] INFO: Add endpoint - (@17608609)Endpoint:  URI = CalculatorServiceComponent#service-binding(CalculatorServiceImpl/CalculatorServiceImpl)
     [java] Binding.ws JAXWS provider - Service URI: http://localhost:8085/AddServiceComponent
     [java] May 4, 2010 12:39:05 AM org.apache.tuscany.sca.core.assembly.impl.EndpointRegistryImpl
addEndpoint
     [java] INFO: Add endpoint - (@459327)Endpoint:  URI = AddServiceComponent#service-binding(AddService/AddService)
     [java] May 4, 2010 12:39:05 AM org.apache.tuscany.sca.core.assembly.impl.EndpointRegistryImpl
addEndpoint
     [java] INFO: Add endpoint - (@2391370)Endpoint:  URI = SubtractServiceComponent#service-binding(SubtractServiceImpl/SubtractServiceImpl)
     [java] May 4, 2010 12:39:05 AM org.apache.tuscany.sca.core.assembly.impl.EndpointRegistryImpl
addEndpoint
     [java] INFO: Add endpoint - (@27114948)Endpoint:  URI = MultiplyServiceComponent#service-binding(MultiplyServiceImpl/MultiplyServiceImpl)
     [java] May 4, 2010 12:39:05 AM org.apache.tuscany.sca.core.assembly.impl.EndpointRegistryImpl
addEndpoint
     [java] INFO: Add endpoint - (@18193932)Endpoint:  URI = DivideServiceComponent#service-binding(DivideServiceImpl/DivideServiceImpl)
     [java] SCA API ClassLoader: java.net.URLClassLoader@7ffe01 sun.misc.Launcher$AppClassLoader@1ba34f2
sun.misc.Launcher$ExtClassLoader@1ea2dfe 
     [java] Exception in thread "main" java.lang.reflect.InvocationTargetException
     [java] 	at sun.reflect.NativeMethodAccessorImpl.invoke0(Native Method)
     [java] 	at sun.reflect.NativeMethodAccessorImpl.invoke(NativeMethodAccessorImpl.java:39)
     [java] 	at sun.reflect.DelegatingMethodAccessorImpl.invoke(DelegatingMethodAccessorImpl.java:25)
     [java] 	at java.lang.reflect.Method.invoke(Method.java:597)
     [java] 	at org.apache.tuscany.sca.launcher.LauncherMain.invokeMainMethod(LauncherMain.java:115)
     [java] 	at org.apache.tuscany.sca.launcher.LauncherMain.main(LauncherMain.java:56)
     [java] Caused by: java.lang.ArrayIndexOutOfBoundsException: 1
     [java] 	at org.apache.tuscany.sca.databinding.jaxb.JAXBWrapperHandler.setChildren(JAXBWrapperHandler.java:75)
     [java] 	at org.apache.tuscany.sca.core.databinding.transformers.Input2InputTransformer.transform(Input2InputTransformer.java:174)
     [java] 	at org.apache.tuscany.sca.core.databinding.transformers.Input2InputTransformer.transform(Input2InputTransformer.java:45)
     [java] 	at org.apache.tuscany.sca.databinding.DefaultTransformerExtensionPoint$LazyPullTransformer.transform(DefaultTransformerExtensionPoint.java:209)
     [java] 	at org.apache.tuscany.sca.databinding.impl.MediatorImpl.mediate(MediatorImpl.java:116)
     [java] 	at org.apache.tuscany.sca.databinding.impl.MediatorImpl.mediateInput(MediatorImpl.java:436)
     [java] 	at org.apache.tuscany.sca.core.databinding.wire.DataTransformationInterceptor.invoke(DataTransformationInterceptor.java:64)
     [java] 	at org.apache.tuscany.sca.core.databinding.wire.DataTransformationInterceptor.invoke(DataTransformationInterceptor.java:66)
     [java] 	at org.apache.tuscany.sca.core.invocation.impl.JDKInvocationHandler.invoke(JDKInvocationHandler.java:236)
     [java] 	at org.apache.tuscany.sca.core.invocation.impl.JDKInvocationHandler.invoke(JDKInvocationHandler.java:106)
     [java] 	at $Proxy24.add(Unknown Source)
     [java] 	at calculator.CalculatorServiceImpl.add(CalculatorServiceImpl.java:55)
     [java] 	at sun.reflect.NativeMethodAccessorImpl.invoke0(Native Method)
     [java] 	at sun.reflect.NativeMethodAccessorImpl.invoke(NativeMethodAccessorImpl.java:39)
     [java] 	at sun.reflect.DelegatingMethodAccessorImpl.invoke(DelegatingMethodAccessorImpl.java:25)
     [java] 	at java.lang.reflect.Method.invoke(Method.java:597)
     [java] 	at org.apache.tuscany.sca.implementation.java.invocation.JavaImplementationInvoker.invoke(JavaImplementationInvoker.java:113)
     [java] 	at org.apache.tuscany.sca.binding.sca.provider.SCABindingInvoker.invoke(SCABindingInvoker.java:75)
     [java] 	at org.apache.tuscany.sca.core.invocation.impl.JDKInvocationHandler.invoke(JDKInvocationHandler.java:236)
     [java] 	at org.apache.tuscany.sca.core.invocation.impl.JDKInvocationHandler.invoke(JDKInvocationHandler.java:106)
     [java] 	at $Proxy23.add(Unknown Source)
     [java] 	at calculator.CalculatorClientImpl.runSample(CalculatorClientImpl.java:50)
     [java] 	at sun.reflect.NativeMethodAccessorImpl.invoke0(Native Method)
     [java] 	at sun.reflect.NativeMethodAccessorImpl.invoke(NativeMethodAccessorImpl.java:39)
     [java] 	at sun.reflect.DelegatingMethodAccessorImpl.invoke(DelegatingMethodAccessorImpl.java:25)
     [java] 	at java.lang.reflect.Method.invoke(Method.java:597)
     [java] 	at org.apache.tuscany.sca.implementation.java.invocation.JavaImplementationInvoker.invoke(JavaImplementationInvoker.java:113)
     [java] 	at org.apache.tuscany.sca.binding.sca.provider.SCABindingInvoker.invoke(SCABindingInvoker.java:75)
     [java] 	at org.apache.tuscany.sca.core.invocation.impl.JDKInvocationHandler.invoke(JDKInvocationHandler.java:236)
     [java] 	at org.apache.tuscany.sca.core.invocation.impl.JDKInvocationHandler.invoke(JDKInvocationHandler.java:106)
     [java] 	at $Proxy22.runSample(Unknown Source)
     [java] 	at sample.SampleClientImpl.main(SampleClientImpl.java:39)
     [java] 	... 6 more
Build timed out. Aborting
ERROR: Failed to parse POMs
hudson.remoting.ChannelClosedException: channel is already closed
	at hudson.remoting.Channel.send(Channel.java:412)
	at hudson.remoting.ProxyOutputStream.write(ProxyOutputStream.java:112)
	at hudson.remoting.ProxyOutputStream.write(ProxyOutputStream.java:100)
	at hudson.remoting.RemoteOutputStream.write(RemoteOutputStream.java:110)
	at java.io.BufferedOutputStream.flushBuffer(BufferedOutputStream.java:65)
	at java.io.BufferedOutputStream.flush(BufferedOutputStream.java:123)
	at java.io.BufferedOutputStream.flush(BufferedOutputStream.java:124)
	at java.io.ObjectOutputStream$BlockDataOutputStream.flush(ObjectOutputStream.java:1784)
	at java.io.ObjectOutputStream.flush(ObjectOutputStream.java:691)
	at hudson.remoting.Channel.send(Channel.java:418)
	at hudson.remoting.Request.call(Request.java:149)
	at hudson.remoting.Channel.call(Channel.java:551)
	at hudson.maven.ProcessCache$MavenProcess.call(ProcessCache.java:156)
	at hudson.maven.MavenModuleSetBuild$RunnerImpl.doRun(MavenModuleSetBuild.java:480)
	at hudson.model.AbstractBuild$AbstractRunner.run(AbstractBuild.java:416)
	at hudson.model.Run.run(Run.java:1243)
	at hudson.maven.MavenModuleSetBuild.run(MavenModuleSetBuild.java:304)
	at hudson.model.ResourceController.execute(ResourceController.java:88)
	at hudson.model.Executor.run(Executor.java:122)
FATAL: channel is already closed
hudson.remoting.ChannelClosedException: channel is already closed
	at hudson.remoting.Channel.send(Channel.java:412)
	at hudson.remoting.Request.call(Request.java:105)
	at hudson.remoting.Channel.call(Channel.java:551)
	at hudson.Launcher$RemoteLauncher.kill(Launcher.java:735)
	at hudson.model.AbstractBuild$AbstractRunner.run(AbstractBuild.java:421)
	at hudson.model.Run.run(Run.java:1243)
	at hudson.maven.MavenModuleSetBuild.run(MavenModuleSetBuild.java:304)
	at hudson.model.ResourceController.execute(ResourceController.java:88)
	at hudson.model.Executor.run(Executor.java:122)


Mime
View raw message