tuscany-commits mailing list archives

Site index · List index
Message view « Date » · « Thread »
Top « Date » · « Thread »
From Apache Hudson Server <hud...@hudson.zones.apache.org>
Subject Build failed in Hudson: Tuscany-2x #675
Date Wed, 12 May 2010 16:27:24 GMT
See <http://hudson.zones.apache.org/hudson/job/Tuscany-2x/675/changes>

Changes:

[lresende] Adding generated eTag to RPC style invocations

[lresende] Minor formatting...

[lresende] Removing system.out.println()

[lresende] Adding RPC Operation Selector to binding.rest

[slaws] TUSCANY-3553 - add the SCA spec schema to the system contribution so that users can
use SCA schema in property types. I don't know why people would want to do that but this capability
seems to be the intention of the spec. This slows down the loading of any contributions that
use these types, as the schema are loaded, but has little affect if you don't. I'm still looking
at whether the local scheme optimization I added is effective but decided to check in as this
fault is stopping the otests from running properly currently.

[lresende] Considering request encoding when processing body

[antelder] Add a custom manifest and bundle activator so the base jar can be used in osgi

[antelder] Add the rmi binding and all the osgi modules to include all modules needed to run
the dosig samples

------------------------------------------
[...truncated 20362 lines...]
     [java] 
     [java] 
     [java] Members [1] {
     [java] 	Member [192.87.106.251:14820] this 
     [java] }
     [java] 
     [java] May 12, 2010 4:23:48 PM org.apache.tuscany.sca.node.impl.NodeFactoryImpl loadContributions
     [java] INFO: Loading contribution: <http://hudson.zones.apache.org/hudson/job/Tuscany-2x/ws/sca-2x/distribution/all/target/apache-tuscany-sca-all-2.0-SNAPSHOT.dir/tuscany-sca-2.0-SNAPSHOT/samples/calculator-rmi-service/target/sample-calculator-rmi-service.jar>
     [java] May 12, 2010 4:23:52 PM org.apache.tuscany.sca.host.rmi.DefaultRMIHost registerService
     [java] INFO: RMI service registered: rmi://localhost:8099/CalculatorRMIService
     [java] May 12, 2010 4:23:52 PM org.apache.tuscany.sca.endpoint.hazelcast.HazelcastEndpointRegistry
addEndpoint
     [java] INFO: Add endpoint - (@8461840)Endpoint:  URI = CalculatorServiceComponent#service-binding(CalculatorService/CalculatorService)
     [java] May 12, 2010 4:23:52 PM org.apache.tuscany.sca.endpoint.hazelcast.HazelcastEndpointRegistry
addEndpoint
     [java] INFO: Add endpoint - (@22066266)Endpoint:  URI = AddServiceComponent#service-binding(AddServiceImpl/AddServiceImpl)
     [java] May 12, 2010 4:23:52 PM org.apache.tuscany.sca.endpoint.hazelcast.HazelcastEndpointRegistry
addEndpoint
     [java] INFO: Add endpoint - (@14310336)Endpoint:  URI = SubtractServiceComponent#service-binding(SubtractServiceImpl/SubtractServiceImpl)
     [java] May 12, 2010 4:23:52 PM org.apache.tuscany.sca.endpoint.hazelcast.HazelcastEndpointRegistry
addEndpoint
     [java] INFO: Add endpoint - (@19364400)Endpoint:  URI = MultiplyServiceComponent#service-binding(MultiplyServiceImpl/MultiplyServiceImpl)
     [java] May 12, 2010 4:23:52 PM org.apache.tuscany.sca.endpoint.hazelcast.HazelcastEndpointRegistry
addEndpoint
     [java] INFO: Add endpoint - (@22198005)Endpoint:  URI = DivideServiceComponent#service-binding(DivideServiceImpl/DivideServiceImpl)
     [java] Hit enter to stop node...

init:
    [mkdir] Created dir: <http://hudson.zones.apache.org/hudson/job/Tuscany-2x/ws/sca-2x/distribution/all/target/apache-tuscany-sca-all-2.0-SNAPSHOT.dir/tuscany-sca-2.0-SNAPSHOT/samples/calculator-rmi-reference/target/classes>

compile:
    [javac] Compiling 7 source files to <http://hudson.zones.apache.org/hudson/job/Tuscany-2x/ws/sca-2x/distribution/all/target/apache-tuscany-sca-all-2.0-SNAPSHOT.dir/tuscany-sca-2.0-SNAPSHOT/samples/calculator-rmi-reference/target/classes>
     [copy] Copying 1 file to <http://hudson.zones.apache.org/hudson/job/Tuscany-2x/ws/sca-2x/distribution/all/target/apache-tuscany-sca-all-2.0-SNAPSHOT.dir/tuscany-sca-2.0-SNAPSHOT/samples/calculator-rmi-reference/target/classes>
      [jar] Building jar: <http://hudson.zones.apache.org/hudson/job/Tuscany-2x/ws/sca-2x/distribution/all/target/apache-tuscany-sca-all-2.0-SNAPSHOT.dir/tuscany-sca-2.0-SNAPSHOT/samples/calculator-rmi-reference/target/sample-calculator-rmi-reference.jar>

run:
     [java] May 12, 2010 4:24:05 PM org.apache.tuscany.sca.node.impl.NodeImpl start
     [java] INFO: Starting node: http://tuscany.apache.org/sca/1.1/nodes/default0 domain:
default
     [java] SLF4J: Class path contains multiple SLF4J bindings.
     [java] SLF4J: Found binding in [jar:<http://hudson.zones.apache.org/hudson/job/Tuscany-2x/ws/sca-2x/distribution/all/target/apache-tuscany-sca-all-2.0-SNAPSHOT.dir/tuscany-sca-2.0-SNAPSHOT/modules/slf4j-jdk14-1.5.8.jar!/org/slf4j/impl/StaticLoggerBinder.class]>
     [java] SLF4J: Found binding in [jar:<http://hudson.zones.apache.org/hudson/job/Tuscany-2x/ws/sca-2x/distribution/all/target/apache-tuscany-sca-all-2.0-SNAPSHOT.dir/tuscany-sca-2.0-SNAPSHOT/modules/slf4j-simple-1.5.8.jar!/org/slf4j/impl/StaticLoggerBinder.class]>
     [java] SLF4J: See http://www.slf4j.org/codes.html#multiple_bindings for an explanation.
     [java] May 12, 2010 4:24:05 PM org.apache.tuscany.sca.node.impl.NodeFactoryImpl loadContributions
     [java] INFO: Loading contribution: <http://hudson.zones.apache.org/hudson/job/Tuscany-2x/ws/sca-2x/distribution/all/target/apache-tuscany-sca-all-2.0-SNAPSHOT.dir/tuscany-sca-2.0-SNAPSHOT/samples/calculator-rmi-reference/target/sample-calculator-rmi-reference.jar>
     [java] May 12, 2010 4:24:08 PM org.apache.tuscany.sca.core.assembly.impl.EndpointRegistryImpl
addEndpoint
     [java] INFO: Add endpoint - (@19426064)Endpoint:  URI = CalculatorServiceComponent#service-binding(CalculatorService/CalculatorService)
     [java] 3 + 2=5.0
     [java] 3 - 2=1.0
     [java] 3 * 2=6.0
     [java] 3 / 2=1.5
     [java] May 12, 2010 4:24:08 PM org.apache.tuscany.sca.node.impl.NodeImpl stop
     [java] INFO: Stopping node: http://tuscany.apache.org/sca/1.1/nodes/default0
[INFO] Executed tasks
[INFO] [install:install {execution: default-install}]
[INFO] Installing <http://hudson.zones.apache.org/hudson/job/Tuscany-2x/ws/sca-2x/itest/distribution/calculator-rmi/target/itest-distribution-calculator-rmi-2.0-SNAPSHOT.jar>
to /export/home/hudson/.m2/repository/org/apache/tuscany/sca/itest-distribution-calculator-rmi/2.0-SNAPSHOT/itest-distribution-calculator-rmi-2.0-SNAPSHOT.jar
[HUDSON] Archiving <http://hudson.zones.apache.org/hudson/job/Tuscany-2x/ws/sca-2x/itest/distribution/calculator-rmi/pom.xml>
to /export/home/hudson/hudson/jobs/Tuscany-2x/modules/org.apache.tuscany.sca$itest-distribution-calculator-rmi/builds/2010-05-12_09-49-43/archive/org.apache.tuscany.sca/itest-distribution-calculator-rmi/2.0-SNAPSHOT/pom.xml
[HUDSON] Archiving <http://hudson.zones.apache.org/hudson/job/Tuscany-2x/ws/sca-2x/itest/distribution/calculator-rmi/target/itest-distribution-calculator-rmi-2.0-SNAPSHOT.jar>
to /export/home/hudson/hudson/jobs/Tuscany-2x/modules/org.apache.tuscany.sca$itest-distribution-calculator-rmi/builds/2010-05-12_09-49-43/archive/org.apache.tuscany.sca/itest-distribution-calculator-rmi/2.0-SNAPSHOT/itest-distribution-calculator-rmi-2.0-SNAPSHOT.jar
[INFO] ------------------------------------------------------------------------
[INFO] Building Apache Tuscany SCA iTest Distribution calculator-equinox
[INFO]    task-segment: [clean, install]
[INFO] ------------------------------------------------------------------------
[INFO] [clean:clean {execution: default-clean}]
[INFO] [enforcer:enforce {execution: enforce-plugin-versions}]
[INFO] [resources:resources {execution: default-resources}]
[INFO] Using 'UTF-8' encoding to copy filtered resources.
[INFO] skip non existing resourceDirectory <http://hudson.zones.apache.org/hudson/job/Tuscany-2x/ws/sca-2x/itest/distribution/calculator-equinox/src/main/resources>
[INFO] Copying 0 resource
[INFO] [compiler:compile {execution: default-compile}]
[INFO] No sources to compile
[INFO] [resources:testResources {execution: default-testResources}]
[INFO] Using 'UTF-8' encoding to copy filtered resources.
[INFO] skip non existing resourceDirectory <http://hudson.zones.apache.org/hudson/job/Tuscany-2x/ws/sca-2x/itest/distribution/calculator-equinox/src/test/resources>
[INFO] [compiler:testCompile {execution: default-testCompile}]
[INFO] Not compiling test sources
[INFO] [surefire:test {execution: default-test}]
[INFO] Tests are skipped.
[INFO] [jar:jar {execution: default-jar}]
[INFO] Building jar: <http://hudson.zones.apache.org/hudson/job/Tuscany-2x/ws/sca-2x/itest/distribution/calculator-equinox/target/itest-distribution-calculator-equinox-2.0-SNAPSHOT.jar>
[INFO] [source:jar-no-fork {execution: attach-sources}]
[INFO] No sources in project. Archive not created.
[INFO] [antrun:run {execution: run-samples}]
[INFO] Executing tasks

run:
     [echo] /export/home/hudson/tools/java/jdk1.6.0_06/jre
     [echo] ../..

init:
    [mkdir] Created dir: <http://hudson.zones.apache.org/hudson/job/Tuscany-2x/ws/sca-2x/distribution/all/target/apache-tuscany-sca-all-2.0-SNAPSHOT.dir/tuscany-sca-2.0-SNAPSHOT/samples/calculator-equinox/target/classes>

compile:
    [javac] Compiling 11 source files to <http://hudson.zones.apache.org/hudson/job/Tuscany-2x/ws/sca-2x/distribution/all/target/apache-tuscany-sca-all-2.0-SNAPSHOT.dir/tuscany-sca-2.0-SNAPSHOT/samples/calculator-equinox/target/classes>
May 12, 2010 4:24:34 PM java.util.jar.Attributes read
WARNING: Duplicate name in Manifest: Manifest-Version.
Ensure that the manifest does not have duplicate entries, and
that blank lines separate individual sections in both your
manifest and in the META-INF/MANIFEST.MF entry in the jar file.
     [copy] Copying 1 file to <http://hudson.zones.apache.org/hudson/job/Tuscany-2x/ws/sca-2x/distribution/all/target/apache-tuscany-sca-all-2.0-SNAPSHOT.dir/tuscany-sca-2.0-SNAPSHOT/samples/calculator-equinox/target/classes>
      [jar] Building jar: <http://hudson.zones.apache.org/hudson/job/Tuscany-2x/ws/sca-2x/distribution/all/target/apache-tuscany-sca-all-2.0-SNAPSHOT.dir/tuscany-sca-2.0-SNAPSHOT/samples/calculator-equinox/target/sample-calculator-equinox.jar>

run-equinox:
     [java] May 12, 2010 4:24:36 PM org.apache.tuscany.sca.node.equinox.launcher.NodeLauncher
main
     [java] INFO: SCA contribution: ./target/sample-calculator-equinox.jar
     [java] May 12, 2010 4:24:36 PM org.apache.tuscany.sca.node.equinox.launcher.NodeLauncher
main
     [java] INFO: SCA composite: Calculator.composite
     [java] May 12, 2010 4:24:38 PM org.apache.tuscany.sca.node.equinox.launcher.EquinoxHost
start
     [java] INFO: Checking for manfiests customized by Tuscany in node-launcher-equinox/resources
     [java] May 12, 2010 4:24:43 PM org.apache.tuscany.sca.node.equinox.launcher.NodeLauncher
main
     [java] INFO: Apache Tuscany SCA Node is starting...
     [java] May 12, 2010 4:24:43 PM org.apache.tuscany.sca.node.impl.NodeImpl start
     [java] INFO: Starting node: http://tuscany.apache.org/sca/1.1/nodes/default0 domain:
default
     [java] SLF4J: Class path contains multiple SLF4J bindings.
     [java] SLF4J: Found binding in [bundleresource://122.fwk2780950:1/org/slf4j/impl/StaticLoggerBinder.class]
     [java] SLF4J: Found binding in [bundleresource://122.fwk2780950:2/org/slf4j/impl/StaticLoggerBinder.class]
     [java] SLF4J: See http://www.slf4j.org/codes.html#multiple_bindings for an explanation.
     [java] May 12, 2010 4:24:44 PM org.apache.tuscany.sca.node.impl.NodeFactoryImpl loadContributions
     [java] INFO: Loading contribution: <http://hudson.zones.apache.org/hudson/job/Tuscany-2x/ws/sca-2x/distribution/all/target/apache-tuscany-sca-all-2.0-SNAPSHOT.dir/tuscany-sca-2.0-SNAPSHOT/samples/calculator-equinox/./target/sample-calculator-equinox.jar>
     [java] May 12, 2010 4:24:48 PM org.apache.tuscany.sca.extensibility.equinox.EquinoxServiceDiscoverer
getServiceDeclarations
     [java] WARNING: Unresolved resource META-INF/services/org.apache.tuscany.sca.provider.ImplementationProviderFactory
found in 118 org.apache.tuscany.sca.implementation.bpel.runtime INSTALLED
     [java] May 12, 2010 4:24:48 PM org.apache.tuscany.sca.extensibility.equinox.EquinoxServiceDiscoverer
getServiceDeclarations
     [java] SEVERE: The bundle could not be resolved. Reason: Missing Constraint: Import-Package:
org.apache.ode.bpel.compiler; version="1.3.2"
     [java] org.osgi.framework.BundleException: The bundle could not be resolved. Reason:
Missing Constraint: Import-Package: org.apache.ode.bpel.compiler; version="1.3.2"
     [java] 	at org.eclipse.osgi.framework.internal.core.AbstractBundle.getResolverError(AbstractBundle.java:1313)
     [java] 	at org.eclipse.osgi.framework.internal.core.AbstractBundle.getResolutionFailureException(AbstractBundle.java:1297)
     [java] 	at org.eclipse.osgi.framework.internal.core.BundleHost.startWorker(BundleHost.java:309)
     [java] 	at org.eclipse.osgi.framework.internal.core.AbstractBundle.start(AbstractBundle.java:280)
     [java] 	at org.eclipse.osgi.framework.internal.core.AbstractBundle.start(AbstractBundle.java:272)
     [java] 	at org.apache.tuscany.sca.extensibility.equinox.EquinoxServiceDiscoverer.getServiceDeclarations(EquinoxServiceDiscoverer.java:283)
     [java] 	at org.apache.tuscany.sca.extensibility.ServiceDiscovery.getServiceDeclarations(ServiceDiscovery.java:106)
     [java] 	at org.apache.tuscany.sca.provider.DefaultProviderFactoryExtensionPoint.loadProviderFactories(DefaultProviderFactoryExtensionPoint.java:146)
     [java] 	at org.apache.tuscany.sca.provider.DefaultProviderFactoryExtensionPoint.loadProviderFactories(DefaultProviderFactoryExtensionPoint.java:126)
     [java] 	at org.apache.tuscany.sca.provider.DefaultProviderFactoryExtensionPoint.getProviderFactory(DefaultProviderFactoryExtensionPoint.java:89)
     [java] 	at org.apache.tuscany.sca.core.assembly.impl.CompositeActivatorImpl.addImplementationProvider(CompositeActivatorImpl.java:170)
     [java] 	at org.apache.tuscany.sca.core.assembly.impl.CompositeActivatorImpl.activateComponent(CompositeActivatorImpl.java:120)
     [java] 	at org.apache.tuscany.sca.core.assembly.impl.CompositeActivatorImpl.activate(CompositeActivatorImpl.java:87)
     [java] 	at org.apache.tuscany.sca.node.impl.NodeImpl.start(NodeImpl.java:144)
     [java] 	at sun.reflect.NativeMethodAccessorImpl.invoke0(Native Method)
     [java] 	at sun.reflect.NativeMethodAccessorImpl.invoke(NativeMethodAccessorImpl.java:39)
     [java] 	at sun.reflect.DelegatingMethodAccessorImpl.invoke(DelegatingMethodAccessorImpl.java:25)
     [java] 	at java.lang.reflect.Method.invoke(Method.java:597)
     [java] 	at org.apache.tuscany.sca.node.equinox.launcher.NodeLauncher.main(NodeLauncher.java:225)
     [java] 	at org.apache.tuscany.sca.node.equinox.launcher.NodeMain.main(NodeMain.java:59)
     [java] May 12, 2010 4:24:48 PM org.apache.tuscany.sca.node.equinox.launcher.NodeLauncher
main
     [java] SEVERE: SCA Node could not be started
     [java] java.lang.reflect.InvocationTargetException
     [java] 	at sun.reflect.NativeMethodAccessorImpl.invoke0(Native Method)
     [java] 	at sun.reflect.NativeMethodAccessorImpl.invoke(NativeMethodAccessorImpl.java:39)
     [java] 	at sun.reflect.DelegatingMethodAccessorImpl.invoke(DelegatingMethodAccessorImpl.java:25)
     [java] 	at java.lang.reflect.Method.invoke(Method.java:597)
     [java] 	at org.apache.tuscany.sca.node.equinox.launcher.NodeLauncher.main(NodeLauncher.java:225)
     [java] 	at org.apache.tuscany.sca.node.equinox.launcher.NodeMain.main(NodeMain.java:59)
     [java] Caused by: java.lang.IllegalStateException: org.apache.tuscany.sca.runtime.ActivationException:
org.apache.tuscany.sca.runtime.ActivationException: java.lang.IllegalStateException: java.lang.ClassNotFoundException:
org.apache.tuscany.sca.binding.rest.operationselector.rpc.RPCOperationSelector
     [java] 	at org.apache.tuscany.sca.node.impl.NodeImpl.start(NodeImpl.java:173)
     [java] 	... 6 more
     [java] Caused by: org.apache.tuscany.sca.runtime.ActivationException: org.apache.tuscany.sca.runtime.ActivationException:
java.lang.IllegalStateException: java.lang.ClassNotFoundException: org.apache.tuscany.sca.binding.rest.operationselector.rpc.RPCOperationSelector
     [java] 	at org.apache.tuscany.sca.core.assembly.impl.CompositeActivatorImpl.activate(CompositeActivatorImpl.java:90)
     [java] 	at org.apache.tuscany.sca.node.impl.NodeImpl.start(NodeImpl.java:144)
     [java] 	... 6 more
     [java] Caused by: org.apache.tuscany.sca.runtime.ActivationException: java.lang.IllegalStateException:
java.lang.ClassNotFoundException: org.apache.tuscany.sca.binding.rest.operationselector.rpc.RPCOperationSelector
     [java] 	at org.apache.tuscany.sca.core.assembly.impl.CompositeActivatorImpl.activateComponent(CompositeActivatorImpl.java:135)
     [java] 	at org.apache.tuscany.sca.core.assembly.impl.CompositeActivatorImpl.activate(CompositeActivatorImpl.java:87)
     [java] 	... 7 more
     [java] Caused by: java.lang.IllegalStateException: java.lang.ClassNotFoundException:
org.apache.tuscany.sca.binding.rest.operationselector.rpc.RPCOperationSelector
     [java] 	at org.apache.tuscany.sca.provider.DefaultProviderFactoryExtensionPoint$LazyOperationSelectorProviderFactory.getModelType(DefaultProviderFactoryExtensionPoint.java:493)
     [java] 	at org.apache.tuscany.sca.provider.DefaultProviderFactoryExtensionPoint.addProviderFactory(DefaultProviderFactoryExtensionPoint.java:68)
     [java] 	at org.apache.tuscany.sca.provider.DefaultProviderFactoryExtensionPoint.loadProviderFactories(DefaultProviderFactoryExtensionPoint.java:206)
     [java] 	at org.apache.tuscany.sca.provider.DefaultProviderFactoryExtensionPoint.loadProviderFactories(DefaultProviderFactoryExtensionPoint.java:129)
     [java] 	at org.apache.tuscany.sca.provider.DefaultProviderFactoryExtensionPoint.getProviderFactory(DefaultProviderFactoryExtensionPoint.java:89)
     [java] 	at org.apache.tuscany.sca.core.assembly.impl.CompositeActivatorImpl.addImplementationProvider(CompositeActivatorImpl.java:170)
     [java] 	at org.apache.tuscany.sca.core.assembly.impl.CompositeActivatorImpl.activateComponent(CompositeActivatorImpl.java:120)
     [java] 	... 8 more
     [java] Caused by: java.lang.ClassNotFoundException: org.apache.tuscany.sca.binding.rest.operationselector.rpc.RPCOperationSelector
     [java] 	at org.eclipse.osgi.internal.loader.BundleLoader.findClassInternal(BundleLoader.java:489)
     [java] 	at org.eclipse.osgi.internal.loader.BundleLoader.findClass(BundleLoader.java:405)
     [java] 	at org.eclipse.osgi.internal.loader.BundleLoader.findClass(BundleLoader.java:393)
     [java] 	at org.eclipse.osgi.internal.baseadaptor.DefaultClassLoader.loadClass(DefaultClassLoader.java:105)
     [java] 	at java.lang.ClassLoader.loadClass(ClassLoader.java:251)
     [java] 	at org.eclipse.osgi.internal.loader.BundleLoader.loadClass(BundleLoader.java:321)
     [java] 	at org.eclipse.osgi.framework.internal.core.BundleHost.loadClass(BundleHost.java:231)
     [java] 	at org.eclipse.osgi.framework.internal.core.AbstractBundle.loadClass(AbstractBundle.java:1193)
     [java] 	at org.apache.tuscany.sca.extensibility.equinox.EquinoxServiceDiscoverer$ServiceDeclarationImpl.loadClass(EquinoxServiceDiscoverer.java:133)
     [java] 	at org.apache.tuscany.sca.provider.DefaultProviderFactoryExtensionPoint$LazyOperationSelectorProviderFactory.getModelType(DefaultProviderFactoryExtensionPoint.java:491)
     [java] 	... 14 more
     [java] May 12, 2010 4:24:48 PM org.apache.tuscany.sca.node.impl.NodeImpl stop
     [java] INFO: Stopping node: http://tuscany.apache.org/sca/1.1/nodes/default0
     [java] May 12, 2010 4:24:48 PM org.apache.tuscany.sca.node.equinox.launcher.NodeLauncher
destroyNode
     [java] INFO: SCA Node is now stopped.
     [java] Exception in thread "main" java.lang.reflect.InvocationTargetException
     [java] 	at sun.reflect.NativeMethodAccessorImpl.invoke0(Native Method)
     [java] 	at sun.reflect.NativeMethodAccessorImpl.invoke(NativeMethodAccessorImpl.java:39)
     [java] 	at sun.reflect.DelegatingMethodAccessorImpl.invoke(DelegatingMethodAccessorImpl.java:25)
     [java] 	at java.lang.reflect.Method.invoke(Method.java:597)
     [java] 	at org.apache.tuscany.sca.node.equinox.launcher.NodeLauncher.main(NodeLauncher.java:225)
     [java] 	at org.apache.tuscany.sca.node.equinox.launcher.NodeMain.main(NodeMain.java:59)
     [java] Caused by: java.lang.IllegalStateException: org.apache.tuscany.sca.runtime.ActivationException:
org.apache.tuscany.sca.runtime.ActivationException: java.lang.IllegalStateException: java.lang.ClassNotFoundException:
org.apache.tuscany.sca.binding.rest.operationselector.rpc.RPCOperationSelector
     [java] 	at org.apache.tuscany.sca.node.impl.NodeImpl.start(NodeImpl.java:173)
     [java] 	... 6 more
     [java] Caused by: org.apache.tuscany.sca.runtime.ActivationException: org.apache.tuscany.sca.runtime.ActivationException:
java.lang.IllegalStateException: java.lang.ClassNotFoundException: org.apache.tuscany.sca.binding.rest.operationselector.rpc.RPCOperationSelector
     [java] 	at org.apache.tuscany.sca.core.assembly.impl.CompositeActivatorImpl.activate(CompositeActivatorImpl.java:90)
     [java] 	at org.apache.tuscany.sca.node.impl.NodeImpl.start(NodeImpl.java:144)
     [java] 	... 6 more
     [java] Caused by: org.apache.tuscany.sca.runtime.ActivationException: java.lang.IllegalStateException:
java.lang.ClassNotFoundException: org.apache.tuscany.sca.binding.rest.operationselector.rpc.RPCOperationSelector
     [java] 	at org.apache.tuscany.sca.core.assembly.impl.CompositeActivatorImpl.activateComponent(CompositeActivatorImpl.java:135)
     [java] 	at org.apache.tuscany.sca.core.assembly.impl.CompositeActivatorImpl.activate(CompositeActivatorImpl.java:87)
     [java] 	... 7 more
     [java] Caused by: java.lang.IllegalStateException: java.lang.ClassNotFoundException:
org.apache.tuscany.sca.binding.rest.operationselector.rpc.RPCOperationSelector
     [java] 	at org.apache.tuscany.sca.provider.DefaultProviderFactoryExtensionPoint$LazyOperationSelectorProviderFactory.getModelType(DefaultProviderFactoryExtensionPoint.java:493)
     [java] 	at org.apache.tuscany.sca.provider.DefaultProviderFactoryExtensionPoint.addProviderFactory(DefaultProviderFactoryExtensionPoint.java:68)
     [java] 	at org.apache.tuscany.sca.provider.DefaultProviderFactoryExtensionPoint.loadProviderFactories(DefaultProviderFactoryExtensionPoint.java:206)
     [java] 	at org.apache.tuscany.sca.provider.DefaultProviderFactoryExtensionPoint.loadProviderFactories(DefaultProviderFactoryExtensionPoint.java:129)
     [java] 	at org.apache.tuscany.sca.provider.DefaultProviderFactoryExtensionPoint.getProviderFactory(DefaultProviderFactoryExtensionPoint.java:89)
     [java] 	at org.apache.tuscany.sca.core.assembly.impl.CompositeActivatorImpl.addImplementationProvider(CompositeActivatorImpl.java:170)
     [java] 	at org.apache.tuscany.sca.core.assembly.impl.CompositeActivatorImpl.activateComponent(CompositeActivatorImpl.java:120)
     [java] 	... 8 more
     [java] Caused by: java.lang.ClassNotFoundException: org.apache.tuscany.sca.binding.rest.operationselector.rpc.RPCOperationSelector
     [java] 	at org.eclipse.osgi.internal.loader.BundleLoader.findClassInternal(BundleLoader.java:489)
     [java] 	at org.eclipse.osgi.internal.loader.BundleLoader.findClass(BundleLoader.java:405)
     [java] 	at org.eclipse.osgi.internal.loader.BundleLoader.findClass(BundleLoader.java:393)
     [java] 	at org.eclipse.osgi.internal.baseadaptor.DefaultClassLoader.loadClass(DefaultClassLoader.java:105)
     [java] 	at java.lang.ClassLoader.loadClass(ClassLoader.java:251)
     [java] 	at org.eclipse.osgi.internal.loader.BundleLoader.loadClass(BundleLoader.java:321)
     [java] 	at org.eclipse.osgi.framework.internal.core.BundleHost.loadClass(BundleHost.java:231)
     [java] 	at org.eclipse.osgi.framework.internal.core.AbstractBundle.loadClass(AbstractBundle.java:1193)
     [java] 	at org.apache.tuscany.sca.extensibility.equinox.EquinoxServiceDiscoverer$ServiceDeclarationImpl.loadClass(EquinoxServiceDiscoverer.java:133)
     [java] 	at org.apache.tuscany.sca.provider.DefaultProviderFactoryExtensionPoint$LazyOperationSelectorProviderFactory.getModelType(DefaultProviderFactoryExtensionPoint.java:491)
     [java] 	... 14 more
[HUDSON] Archiving <http://hudson.zones.apache.org/hudson/job/Tuscany-2x/ws/sca-2x/itest/distribution/calculator-equinox/pom.xml>
to /export/home/hudson/hudson/jobs/Tuscany-2x/modules/org.apache.tuscany.sca$itest-distribution-calculator-equinox/builds/2010-05-12_09-49-43/archive/org.apache.tuscany.sca/itest-distribution-calculator-equinox/2.0-SNAPSHOT/pom.xml
[HUDSON] Archiving <http://hudson.zones.apache.org/hudson/job/Tuscany-2x/ws/sca-2x/itest/distribution/calculator-equinox/target/itest-distribution-calculator-equinox-2.0-SNAPSHOT.jar>
to /export/home/hudson/hudson/jobs/Tuscany-2x/modules/org.apache.tuscany.sca$itest-distribution-calculator-equinox/builds/2010-05-12_09-49-43/archive/org.apache.tuscany.sca/itest-distribution-calculator-equinox/2.0-SNAPSHOT/itest-distribution-calculator-equinox-2.0-SNAPSHOT.jar
[INFO] ------------------------------------------------------------------------
[ERROR] BUILD ERROR
[INFO] ------------------------------------------------------------------------
[INFO] An Ant BuildException has occured: The following error occurred while executing this
line:
<http://hudson.zones.apache.org/hudson/job/Tuscany-2x/ws/sca-2x/itest/distribution/calculator-equinox/build.xml>:35:
The following error occurred while executing this line:
<http://hudson.zones.apache.org/hudson/job/Tuscany-2x/ws/sca-2x/distribution/all/target/apache-tuscany-sca-all-2.0-SNAPSHOT.dir/tuscany-sca-2.0-SNAPSHOT/samples/calculator-equinox/build.xml>:64:
Java returned: 1

[INFO] ------------------------------------------------------------------------
[INFO] For more information, run Maven with the -e switch
[INFO] ------------------------------------------------------------------------
[INFO] Total time: 393 minutes 38 seconds
[INFO] Finished at: Wed May 12 16:25:02 GMT+00:00 2010
[INFO] Final Memory: 170M/742M
[INFO] ------------------------------------------------------------------------
Waiting for Hudson to finish collecting data
Sending e-mails to: commits@tuscany.apache.org
channel stopped
2010-05-12 16:25:42.273::INFO:  Shutdown hook executing
2010-05-12 16:25:42.273::INFO:  Shutdown hook complete
2010-05-12 16:25:43.280::INFO:  Shutdown hook complete
2010-05-12 16:25:44.290::INFO:  Shutdown hook complete
2010-05-12 16:25:45.300::INFO:  Shutdown hook complete
2010-05-12 16:25:46.310::INFO:  Shutdown hook complete
2010-05-12 16:25:47.320::INFO:  Shutdown hook complete
2010-05-12 16:25:48.330::INFO:  Shutdown hook complete
2010-05-12 16:25:49.340::INFO:  Shutdown hook complete


Mime
View raw message