tuscany-commits mailing list archives

Site index · List index
Message view « Date » · « Thread »
Top « Date » · « Thread »
From Apache Hudson Server <hud...@hudson.zones.apache.org>
Subject Build failed in Hudson: Tuscany-2x #685
Date Wed, 19 May 2010 02:13:36 GMT
See <http://hudson.zones.apache.org/hudson/job/Tuscany-2x/685/changes>

Changes:

[rfeng] Add scdl to build

[rfeng] Merge branch 'jaxrs' into trunk

[rfeng] Add jms-callback to the build

------------------------------------------
Started by user lresende
Building remotely on minerva.apache.org (Ubuntu)
Updating https://svn.apache.org/repos/asf/tuscany/sca-java-2.x/trunk
U         distribution/all/src/main/release/bin/LICENSE
U         distribution/all/src/main/components/bin-samples.xml
U         distribution/all/pom.xml
U         itest/scdl/src/test/java/org/apache/tuscany/sca/itest/scdl/ContributionTestCase.java
U         itest/pom.xml
U         itest/jms/pom.xml
U         itest/callback-basic-ws/src/main/resources/CallBackBasicTest.composite
U         modules/databinding/src/test/java/org/apache/tuscany/sca/databinding/xml/PushTransformationTestCase.java
U         modules/databinding/src/test/java/org/apache/tuscany/sca/databinding/xml/DataPipeTestCase.java
U         modules/databinding/src/test/java/org/apache/tuscany/sca/databinding/xml/Node2StringTestCase.java
U         modules/databinding/src/test/java/org/apache/tuscany/sca/databinding/xml/TraxTransformerTestCase.java
U         modules/databinding/src/test/java/org/apache/tuscany/sca/databinding/impl/MediatorImplTestCase.java
AU        modules/databinding/src/main/java/org/apache/tuscany/sca/databinding/DataBindingContext.java
U         modules/databinding/src/main/java/org/apache/tuscany/sca/databinding/xml/Node2Writer.java
U         modules/databinding/src/main/java/org/apache/tuscany/sca/databinding/xml/InputSource2Node.java
U         modules/databinding/src/main/java/org/apache/tuscany/sca/databinding/xml/Reader2Node.java
U         modules/databinding/src/main/java/org/apache/tuscany/sca/databinding/xml/Source2StringTransformer.java
U         modules/databinding/src/main/java/org/apache/tuscany/sca/databinding/xml/InputStream2Node.java
U         modules/databinding/src/main/java/org/apache/tuscany/sca/databinding/xml/Node2OutputStream.java
U         modules/databinding/src/main/java/org/apache/tuscany/sca/databinding/xml/Source2ResultTransformer.java
U         modules/databinding/src/main/java/org/apache/tuscany/sca/databinding/xml/Node2String.java
U         modules/builder/src/main/java/org/apache/tuscany/sca/builder/impl/EndpointReferenceBuilderImpl.java
U         modules/databinding-sdo/src/test/java/org/apache/tuscany/sca/databinding/sdo/DataObject2XMLStreamReaderTestCase.java
U         modules/interface-java-jaxrs/META-INF/MANIFEST.MF
U         modules/interface-java-jaxrs/src/test/java/org/apache/tuscany/sca/interfacedef/java/jaxrs/RootResourceClassGeneratorTestCase.java
U         modules/interface-java-jaxrs/src/test/java/org/apache/tuscany/sca/interfacedef/java/jaxrs/ResourceWrapper.java
U         modules/interface-java-jaxrs/src/main/java/org/apache/tuscany/sca/interfacedef/java/jaxrs/RootResourceClassGenerator.java
U         modules/interface-java-jaxrs/src/main/java/org/apache/tuscany/sca/interfacedef/java/jaxrs/JAXRSJavaInterfaceProcessor.java
U         modules/interface-java-jaxrs/pom.xml
U         modules/binding-rest-runtime/META-INF/MANIFEST.MF
A         modules/binding-rest-runtime/src/test/java/services/store/Items.java
U         modules/binding-rest-runtime/src/test/java/services/store/FruitsCatalogImpl.java
U         modules/binding-rest-runtime/src/test/java/services/store/Catalog.java
U         modules/binding-rest-runtime/src/test/java/org/apache/tuscany/sca/binding/rest/wireformat/xml/CustomerServiceTestCase.java
U         modules/binding-rest-runtime/src/test/java/org/apache/tuscany/sca/binding/rest/wireformat/binary/BinaryServiceTestCase.java
U         modules/binding-rest-runtime/src/test/java/org/apache/tuscany/sca/binding/rest/wireformat/json/CatalogServiceTestCase.java
U         modules/binding-rest-runtime/src/test/java/org/apache/tuscany/sca/binding/rest/rpc/EchoServiceTestCase.java
U         modules/binding-rest-runtime/src/main/java/org/apache/tuscany/sca/binding/rest/wireformat/xml/provider/XMLWireFormatServiceProvider.java
U         modules/binding-rest-runtime/src/main/java/org/apache/tuscany/sca/binding/rest/wireformat/json/provider/JSONWireFormatServiceProvider.java
U         modules/binding-rest-runtime/src/main/java/org/apache/tuscany/sca/binding/rest/wireformat/json/provider/JSONWireFormatInterceptor.java
U         modules/binding-rest-runtime/src/main/java/org/apache/tuscany/sca/binding/rest/operationselector/jaxrs/provider/JAXRSOperationSelectorInterceptor.java
AU        modules/binding-rest-runtime/src/main/java/org/apache/tuscany/sca/binding/rest/provider/DataBindingJAXRSReader.java
AU        modules/binding-rest-runtime/src/main/java/org/apache/tuscany/sca/binding/rest/provider/RESTReferenceBindingProvider.java
U         modules/binding-rest-runtime/src/main/java/org/apache/tuscany/sca/binding/rest/provider/RESTServiceBindingProvider.java
AU        modules/binding-rest-runtime/src/main/java/org/apache/tuscany/sca/binding/rest/provider/RESTBindingInvoker.java
AU        modules/binding-rest-runtime/src/main/java/org/apache/tuscany/sca/binding/rest/provider/DataBindingJAXRSProvider.java
AU        modules/binding-rest-runtime/src/main/java/org/apache/tuscany/sca/binding/rest/provider/DataBindingJAXRSWriter.java
AU        modules/binding-rest-runtime/src/main/java/org/apache/tuscany/sca/binding/rest/provider/TuscanyRESTServlet.java
U         modules/binding-rest-runtime/src/main/java/org/apache/tuscany/sca/binding/rest/provider/RESTBindingProviderFactory.java
U         modules/binding-rest-runtime/pom.xml
U         modules/binding-jsonrpc-runtime/src/test/java/org/apache/tuscany/sca/binding/jsonrpc/JSONRPCDataTypeTestCase.java
U         modules/binding-jsonrpc-runtime/pom.xml
U         modules/implementation-jaxrs/META-INF/MANIFEST.MF
U         modules/implementation-jaxrs/src/main/java/org/apache/tuscany/sca/implementation/jaxrs/xml/JAXRSImplementationProcessor.java
U         modules/implementation-jaxrs/src/main/java/org/apache/tuscany/sca/implementation/jaxrs/impl/JAXRSImplementationImpl.java
U         modules/implementation-jaxrs/pom.xml
U         modules/implementation-jaxrs-runtime/META-INF/MANIFEST.MF
U         modules/implementation-jaxrs-runtime/src/test/java/helloworld/jaxrs/test/HelloWorldTestCase.java
U         modules/implementation-jaxrs-runtime/src/main/java/org/apache/tuscany/sca/implementation/jaxrs/provider/JAXRSImplementationProvider.java
U         modules/implementation-jaxrs-runtime/pom.xml
U         modules/wink/pom.xml
U         modules/databinding-json/src/main/java/org/apache/tuscany/sca/databinding/json/jackson/JSON2Object.java
A         modules/databinding-json/src/main/java/org/apache/tuscany/sca/databinding/json/jackson/InputStream2JSON.java
A         modules/databinding-json/src/main/java/org/apache/tuscany/sca/databinding/json/jackson/JSON2OutputStream.java
U         modules/databinding-json/src/main/java/org/apache/tuscany/sca/databinding/json/jackson/JacksonHelper.java
U         modules/databinding-json/src/main/java/org/apache/tuscany/sca/databinding/json/JSONHelper.java
U         modules/databinding-json/src/main/resources/META-INF/services/org.apache.tuscany.sca.databinding.PullTransformer
A         modules/databinding-json/src/main/resources/META-INF/services/org.apache.tuscany.sca.databinding.PushTransformer
U         features/web20/pom.xml
At revision 945996
Parsing POMs
ERROR: Failed to parse POMs
hudson.util.IOException2: remote file operation failed: <http://hudson.zones.apache.org/hudson/job/Tuscany-2x/ws/sca-2x>
at hudson.remoting.Channel@14ee300:minerva.apache.org (Ubuntu)
	at hudson.FilePath.act(FilePath.java:743)
	at hudson.FilePath.act(FilePath.java:729)
	at hudson.maven.MavenModuleSetBuild$RunnerImpl.parsePoms(MavenModuleSetBuild.java:531)
	at hudson.maven.MavenModuleSetBuild$RunnerImpl.doRun(MavenModuleSetBuild.java:391)
	at hudson.model.AbstractBuild$AbstractRunner.run(AbstractBuild.java:416)
	at hudson.model.Run.run(Run.java:1243)
	at hudson.maven.MavenModuleSetBuild.run(MavenModuleSetBuild.java:304)
	at hudson.model.ResourceController.execute(ResourceController.java:88)
	at hudson.model.Executor.run(Executor.java:122)
Caused by: hudson.remoting.ProxyException: hudson.maven.MavenModuleSetBuild$MavenExecutionException:
hudson.maven.MavenEmbedder$1: Parse error reading POM. Reason: unexpected character in markup
  (position: END_TAG seen ...<module>scopes</module>\n                < ...
@86:19)  for project unknown at <http://hudson.zones.apache.org/hudson/job/Tuscany-2x/ws/sca-2x/itest/pom.xml>
	at hudson.maven.MavenModuleSetBuild$PomParser.invoke(MavenModuleSetBuild.java:880)
	at hudson.maven.MavenModuleSetBuild$PomParser.invoke(MavenModuleSetBuild.java:786)
	at hudson.FilePath$FileCallableWrapper.call(FilePath.java:2018)
	at hudson.remoting.UserRequest.perform(UserRequest.java:114)
	at hudson.remoting.UserRequest.perform(UserRequest.java:48)
	at hudson.remoting.Request$2.run(Request.java:270)
	at java.util.concurrent.Executors$RunnableAdapter.call(Executors.java:441)
	at java.util.concurrent.FutureTask$Sync.innerRun(FutureTask.java:303)
	at java.util.concurrent.FutureTask.run(FutureTask.java:138)
	at java.util.concurrent.ThreadPoolExecutor$Worker.runTask(ThreadPoolExecutor.java:886)
	at java.util.concurrent.ThreadPoolExecutor$Worker.run(ThreadPoolExecutor.java:908)
	at java.lang.Thread.run(Thread.java:619)
Caused by: hudson.remoting.ProxyException: hudson.maven.MavenEmbedder$1: Parse error reading
POM. Reason: unexpected character in markup   (position: END_TAG seen ...<module>scopes</module>\n
               < ... @86:19)  for project unknown at <http://hudson.zones.apache.org/hudson/job/Tuscany-2x/ws/sca-2x/itest/pom.xml>
	at hudson.maven.MavenEmbedder.readProject(MavenEmbedder.java:334)
	at hudson.maven.MavenUtil.resolveModules(MavenUtil.java:226)
	at hudson.maven.MavenModuleSetBuild$PomParser.invoke(MavenModuleSetBuild.java:862)
	... 11 more
Caused by: hudson.remoting.ProxyException: org.apache.maven.project.InvalidProjectModelException:
Parse error reading POM. Reason: unexpected character in markup   (position: END_TAG seen
...<module>scopes</module>\n                < ... @86:19)  for project unknown
at <http://hudson.zones.apache.org/hudson/job/Tuscany-2x/ws/sca-2x/itest/pom.xml>
	at org.apache.maven.project.DefaultMavenProjectBuilder.readModel(DefaultMavenProjectBuilder.java:1592)
	at org.apache.maven.project.DefaultMavenProjectBuilder.readModel(DefaultMavenProjectBuilder.java:1553)
	at org.apache.maven.project.DefaultMavenProjectBuilder.buildFromSourceFileInternal(DefaultMavenProjectBuilder.java:504)
	at org.apache.maven.project.DefaultMavenProjectBuilder.build(DefaultMavenProjectBuilder.java:215)
	at hudson.maven.MavenEmbedder.readProject(MavenEmbedder.java:332)
	... 13 more
Caused by: hudson.remoting.ProxyException: org.codehaus.plexus.util.xml.pull.XmlPullParserException:
unexpected character in markup   (position: END_TAG seen ...<module>scopes</module>\n
               < ... @86:19) 
	at org.codehaus.plexus.util.xml.pull.MXParser.nextImpl(MXParser.java:1261)
	at org.codehaus.plexus.util.xml.pull.MXParser.next(MXParser.java:1093)
	at org.codehaus.plexus.util.xml.pull.MXParser.nextTag(MXParser.java:1078)
	at org.apache.maven.model.io.xpp3.MavenXpp3Reader.parseModel(MavenXpp3Reader.java:2256)
	at org.apache.maven.model.io.xpp3.MavenXpp3Reader.read(MavenXpp3Reader.java:4422)
	at org.apache.maven.project.DefaultMavenProjectBuilder.readModel(DefaultMavenProjectBuilder.java:1588)
	... 17 more


Mime
View raw message