tuscany-commits mailing list archives

Site index · List index
Message view « Date » · « Thread »
Top « Date » · « Thread »
From Apache Hudson Server <hud...@hudson.zones.apache.org>
Subject Build failed in Hudson: Tuscany-2x #485
Date Fri, 12 Feb 2010 01:53:37 GMT
See <http://hudson.zones.apache.org/hudson/job/Tuscany-2x/485/changes>

Changes:

[rfeng] Rename configURI to domainRegistryURI

[rfeng] Use the LRUCache from common-java

[rfeng] Add a mapping for domainURI and registryURI

[rfeng] Port databinding-sdo into 2.x based on the patch provided by Malisetti, Ramanjaneyulu.
Thanks for the contribution.
I'll leave it outside the main build for now.

[slaws] remove this now. A previous svn problem on my machine means this was not removed previously
during the rename to binding-ws-runtime-axis2

[slaws] Remove as methods are now in assembly policy helper and constants are on assembly-xml
constants

[slaws] Add missing OSGi dependency

[slaws] hazelcast two nodes test still causing problems so remove it from the build for now

[slaws] Remove file as it's not used

[antelder] Test for multiple local nodes using imports and exports

[antelder] Start of tests for import/export across nodes - a contribution with a reference
using imports

[antelder] Start of tests for import/export across nodes - a service using an import

[antelder] Start of some tests for import/export across nodes

[antelder] TUSCANY-2586: Fix pass-by-value copies as described in the JIRA with the SCA binding
doing the necessary copies. Also update the copy code so that the new copy is in the correct
class loader so that invocations across Nodes in the same JVM work

------------------------------------------
[...truncated 13892 lines...]
[INFO] [enforcer:enforce {execution: enforce-plugin-versions}]
[INFO] [site:attach-descriptor {execution: default-attach-descriptor}]
[INFO] [install:install {execution: default-install}]
[INFO] Installing <http://hudson.zones.apache.org/hudson/job/Tuscany-2x/ws/sca-2x/itest/distribution/pom.xml>
to /export/home/hudson/.m2/repository/org/apache/tuscany/sca/itest-distribution/2.0-SNAPSHOT/itest-distribution-2.0-SNAPSHOT.pom
[HUDSON] Archiving <http://hudson.zones.apache.org/hudson/job/Tuscany-2x/ws/sca-2x/itest/distribution/pom.xml>
to /export/home/hudson/hudson/jobs/Tuscany-2x/modules/org.apache.tuscany.sca$itest-distribution/builds/2010-02-12_00-23-43/archive/org.apache.tuscany.sca/itest-distribution/2.0-SNAPSHOT/pom.xml
[HUDSON] Archiving /export/home/hudson/.m2/repository/org/apache/tuscany/sca/itest-distribution/2.0-SNAPSHOT/itest-distribution-2.0-SNAPSHOT.pom
to /export/home/hudson/hudson/jobs/Tuscany-2x/modules/org.apache.tuscany.sca$itest-distribution/builds/2010-02-12_00-23-43/archive/org.apache.tuscany.sca/itest-distribution/2.0-SNAPSHOT/itest-distribution-2.0-SNAPSHOT.pom
[INFO] ------------------------------------------------------------------------
[INFO] Building Apache Tuscany SCA iTest Distribution Bin Distro Unzip
[INFO]    task-segment: [clean, install]
[INFO] ------------------------------------------------------------------------
[INFO] [clean:clean {execution: default-clean}]
[INFO] Deleting file set: <http://hudson.zones.apache.org/hudson/job/Tuscany-2x/ws/sca-2x/itest/distribution/bin-distro-unzip/target>
(included: [**], excluded: [])
[INFO] [enforcer:enforce {execution: enforce-plugin-versions}]
[INFO] [resources:resources {execution: default-resources}]
[WARNING] Using platform encoding (ISO646-US actually) to copy filtered resources, i.e. build
is platform dependent!
[INFO] skip non existing resourceDirectory <http://hudson.zones.apache.org/hudson/job/Tuscany-2x/ws/sca-2x/itest/distribution/bin-distro-unzip/src/main/resources>
[INFO] Copying 0 resource
[INFO] [compiler:compile {execution: default-compile}]
[INFO] No sources to compile
[INFO] [resources:testResources {execution: default-testResources}]
[WARNING] Using platform encoding (ISO646-US actually) to copy filtered resources, i.e. build
is platform dependent!
[INFO] skip non existing resourceDirectory <http://hudson.zones.apache.org/hudson/job/Tuscany-2x/ws/sca-2x/itest/distribution/bin-distro-unzip/src/test/resources>
[INFO] [compiler:testCompile {execution: default-testCompile}]
[INFO] No sources to compile
[INFO] [surefire:test {execution: default-test}]
[INFO] No tests to run.
[HUDSON] Recording test results
[INFO] [jar:jar {execution: default-jar}]
[INFO] Building jar: <http://hudson.zones.apache.org/hudson/job/Tuscany-2x/ws/sca-2x/itest/distribution/bin-distro-unzip/target/itest-bin-distro-unzip-2.0-SNAPSHOT.jar>
[INFO] [antrun:run {execution: run-samples}]
[INFO] Executing tasks

unzip:
    [unzip] Expanding: <http://hudson.zones.apache.org/hudson/job/Tuscany-2x/ws/sca-2x/distribution/all/target/apache-tuscany-sca-all-2.0-SNAPSHOT.zip>
into <http://hudson.zones.apache.org/hudson/job/Tuscany-2x/ws/sca-2x/distribution/all/target/apache-tuscany-sca-all-2.0-SNAPSHOT.dir>
[INFO] Executed tasks
[INFO] [install:install {execution: default-install}]
[INFO] Installing <http://hudson.zones.apache.org/hudson/job/Tuscany-2x/ws/sca-2x/itest/distribution/bin-distro-unzip/target/itest-bin-distro-unzip-2.0-SNAPSHOT.jar>
to /export/home/hudson/.m2/repository/org/apache/tuscany/sca/itest-bin-distro-unzip/2.0-SNAPSHOT/itest-bin-distro-unzip-2.0-SNAPSHOT.jar
[HUDSON] Archiving <http://hudson.zones.apache.org/hudson/job/Tuscany-2x/ws/sca-2x/itest/distribution/bin-distro-unzip/pom.xml>
to /export/home/hudson/hudson/jobs/Tuscany-2x/modules/org.apache.tuscany.sca$itest-bin-distro-unzip/builds/2010-02-12_00-23-43/archive/org.apache.tuscany.sca/itest-bin-distro-unzip/2.0-SNAPSHOT/pom.xml
[HUDSON] Archiving <http://hudson.zones.apache.org/hudson/job/Tuscany-2x/ws/sca-2x/itest/distribution/bin-distro-unzip/target/itest-bin-distro-unzip-2.0-SNAPSHOT.jar>
to /export/home/hudson/hudson/jobs/Tuscany-2x/modules/org.apache.tuscany.sca$itest-bin-distro-unzip/builds/2010-02-12_00-23-43/archive/org.apache.tuscany.sca/itest-bin-distro-unzip/2.0-SNAPSHOT/itest-bin-distro-unzip-2.0-SNAPSHOT.jar
[INFO] ------------------------------------------------------------------------
[INFO] Building Apache Tuscany SCA iTest Distribution binding-ws-calculator
[INFO]    task-segment: [clean, install]
[INFO] ------------------------------------------------------------------------
[INFO] [clean:clean {execution: default-clean}]
[INFO] Deleting file set: <http://hudson.zones.apache.org/hudson/job/Tuscany-2x/ws/sca-2x/itest/distribution/binding-ws-calculator/target>
(included: [**], excluded: [])
[INFO] snapshot org.apache.tuscany.sca:itest-bin-distro-unzip:2.0-SNAPSHOT: checking for updates
from apache.snapshots
[INFO] [enforcer:enforce {execution: enforce-plugin-versions}]
[INFO] [resources:resources {execution: default-resources}]
[WARNING] Using platform encoding (ISO646-US actually) to copy filtered resources, i.e. build
is platform dependent!
[INFO] skip non existing resourceDirectory <http://hudson.zones.apache.org/hudson/job/Tuscany-2x/ws/sca-2x/itest/distribution/binding-ws-calculator/src/main/resources>
[INFO] Copying 0 resource
[INFO] [compiler:compile {execution: default-compile}]
[INFO] No sources to compile
[INFO] [resources:testResources {execution: default-testResources}]
[WARNING] Using platform encoding (ISO646-US actually) to copy filtered resources, i.e. build
is platform dependent!
[INFO] skip non existing resourceDirectory <http://hudson.zones.apache.org/hudson/job/Tuscany-2x/ws/sca-2x/itest/distribution/binding-ws-calculator/src/test/resources>
[INFO] [compiler:testCompile {execution: default-testCompile}]
[INFO] No sources to compile
[INFO] [surefire:test {execution: default-test}]
[INFO] No tests to run.
[HUDSON] Recording test results
[INFO] [jar:jar {execution: default-jar}]
[INFO] Building jar: <http://hudson.zones.apache.org/hudson/job/Tuscany-2x/ws/sca-2x/itest/distribution/binding-ws-calculator/target/itest-distribution-binding-ws-calculator-2.0-SNAPSHOT.jar>
[INFO] [antrun:run {execution: run-samples}]
[INFO] Executing tasks
     [echo] /zonestorage/hudson/home/hudson/tools/java/jdk1.6.0_06/jre

run:

init:
    [mkdir] Created dir: <http://hudson.zones.apache.org/hudson/job/Tuscany-2x/ws/sca-2x/distribution/all/target/apache-tuscany-sca-all-2.0-SNAPSHOT.dir/tuscany-sca-2.0-SNAPSHOT/samples/binding-ws-calculator/target/classes>

compile:
    [javac] Compiling 13 source files to <http://hudson.zones.apache.org/hudson/job/Tuscany-2x/ws/sca-2x/distribution/all/target/apache-tuscany-sca-all-2.0-SNAPSHOT.dir/tuscany-sca-2.0-SNAPSHOT/samples/binding-ws-calculator/target/classes>
     [copy] Copying 2 files to <http://hudson.zones.apache.org/hudson/job/Tuscany-2x/ws/sca-2x/distribution/all/target/apache-tuscany-sca-all-2.0-SNAPSHOT.dir/tuscany-sca-2.0-SNAPSHOT/samples/binding-ws-calculator/target/classes>
      [jar] Building jar: <http://hudson.zones.apache.org/hudson/job/Tuscany-2x/ws/sca-2x/distribution/all/target/apache-tuscany-sca-all-2.0-SNAPSHOT.dir/tuscany-sca-2.0-SNAPSHOT/samples/binding-ws-calculator/target/sample-binding-ws-calculator.jar>

run:
     [java] Feb 12, 2010 1:43:43 AM org.apache.tuscany.sca.node.impl.NodeImpl start
     [java] INFO: Starting node: http://tuscany.apache.org/sca/1.1/nodes/default0 domain:
default
     [java] Feb 12, 2010 1:43:43 AM org.apache.tuscany.sca.node.impl.NodeFactoryImpl loadContributions
     [java] INFO: Loading contribution: file:/zonestorage/hudson/home/hudson/hudson/jobs/Tuscany-2x/workspace/sca-2x/distribution/all/target/apache-tuscany-sca-all-2.0-SNAPSHOT.dir/tuscany-sca-2.0-SNAPSHOT/samples/binding-ws-calculator/target/sample-binding-ws-calculator.jar
     [java] Feb 12, 2010 1:43:50 AM org.apache.tuscany.sca.core.assembly.impl.EndpointRegistryImpl
addEndpoint
     [java] INFO: Add endpoint - (@4456558)Endpoint:  URI = SampleClient#service-binding(CalculatorClientImpl/CalculatorClientImpl)
     [java] Feb 12, 2010 1:43:50 AM org.apache.tuscany.sca.core.assembly.impl.EndpointRegistryImpl
addEndpoint
     [java] INFO: Add endpoint - (@7885469)Endpoint:  URI = CalculatorServiceComponent#service-binding(CalculatorServiceImpl/CalculatorServiceImpl)
     [java] Feb 12, 2010 1:43:50 AM org.mortbay.log.Slf4jLog info
     [java] INFO: Logging to org.slf4j.impl.JDK14LoggerAdapter(org.mortbay.log) via org.mortbay.log.Slf4jLog
     [java] Feb 12, 2010 1:47:35 AM org.apache.axis2.deployment.util.TempFileManager <clinit>
     [java] INFO: TempFileManager::unable to delete /var/tmp/axis2-tmp-25688.tmp
     [java] - Deploying module: rampart-1.4 - jar:file:/zonestorage/hudson/home/hudson/hudson/jobs/Tuscany-2x/workspace/sca-2x/distribution/all/target/apache-tuscany-sca-all-2.0-SNAPSHOT.dir/tuscany-sca-2.0-SNAPSHOT/modules/tuscany-binding-ws-runtime-axis2-2.0-SNAPSHOT.jar!/org/apache/tuscany/sca/binding/ws/axis2/engine/repository/modules/rampart-1.4.mar
     [java] Feb 12, 2010 1:47:45 AM org.apache.tuscany.sca.http.jetty.JettyLogger info
     [java] INFO: jetty-6.1.19
     [java] Feb 12, 2010 1:47:54 AM org.apache.tuscany.sca.http.jetty.JettyLogger info
     [java] INFO: Started SelectChannelConnector@0.0.0.0:8085
     [java] Feb 12, 2010 1:47:54 AM org.apache.tuscany.sca.http.jetty.JettyServer addServletMapping
     [java] INFO: Added Servlet mapping: http://hudson.zones.apache.org:8085/AddServiceComponent
     [java] Feb 12, 2010 1:47:54 AM org.apache.tuscany.sca.core.assembly.impl.EndpointRegistryImpl
addEndpoint
     [java] INFO: Add endpoint - (@31382341)Endpoint:  URI = AddServiceComponent#service-binding(AddService/AddService)
     [java] Feb 12, 2010 1:47:54 AM org.apache.tuscany.sca.core.assembly.impl.EndpointRegistryImpl
addEndpoint
     [java] INFO: Add endpoint - (@889349)Endpoint:  URI = SubtractServiceComponent#service-binding(SubtractServiceImpl/SubtractServiceImpl)
     [java] Feb 12, 2010 1:47:54 AM org.apache.tuscany.sca.core.assembly.impl.EndpointRegistryImpl
addEndpoint
     [java] INFO: Add endpoint - (@15580328)Endpoint:  URI = MultiplyServiceComponent#service-binding(MultiplyServiceImpl/MultiplyServiceImpl)
     [java] Feb 12, 2010 1:47:54 AM org.apache.tuscany.sca.core.assembly.impl.EndpointRegistryImpl
addEndpoint
     [java] INFO: Add endpoint - (@33344123)Endpoint:  URI = DivideServiceComponent#service-binding(DivideServiceImpl/DivideServiceImpl)
     [java] SCA API ClassLoader: java.net.URLClassLoader@82c01f sun.misc.Launcher$AppClassLoader@1f12c4e
sun.misc.Launcher$ExtClassLoader@93dee9 
     [java] - Deploying module: rampart-1.4 - jar:file:/zonestorage/hudson/home/hudson/hudson/jobs/Tuscany-2x/workspace/sca-2x/distribution/all/target/apache-tuscany-sca-all-2.0-SNAPSHOT.dir/tuscany-sca-2.0-SNAPSHOT/modules/tuscany-binding-ws-runtime-axis2-2.0-SNAPSHOT.jar!/org/apache/tuscany/sca/binding/ws/axis2/engine/repository/modules/rampart-1.4.mar
     [java] Feb 12, 2010 1:48:04 AM org.apache.tuscany.sca.databinding.impl.DirectedGraph
addEdge
     [java] WARNING: An edge exists with higher weight: (org.w3c.dom.Node)->(java:simpleType)[org.apache.tuscany.sca.databinding.DefaultTransformerExtensionPoint$LazyPullTransformer@1b80d9b;className=org.apache.tuscany.sca.databinding.xml.Node2SimpleJavaType,95000]
     [java] Feb 12, 2010 1:48:04 AM org.apache.tuscany.sca.databinding.impl.DirectedGraph
addEdge
     [java] WARNING: An edge exists with higher weight: (java:simpleType)->(org.w3c.dom.Node)[org.apache.tuscany.sca.databinding.DefaultTransformerExtensionPoint$LazyPullTransformer@1c67b54;className=org.apache.tuscany.sca.databinding.xml.SimpleJavaType2Node,95000]
     [java] 3 + 2=5.0
     [java] 3 - 2=1.0
     [java] 3 * 2=6.0
     [java] 3 / 2=1.5
     [java] Feb 12, 2010 1:48:09 AM org.apache.tuscany.sca.node.impl.NodeImpl stop
     [java] INFO: Stopping node: http://tuscany.apache.org/sca/1.1/nodes/default0
     [java] Feb 12, 2010 1:48:09 AM org.apache.tuscany.sca.http.jetty.JettyServer removeServletMapping
     [java] INFO: Removed Servlet mapping: /AddServiceComponent
[INFO] Executed tasks
[INFO] [install:install {execution: default-install}]
[INFO] Installing <http://hudson.zones.apache.org/hudson/job/Tuscany-2x/ws/sca-2x/itest/distribution/binding-ws-calculator/target/itest-distribution-binding-ws-calculator-2.0-SNAPSHOT.jar>
to /export/home/hudson/.m2/repository/org/apache/tuscany/sca/itest-distribution-binding-ws-calculator/2.0-SNAPSHOT/itest-distribution-binding-ws-calculator-2.0-SNAPSHOT.jar
[HUDSON] Archiving <http://hudson.zones.apache.org/hudson/job/Tuscany-2x/ws/sca-2x/itest/distribution/binding-ws-calculator/pom.xml>
to /export/home/hudson/hudson/jobs/Tuscany-2x/modules/org.apache.tuscany.sca$itest-distribution-binding-ws-calculator/builds/2010-02-12_00-23-43/archive/org.apache.tuscany.sca/itest-distribution-binding-ws-calculator/2.0-SNAPSHOT/pom.xml
[HUDSON] Archiving <http://hudson.zones.apache.org/hudson/job/Tuscany-2x/ws/sca-2x/itest/distribution/binding-ws-calculator/target/itest-distribution-binding-ws-calculator-2.0-SNAPSHOT.jar>
to /export/home/hudson/hudson/jobs/Tuscany-2x/modules/org.apache.tuscany.sca$itest-distribution-binding-ws-calculator/builds/2010-02-12_00-23-43/archive/org.apache.tuscany.sca/itest-distribution-binding-ws-calculator/2.0-SNAPSHOT/itest-distribution-binding-ws-calculator-2.0-SNAPSHOT.jar
[INFO] ------------------------------------------------------------------------
[INFO] Building Apache Tuscany SCA iTest Distribution calculator-rmi
[INFO]    task-segment: [clean, install]
[INFO] ------------------------------------------------------------------------
[INFO] [clean:clean {execution: default-clean}]
[INFO] Deleting file set: <http://hudson.zones.apache.org/hudson/job/Tuscany-2x/ws/sca-2x/itest/distribution/calculator-rmi/target>
(included: [**], excluded: [])
[INFO] [enforcer:enforce {execution: enforce-plugin-versions}]
[INFO] [resources:resources {execution: default-resources}]
[WARNING] Using platform encoding (ISO646-US actually) to copy filtered resources, i.e. build
is platform dependent!
[INFO] skip non existing resourceDirectory <http://hudson.zones.apache.org/hudson/job/Tuscany-2x/ws/sca-2x/itest/distribution/calculator-rmi/src/main/resources>
[INFO] Copying 0 resource
[INFO] [compiler:compile {execution: default-compile}]
[INFO] No sources to compile
[INFO] [resources:testResources {execution: default-testResources}]
[WARNING] Using platform encoding (ISO646-US actually) to copy filtered resources, i.e. build
is platform dependent!
[INFO] skip non existing resourceDirectory <http://hudson.zones.apache.org/hudson/job/Tuscany-2x/ws/sca-2x/itest/distribution/calculator-rmi/src/test/resources>
[INFO] [compiler:testCompile {execution: default-testCompile}]
[INFO] No sources to compile
[INFO] [surefire:test {execution: default-test}]
[INFO] No tests to run.
[HUDSON] Recording test results
[INFO] [jar:jar {execution: default-jar}]
[INFO] Building jar: <http://hudson.zones.apache.org/hudson/job/Tuscany-2x/ws/sca-2x/itest/distribution/calculator-rmi/target/itest-distribution-calculator-rmi-2.0-SNAPSHOT.jar>
[INFO] [antrun:run {execution: run-samples}]
[INFO] Executing tasks

run:

init:
    [mkdir] Created dir: <http://hudson.zones.apache.org/hudson/job/Tuscany-2x/ws/sca-2x/distribution/all/target/apache-tuscany-sca-all-2.0-SNAPSHOT.dir/tuscany-sca-2.0-SNAPSHOT/samples/calculator-rmi-service/target/classes>

compile:
    [javac] Compiling 12 source files to <http://hudson.zones.apache.org/hudson/job/Tuscany-2x/ws/sca-2x/distribution/all/target/apache-tuscany-sca-all-2.0-SNAPSHOT.dir/tuscany-sca-2.0-SNAPSHOT/samples/calculator-rmi-service/target/classes>
     [copy] Copying 2 files to <http://hudson.zones.apache.org/hudson/job/Tuscany-2x/ws/sca-2x/distribution/all/target/apache-tuscany-sca-all-2.0-SNAPSHOT.dir/tuscany-sca-2.0-SNAPSHOT/samples/calculator-rmi-service/target/classes>
      [jar] Building jar: <http://hudson.zones.apache.org/hudson/job/Tuscany-2x/ws/sca-2x/distribution/all/target/apache-tuscany-sca-all-2.0-SNAPSHOT.dir/tuscany-sca-2.0-SNAPSHOT/samples/calculator-rmi-service/target/sample-calculator-rmi-service.jar>

run:

init:
    [mkdir] Created dir: <http://hudson.zones.apache.org/hudson/job/Tuscany-2x/ws/sca-2x/distribution/all/target/apache-tuscany-sca-all-2.0-SNAPSHOT.dir/tuscany-sca-2.0-SNAPSHOT/samples/calculator-rmi-reference/target/classes>

compile:
    [javac] Compiling 7 source files to <http://hudson.zones.apache.org/hudson/job/Tuscany-2x/ws/sca-2x/distribution/all/target/apache-tuscany-sca-all-2.0-SNAPSHOT.dir/tuscany-sca-2.0-SNAPSHOT/samples/calculator-rmi-reference/target/classes>
     [copy] Copying 1 file to <http://hudson.zones.apache.org/hudson/job/Tuscany-2x/ws/sca-2x/distribution/all/target/apache-tuscany-sca-all-2.0-SNAPSHOT.dir/tuscany-sca-2.0-SNAPSHOT/samples/calculator-rmi-reference/target/classes>
      [jar] Building jar: <http://hudson.zones.apache.org/hudson/job/Tuscany-2x/ws/sca-2x/distribution/all/target/apache-tuscany-sca-all-2.0-SNAPSHOT.dir/tuscany-sca-2.0-SNAPSHOT/samples/calculator-rmi-reference/target/sample-calculator-rmi-reference.jar>

run:
     [java] Feb 12, 2010 1:50:35 AM org.apache.tuscany.sca.node.impl.NodeImpl start
     [java] INFO: Starting node: http://tuscany.apache.org/sca/1.1/nodes/default0 domain:
default
     [java] Feb 12, 2010 1:50:35 AM org.apache.tuscany.sca.node.impl.NodeImpl start
     [java] INFO: Starting node: file:/zonestorage/hudson/home/hudson/hudson/jobs/Tuscany-2x/workspace/sca-2x/distribution/all/target/apache-tuscany-sca-all-2.0-SNAPSHOT.dir/tuscany-sca-2.0-SNAPSHOT/samples/calculator-rmi-service/target/sample-calculator-rmi-service.jar
domain: vm://defaultDoamin
     [java] Feb 12, 2010 1:50:35 AM org.apache.tuscany.sca.node.impl.NodeFactoryImpl loadContributions
     [java] INFO: Loading contribution: file:/zonestorage/hudson/home/hudson/hudson/jobs/Tuscany-2x/workspace/sca-2x/distribution/all/target/apache-tuscany-sca-all-2.0-SNAPSHOT.dir/tuscany-sca-2.0-SNAPSHOT/samples/calculator-rmi-service/target/sample-calculator-rmi-service.jar
     [java] Feb 12, 2010 1:50:35 AM org.apache.tuscany.sca.node.impl.NodeFactoryImpl loadContributions
     [java] INFO: Loading contribution: file:/zonestorage/hudson/home/hudson/hudson/jobs/Tuscany-2x/workspace/sca-2x/distribution/all/target/apache-tuscany-sca-all-2.0-SNAPSHOT.dir/tuscany-sca-2.0-SNAPSHOT/samples/calculator-rmi-reference/target/sample-calculator-rmi-reference.jar
     [java] Feb 12, 2010 1:50:49 AM org.apache.tuscany.sca.core.assembly.impl.EndpointRegistryImpl
addEndpoint
     [java] INFO: Add endpoint - (@28848200)Endpoint:  URI = CalculatorServiceComponent#service-binding(CalculatorService/CalculatorService)
     [java] Exception in thread "main" java.lang.reflect.InvocationTargetException
     [java] 	at sun.reflect.NativeMethodAccessorImpl.invoke0(Native Method)
     [java] 	at sun.reflect.NativeMethodAccessorImpl.invoke(NativeMethodAccessorImpl.java:39)
     [java] 	at sun.reflect.DelegatingMethodAccessorImpl.invoke(DelegatingMethodAccessorImpl.java:25)
     [java] 	at java.lang.reflect.Method.invoke(Method.java:597)
     [java] 	at org.apache.tuscany.sca.launcher.LauncherMain.invokeMainMethod(LauncherMain.java:115)
     [java] 	at org.apache.tuscany.sca.launcher.LauncherMain.main(LauncherMain.java:56)
     [java] Caused by: org.apache.tuscany.sca.host.rmi.RMIHostRuntimeException: Connection
refused to host: localhost; nested exception is: 
     [java] 	java.net.ConnectException: Connection refused
     [java] 	at sun.rmi.transport.tcp.TCPEndpoint.newSocket(TCPEndpoint.java:601)
     [java] 	at sun.rmi.transport.tcp.TCPChannel.createConnection(TCPChannel.java:198)
     [java] 	at sun.rmi.transport.tcp.TCPChannel.newConnection(TCPChannel.java:184)
     [java] 	at sun.rmi.server.UnicastRef.newCall(UnicastRef.java:322)
     [java] 	at sun.rmi.registry.RegistryImpl_Stub.lookup(Unknown Source)
     [java] 	at org.apache.tuscany.sca.host.rmi.DefaultRMIHost.findService(DefaultRMIHost.java:112)
     [java] 	at org.apache.tuscany.sca.host.rmi.ExtensibleRMIHost.findService(ExtensibleRMIHost.java:56)
     [java] 	at org.apache.tuscany.sca.binding.rmi.provider.RMIBindingInvoker.invokeTarget(RMIBindingInvoker.java:81)
     [java] 	at org.apache.tuscany.sca.binding.rmi.provider.RMIBindingInvoker.invoke(RMIBindingInvoker.java:54)
     [java] 	at org.apache.tuscany.sca.core.invocation.impl.JDKInvocationHandler.invoke(JDKInvocationHandler.java:236)
     [java] 	at org.apache.tuscany.sca.core.invocation.impl.JDKInvocationHandler.invoke(JDKInvocationHandler.java:106)
     [java] 	at $Proxy6.add(Unknown Source)
     [java] 	at calculator.CalculatorServiceImpl.add(CalculatorServiceImpl.java:54)
     [java] 	at sun.reflect.NativeMethodAccessorImpl.invoke0(Native Method)
     [java] 	at sun.reflect.NativeMethodAccessorImpl.invoke(NativeMethodAccessorImpl.java:39)
     [java] 	at sun.reflect.DelegatingMethodAccessorImpl.invoke(DelegatingMethodAccessorImpl.java:25)
     [java] 	at java.lang.reflect.Method.invoke(Method.java:597)
     [java] 	at org.apache.tuscany.sca.implementation.java.invocation.JavaImplementationInvoker.invoke(JavaImplementationInvoker.java:115)
     [java] 	at org.apache.tuscany.sca.binding.sca.provider.SCABindingInvoker.invoke(SCABindingInvoker.java:75)
     [java] 	at org.apache.tuscany.sca.core.invocation.impl.JDKInvocationHandler.invoke(JDKInvocationHandler.java:236)
     [java] 	at org.apache.tuscany.sca.core.invocation.impl.JDKInvocationHandler.invoke(JDKInvocationHandler.java:106)
     [java] 	at $Proxy5.add(Unknown Source)
     [java] 	at calculator.CalculatorClient.main(CalculatorClient.java:40)
     [java] 	... 6 more
     [java] Feb 12, 2010 1:50:50 AM org.apache.tuscany.sca.host.rmi.DefaultRMIHost registerService
     [java] INFO: RMI service registered: rmi://localhost:8099/CalculatorRMIService
     [java] Feb 12, 2010 1:50:50 AM org.apache.tuscany.sca.core.assembly.impl.EndpointRegistryImpl
addEndpoint
     [java] INFO: Add endpoint - (@8306728)Endpoint:  URI = CalculatorServiceComponent#service-binding(CalculatorService/CalculatorService)
     [java] Feb 12, 2010 1:50:50 AM org.apache.tuscany.sca.core.assembly.impl.EndpointRegistryImpl
addEndpoint
     [java] INFO: Add endpoint - (@172748)Endpoint:  URI = AddServiceComponent#service-binding(AddServiceImpl/AddServiceImpl)
     [java] Feb 12, 2010 1:50:50 AM org.apache.tuscany.sca.core.assembly.impl.EndpointRegistryImpl
addEndpoint
     [java] INFO: Add endpoint - (@17701050)Endpoint:  URI = SubtractServiceComponent#service-binding(SubtractServiceImpl/SubtractServiceImpl)
     [java] Feb 12, 2010 1:50:50 AM org.apache.tuscany.sca.core.assembly.impl.EndpointRegistryImpl
addEndpoint
     [java] INFO: Add endpoint - (@7963093)Endpoint:  URI = MultiplyServiceComponent#service-binding(MultiplyServiceImpl/MultiplyServiceImpl)
     [java] Feb 12, 2010 1:50:50 AM org.apache.tuscany.sca.core.assembly.impl.EndpointRegistryImpl
addEndpoint
     [java] INFO: Add endpoint - (@20630610)Endpoint:  URI = DivideServiceComponent#service-binding(DivideServiceImpl/DivideServiceImpl)
     [java] Hit enter to stop node...
[HUDSON] Archiving <http://hudson.zones.apache.org/hudson/job/Tuscany-2x/ws/sca-2x/itest/distribution/calculator-rmi/pom.xml>
to /export/home/hudson/hudson/jobs/Tuscany-2x/modules/org.apache.tuscany.sca$itest-distribution-calculator-rmi/builds/2010-02-12_00-23-43/archive/org.apache.tuscany.sca/itest-distribution-calculator-rmi/2.0-SNAPSHOT/pom.xml
[HUDSON] Archiving <http://hudson.zones.apache.org/hudson/job/Tuscany-2x/ws/sca-2x/itest/distribution/calculator-rmi/target/itest-distribution-calculator-rmi-2.0-SNAPSHOT.jar>
to /export/home/hudson/hudson/jobs/Tuscany-2x/modules/org.apache.tuscany.sca$itest-distribution-calculator-rmi/builds/2010-02-12_00-23-43/archive/org.apache.tuscany.sca/itest-distribution-calculator-rmi/2.0-SNAPSHOT/itest-distribution-calculator-rmi-2.0-SNAPSHOT.jar
[INFO] ------------------------------------------------------------------------
[ERROR] BUILD ERROR
[INFO] ------------------------------------------------------------------------
[INFO] An Ant BuildException has occured: The following error occurred while executing this
line:
<http://hudson.zones.apache.org/hudson/job/Tuscany-2x/ws/sca-2x/itest/distribution/calculator-rmi/build.xml>:44:
The following error occurred while executing this line:
<http://hudson.zones.apache.org/hudson/job/Tuscany-2x/ws/sca-2x/distribution/all/target/apache-tuscany-sca-all-2.0-SNAPSHOT.dir/tuscany-sca-2.0-SNAPSHOT/samples/calculator-rmi-reference/build.xml>:59:
Java returned: 1

[INFO] ------------------------------------------------------------------------
[INFO] For more information, run Maven with the -e switch
[INFO] ------------------------------------------------------------------------
[INFO] Total time: 86 minutes 56 seconds
[INFO] Finished at: Fri Feb 12 01:50:56 UTC 2010
[INFO] Final Memory: 134M/747M
[INFO] ------------------------------------------------------------------------
Waiting for Hudson to finish collecting data
Sending e-mails to: commits@tuscany.apache.org
Sending e-mails to: commits@tuscany.apache.org
Sending e-mails to: commits@tuscany.apache.org
Sending e-mails to: commits@tuscany.apache.org
channel stopped


Mime
View raw message