tuscany-commits mailing list archives

Site index · List index
Message view « Date » · « Thread »
Top « Date » · « Thread »
From Apache Hudson Server <hud...@hudson.zones.apache.org>
Subject Build failed in Hudson: Tuscany-2x #497
Date Tue, 23 Feb 2010 00:37:06 GMT
See <http://hudson.zones.apache.org/hudson/job/Tuscany-2x/497/changes>

Changes:

[lresende] Moving to most recent release of HtmlUnit (2.6) and adjusting tests based on api
changes

------------------------------------------
[...truncated 1615 lines...]
	at org.junit.runners.model.FrameworkMethod$1.runReflectiveCall(FrameworkMethod.java:44)
	at org.junit.internal.runners.model.ReflectiveCallable.run(ReflectiveCallable.java:15)
	at org.junit.runners.model.FrameworkMethod.invokeExplosively(FrameworkMethod.java:41)
	at org.junit.internal.runners.statements.InvokeMethod.evaluate(InvokeMethod.java:20)
	at org.junit.runners.BlockJUnit4ClassRunner.runChild(BlockJUnit4ClassRunner.java:76)
	at org.junit.runners.BlockJUnit4ClassRunner.runChild(BlockJUnit4ClassRunner.java:50)
	at org.junit.runners.ParentRunner$3.run(ParentRunner.java:193)
	at org.junit.runners.ParentRunner$1.schedule(ParentRunner.java:52)
	at org.junit.runners.ParentRunner.runChildren(ParentRunner.java:191)
	at org.junit.runners.ParentRunner.access$000(ParentRunner.java:42)
	at org.junit.runners.ParentRunner$2.evaluate(ParentRunner.java:184)
	at org.junit.internal.runners.statements.RunBefores.evaluate(RunBefores.java:28)
	at org.junit.runners.ParentRunner.run(ParentRunner.java:236)
	at org.junit.runners.Suite.runChild(Suite.java:128)
	at org.junit.runners.Suite.runChild(Suite.java:24)
	at org.junit.runners.ParentRunner$3.run(ParentRunner.java:193)
	at org.junit.experimental.ParallelComputer$1$1.call(ParallelComputer.java:46)
	at java.util.concurrent.FutureTask$Sync.innerRun(FutureTask.java:303)
	at java.util.concurrent.FutureTask.run(FutureTask.java:138)
	at java.util.concurrent.ThreadPoolExecutor$Worker.runTask(ThreadPoolExecutor.java:885)
	at java.util.concurrent.ThreadPoolExecutor$Worker.run(ThreadPoolExecutor.java:907)
	at java.lang.Thread.run(Thread.java:619)
Feb 23, 2010 12:32:36 AM org.apache.tuscany.sca.contribution.processor.ExtensibleStAXArtifactProcessor
[Definitions: <http://hudson.zones.apache.org/hudson/job/Tuscany-2x/ws/sca-2x/modules/assembly-xml/target/test-classes/org/apache/tuscany/sca/assembly/xml/test_definitions.xml]>
(ElementCannotBeProcessed)
SEVERE: Element {http://schemas.xmlsoap.org/ws/2004/09/policy}PolicyAttachment cannot be processed.
([row,col,system-id]: [42,9,"<http://hudson.zones.apache.org/hudson/job/Tuscany-2x/ws/sca-2x/modules/assembly-xml/target/test-classes/org/apache/tuscany/sca/assembly/xml/test_definitions.xml"])>
Feb 23, 2010 12:32:36 AM org.apache.tuscany.sca.contribution.processor.ExtensibleStAXArtifactProcessor
[Definitions: <http://hudson.zones.apache.org/hudson/job/Tuscany-2x/ws/sca-2x/modules/assembly-xml/target/test-classes/org/apache/tuscany/sca/assembly/xml/test_definitions.xml]>
(ElementCannotBeProcessed)
SEVERE: Element {http://schemas.xmlsoap.org/ws/2004/09/policy}PolicyAttachment cannot be processed.
([row,col,system-id]: [46,9,"<http://hudson.zones.apache.org/hudson/job/Tuscany-2x/ws/sca-2x/modules/assembly-xml/target/test-classes/org/apache/tuscany/sca/assembly/xml/test_definitions.xml"])>
Feb 23, 2010 12:32:36 AM org.apache.tuscany.sca.contribution.processor.ExtensibleStAXArtifactProcessor
[Definitions: <http://hudson.zones.apache.org/hudson/job/Tuscany-2x/ws/sca-2x/modules/assembly-xml/target/test-classes/org/apache/tuscany/sca/assembly/xml/test_definitions.xml]>
(ElementCannotBeProcessed)
SEVERE: Element {http://schemas.xmlsoap.org/ws/2004/09/policy}PolicyAttachment cannot be processed.
([row,col,system-id]: [55,9,"<http://hudson.zones.apache.org/hudson/job/Tuscany-2x/ws/sca-2x/modules/assembly-xml/target/test-classes/org/apache/tuscany/sca/assembly/xml/test_definitions.xml"])>
Feb 23, 2010 12:32:36 AM org.apache.tuscany.sca.contribution.processor.ExtensibleStAXArtifactProcessor
[Definitions: <http://hudson.zones.apache.org/hudson/job/Tuscany-2x/ws/sca-2x/modules/assembly-xml/target/test-classes/org/apache/tuscany/sca/assembly/xml/test_definitions.xml]>
(ElementCannotBeProcessed)
SEVERE: Element {http://schemas.xmlsoap.org/ws/2004/09/policy}PolicyAttachment cannot be processed.
([row,col,system-id]: [59,9,"<http://hudson.zones.apache.org/hudson/job/Tuscany-2x/ws/sca-2x/modules/assembly-xml/target/test-classes/org/apache/tuscany/sca/assembly/xml/test_definitions.xml"])>
Feb 23, 2010 12:32:36 AM org.apache.tuscany.sca.contribution.processor.ExtensibleStAXArtifactProcessor
[Definitions: <http://hudson.zones.apache.org/hudson/job/Tuscany-2x/ws/sca-2x/modules/assembly-xml/target/test-classes/org/apache/tuscany/sca/assembly/xml/test_definitions.xml]>
(ElementCannotBeProcessed)
SEVERE: Element {http://schemas.xmlsoap.org/ws/2004/09/policy}PolicyAttachment cannot be processed.
([row,col,system-id]: [69,17,"<http://hudson.zones.apache.org/hudson/job/Tuscany-2x/ws/sca-2x/modules/assembly-xml/target/test-classes/org/apache/tuscany/sca/assembly/xml/test_definitions.xml"])>
Feb 23, 2010 12:32:36 AM org.apache.tuscany.sca.contribution.processor.ExtensibleStAXArtifactProcessor
[Definitions: <http://hudson.zones.apache.org/hudson/job/Tuscany-2x/ws/sca-2x/modules/assembly-xml/target/test-classes/org/apache/tuscany/sca/assembly/xml/test_definitions.xml]>
(ElementCannotBeProcessed)
SEVERE: Element {http://schemas.xmlsoap.org/ws/2004/09/policy}PolicyAttachment cannot be processed.
([row,col,system-id]: [72,17,"<http://hudson.zones.apache.org/hudson/job/Tuscany-2x/ws/sca-2x/modules/assembly-xml/target/test-classes/org/apache/tuscany/sca/assembly/xml/test_definitions.xml"])>
Feb 23, 2010 12:32:36 AM org.apache.tuscany.sca.contribution.processor.ExtensibleStAXArtifactProcessor
[Definitions: <http://hudson.zones.apache.org/hudson/job/Tuscany-2x/ws/sca-2x/modules/assembly-xml/target/test-classes/org/apache/tuscany/sca/assembly/xml/test_definitions.xml]>
(ElementCannotBeProcessed)
SEVERE: Element {http://schemas.xmlsoap.org/ws/2004/09/policy}PolicyAttachment cannot be processed.
([row,col,system-id]: [75,17,"<http://hudson.zones.apache.org/hudson/job/Tuscany-2x/ws/sca-2x/modules/assembly-xml/target/test-classes/org/apache/tuscany/sca/assembly/xml/test_definitions.xml"])>
Feb 23, 2010 12:32:36 AM org.apache.tuscany.sca.contribution.processor.ExtensibleStAXArtifactProcessor
[Definitions: <http://hudson.zones.apache.org/hudson/job/Tuscany-2x/ws/sca-2x/modules/assembly-xml/target/test-classes/org/apache/tuscany/sca/assembly/xml/test_definitions.xml]>
(ElementCannotBeProcessed)
SEVERE: Element {http://schemas.xmlsoap.org/ws/2004/09/policy}PolicyAttachment cannot be processed.
([row,col,system-id]: [86,17,"<http://hudson.zones.apache.org/hudson/job/Tuscany-2x/ws/sca-2x/modules/assembly-xml/target/test-classes/org/apache/tuscany/sca/assembly/xml/test_definitions.xml"])>
Feb 23, 2010 12:32:36 AM org.apache.tuscany.sca.contribution.processor.ExtensibleStAXArtifactProcessor
[Definitions: <http://hudson.zones.apache.org/hudson/job/Tuscany-2x/ws/sca-2x/modules/assembly-xml/target/test-classes/org/apache/tuscany/sca/assembly/xml/test_definitions.xml]>
(ElementCannotBeProcessed)
SEVERE: Element {http://schemas.xmlsoap.org/ws/2004/09/policy}PolicyAttachment cannot be processed.
([row,col,system-id]: [89,17,"<http://hudson.zones.apache.org/hudson/job/Tuscany-2x/ws/sca-2x/modules/assembly-xml/target/test-classes/org/apache/tuscany/sca/assembly/xml/test_definitions.xml"])>
Feb 23, 2010 12:32:36 AM org.apache.tuscany.sca.contribution.processor.ExtensibleStAXArtifactProcessor
[Definitions: <http://hudson.zones.apache.org/hudson/job/Tuscany-2x/ws/sca-2x/modules/assembly-xml/target/test-classes/org/apache/tuscany/sca/assembly/xml/test_definitions.xml]>
(ElementCannotBeProcessed)
SEVERE: Element {http://schemas.xmlsoap.org/ws/2004/09/policy}PolicyAttachment cannot be processed.
([row,col,system-id]: [94,17,"<http://hudson.zones.apache.org/hudson/job/Tuscany-2x/ws/sca-2x/modules/assembly-xml/target/test-classes/org/apache/tuscany/sca/assembly/xml/test_definitions.xml"])>
Feb 23, 2010 12:32:36 AM org.apache.tuscany.sca.contribution.processor.ExtensibleStAXArtifactProcessor
[Definitions: <http://hudson.zones.apache.org/hudson/job/Tuscany-2x/ws/sca-2x/modules/assembly-xml/target/test-classes/org/apache/tuscany/sca/assembly/xml/test_definitions.xml]>
(ElementCannotBeProcessed)
SEVERE: Element {http://schemas.xmlsoap.org/ws/2004/09/policy}PolicyAttachment cannot be processed.
([row,col,system-id]: [109,9,"<http://hudson.zones.apache.org/hudson/job/Tuscany-2x/ws/sca-2x/modules/assembly-xml/target/test-classes/org/apache/tuscany/sca/assembly/xml/test_definitions.xml"])>
Feb 23, 2010 12:32:36 AM org.apache.tuscany.sca.contribution.processor.ExtensibleStAXArtifactProcessor
[Definitions: <http://hudson.zones.apache.org/hudson/job/Tuscany-2x/ws/sca-2x/modules/assembly-xml/target/test-classes/org/apache/tuscany/sca/assembly/xml/test_definitions.xml]>
(ElementCannotBeProcessed)
SEVERE: Element {http://schemas.xmlsoap.org/ws/2004/09/policy}PolicyAttachment cannot be processed.
([row,col,system-id]: [119,17,"<http://hudson.zones.apache.org/hudson/job/Tuscany-2x/ws/sca-2x/modules/assembly-xml/target/test-classes/org/apache/tuscany/sca/assembly/xml/test_definitions.xml"])>
Feb 23, 2010 12:32:36 AM org.apache.tuscany.sca.contribution.processor.ExtensibleStAXArtifactProcessor
[Definitions: <http://hudson.zones.apache.org/hudson/job/Tuscany-2x/ws/sca-2x/modules/assembly-xml/target/test-classes/org/apache/tuscany/sca/assembly/xml/test_definitions.xml]>
(ElementCannotBeProcessed)
SEVERE: Element {http://schemas.xmlsoap.org/ws/2004/09/policy}PolicyAttachment cannot be processed.
([row,col,system-id]: [123,17,"<http://hudson.zones.apache.org/hudson/job/Tuscany-2x/ws/sca-2x/modules/assembly-xml/target/test-classes/org/apache/tuscany/sca/assembly/xml/test_definitions.xml"])>
Feb 23, 2010 12:32:36 AM org.apache.tuscany.sca.contribution.processor.ExtensibleStAXArtifactProcessor
[Definitions: <http://hudson.zones.apache.org/hudson/job/Tuscany-2x/ws/sca-2x/modules/assembly-xml/target/test-classes/org/apache/tuscany/sca/assembly/xml/test_definitions.xml]>
(ElementCannotBeProcessed)
SEVERE: Element {http://schemas.xmlsoap.org/ws/2004/09/policy}PolicyAttachment cannot be processed.
([row,col,system-id]: [126,17,"<http://hudson.zones.apache.org/hudson/job/Tuscany-2x/ws/sca-2x/modules/assembly-xml/target/test-classes/org/apache/tuscany/sca/assembly/xml/test_definitions.xml"])>
Feb 23, 2010 12:32:36 AM org.apache.tuscany.sca.contribution.processor.ExtensibleStAXArtifactProcessor
[Definitions: <http://hudson.zones.apache.org/hudson/job/Tuscany-2x/ws/sca-2x/modules/assembly-xml/target/test-classes/org/apache/tuscany/sca/assembly/xml/test_definitions.xml]>
(ElementCannotBeProcessed)
SEVERE: Element {http://schemas.xmlsoap.org/ws/2004/09/policy}Policy cannot be processed.
([row,col,system-id]: [138,9,"<http://hudson.zones.apache.org/hudson/job/Tuscany-2x/ws/sca-2x/modules/assembly-xml/target/test-classes/org/apache/tuscany/sca/assembly/xml/test_definitions.xml"])>
Feb 23, 2010 12:32:36 AM org.apache.tuscany.sca.definitions.xml.DefinitionsProcessor [] (BindingTypeNotFound)
SEVERE: An extension to support the binding type {http://docs.oasis-open.org/ns/opencsa/sca/200912}binding.ws
cant be found in the domain  
Feb 23, 2010 12:32:36 AM org.apache.tuscany.sca.definitions.xml.DefinitionsProcessor [] (ImplementationTypeNotFound)
SEVERE: [POL50001] An extension to support the implementation type {http://docs.oasis-open.org/ns/opencsa/sca/200912}implementation.java
cant be found in the domain
Feb 23, 2010 12:32:36 AM org.apache.tuscany.sca.assembly.xml.CompositeProcessor [Composite:
{http://calc}TestAllCalculator] (ContributionResolveException)
SEVERE: ContributionResolveException occured due to : {0}
org.apache.tuscany.sca.contribution.processor.ContributionResolveException: Error: Composite
{http://calc}TestAllDivide is not a valid composite within the domain
	at org.apache.tuscany.sca.assembly.xml.CompositeProcessor.resolve(CompositeProcessor.java:996)
	at org.apache.tuscany.sca.assembly.xml.CompositeProcessor.resolve(CompositeProcessor.java:1)
	at org.apache.tuscany.sca.contribution.processor.DefaultStAXArtifactProcessorExtensionPoint$LazyStAXArtifactProcessor.resolve(DefaultStAXArtifactProcessorExtensionPoint.java:321)
	at org.apache.tuscany.sca.contribution.processor.ExtensibleStAXArtifactProcessor.resolve(ExtensibleStAXArtifactProcessor.java:199)
	at org.apache.tuscany.sca.assembly.xml.WriteAllTestCase.testReadWireWriteComposite(WriteAllTestCase.java:111)
	at sun.reflect.NativeMethodAccessorImpl.invoke0(Native Method)
	at sun.reflect.NativeMethodAccessorImpl.invoke(NativeMethodAccessorImpl.java:39)
	at sun.reflect.DelegatingMethodAccessorImpl.invoke(DelegatingMethodAccessorImpl.java:25)
	at java.lang.reflect.Method.invoke(Method.java:597)
	at org.junit.runners.model.FrameworkMethod$1.runReflectiveCall(FrameworkMethod.java:44)
	at org.junit.internal.runners.model.ReflectiveCallable.run(ReflectiveCallable.java:15)
	at org.junit.runners.model.FrameworkMethod.invokeExplosively(FrameworkMethod.java:41)
	at org.junit.internal.runners.statements.InvokeMethod.evaluate(InvokeMethod.java:20)
	at org.junit.runners.BlockJUnit4ClassRunner.runChild(BlockJUnit4ClassRunner.java:76)
	at org.junit.runners.BlockJUnit4ClassRunner.runChild(BlockJUnit4ClassRunner.java:50)
	at org.junit.runners.ParentRunner$3.run(ParentRunner.java:193)
	at org.junit.runners.ParentRunner$1.schedule(ParentRunner.java:52)
	at org.junit.runners.ParentRunner.runChildren(ParentRunner.java:191)
	at org.junit.runners.ParentRunner.access$000(ParentRunner.java:42)
	at org.junit.runners.ParentRunner$2.evaluate(ParentRunner.java:184)
	at org.junit.internal.runners.statements.RunBefores.evaluate(RunBefores.java:28)
	at org.junit.runners.ParentRunner.run(ParentRunner.java:236)
	at org.junit.runners.Suite.runChild(Suite.java:128)
	at org.junit.runners.Suite.runChild(Suite.java:24)
	at org.junit.runners.ParentRunner$3.run(ParentRunner.java:193)
	at org.junit.experimental.ParallelComputer$1$1.call(ParallelComputer.java:46)
	at java.util.concurrent.FutureTask$Sync.innerRun(FutureTask.java:303)
	at java.util.concurrent.FutureTask.run(FutureTask.java:138)
	at java.util.concurrent.ThreadPoolExecutor$Worker.runTask(ThreadPoolExecutor.java:885)
	at java.util.concurrent.ThreadPoolExecutor$Worker.run(ThreadPoolExecutor.java:907)
	at java.lang.Thread.run(Thread.java:619)
Feb 23, 2010 12:32:36 AM org.apache.tuscany.sca.contribution.processor.ExtensibleStAXArtifactProcessor
[] (ElementCannotBeProcessed)
SEVERE: Element {http://docs.oasis-open.org/ns/opencsa/sca/200912}interface.java cannot be
processed. ([row,col {unknown-source}]: [23,9])
Feb 23, 2010 12:32:36 AM org.apache.tuscany.sca.contribution.processor.ExtensibleStAXArtifactProcessor
[] (ElementCannotBeProcessed)
SEVERE: Element {http://docs.oasis-open.org/ns/opencsa/sca/200912}interface.java cannot be
processed. ([row,col {unknown-source}]: [27,9])
Feb 23, 2010 12:32:36 AM org.apache.tuscany.sca.contribution.processor.ExtensibleStAXArtifactProcessor
[] (ElementCannotBeProcessed)
SEVERE: Element {http://docs.oasis-open.org/ns/opencsa/sca/200912}interface.java cannot be
processed. ([row,col {unknown-source}]: [27,9])
Feb 23, 2010 12:32:36 AM org.apache.tuscany.sca.contribution.processor.ExtensibleStAXArtifactProcessor
[] (ElementCannotBeProcessed)
SEVERE: Element {http://docs.oasis-open.org/ns/opencsa/sca/200912}implementation.java cannot
be processed. ([row,col {unknown-source}]: [31,3])
Feb 23, 2010 12:32:36 AM org.apache.tuscany.sca.contribution.processor.ExtensibleStAXArtifactProcessor
[] (ElementCannotBeProcessed)
SEVERE: Element {http://docs.oasis-open.org/ns/opencsa/sca/200912}implementation.java cannot
be processed. ([row,col {unknown-source}]: [39,9])
Feb 23, 2010 12:32:36 AM org.apache.tuscany.sca.contribution.processor.ExtensibleStAXArtifactProcessor
[] (ElementCannotBeProcessed)
SEVERE: Element {http://docs.oasis-open.org/ns/opencsa/sca/200912}implementation.java cannot
be processed. ([row,col {unknown-source}]: [43,9])
Feb 23, 2010 12:32:36 AM org.apache.tuscany.sca.contribution.processor.ExtensibleStAXArtifactProcessor
[] (ElementCannotBeProcessed)
SEVERE: Element {http://docs.oasis-open.org/ns/opencsa/sca/200912}implementation.java cannot
be processed. ([row,col {unknown-source}]: [47,9])
Feb 23, 2010 12:32:36 AM org.apache.tuscany.sca.contribution.processor.ExtensibleStAXArtifactProcessor
[] (ElementCannotBeProcessed)
SEVERE: Element {http://docs.oasis-open.org/ns/opencsa/sca/200912}implementation.java cannot
be processed. ([row,col {unknown-source}]: [51,9])
Feb 23, 2010 12:32:36 AM org.apache.tuscany.sca.contribution.processor.ExtensibleStAXArtifactProcessor
[] (ElementCannotBeProcessed)
SEVERE: Element {http://x}unknownElement cannot be processed. ([row,col {unknown-source}]:
[54,5])
Feb 23, 2010 12:32:36 AM org.apache.tuscany.sca.contribution.processor.ValidatingXMLStreamReader$1
error
WARNING: XMLSchema validation problem in: null, line: 1, column: 196
cvc-complex-type.2.4.a: Invalid content was found starting with element 'implementation.unknown'.
One of '{"http://docs.oasis-open.org/ns/opencsa/sca/200912":documentation, "http://docs.oasis-open.org/ns/opencsa/sca/200912":implementation}'
is expected.
Feb 23, 2010 12:32:36 AM org.apache.tuscany.sca.contribution.processor.ExtensibleStAXArtifactProcessor
[] (ElementCannotBeProcessed)
SEVERE: Element {http://docs.oasis-open.org/ns/opencsa/sca/200912}implementation.unknown cannot
be processed. ([row,col {unknown-source}]: [1,196])
Feb 23, 2010 12:32:36 AM org.apache.tuscany.sca.contribution.processor.ExtensibleStAXArtifactProcessor
[] (ElementCannotBeProcessed)
SEVERE: Element {http://docs.oasis-open.org/ns/opencsa/sca/200912}binding.ws cannot be processed.
([row,col {unknown-source}]: [1,262])
Feb 23, 2010 12:32:37 AM org.apache.tuscany.sca.contribution.processor.ExtensibleStAXArtifactProcessor
[] (ElementCannotBeProcessed)
SEVERE: Element {http://docs.oasis-open.org/ns/opencsa/sca/200912}interface.java cannot be
processed. ([row,col {unknown-source}]: [26,9])
Feb 23, 2010 12:32:37 AM org.apache.tuscany.sca.contribution.processor.ExtensibleStAXArtifactProcessor
[] (ElementCannotBeProcessed)
SEVERE: Element {http://tuscany.apache.org/xmlns/sca/1.1}binding.rmi cannot be processed.
([row,col {unknown-source}]: [27,9])
Feb 23, 2010 12:32:37 AM org.apache.tuscany.sca.contribution.processor.ExtensibleStAXArtifactProcessor
[] (ElementCannotBeProcessed)
SEVERE: Element {http://docs.oasis-open.org/ns/opencsa/sca/200912}implementation.java cannot
be processed. ([row,col {unknown-source}]: [31,9])
Feb 23, 2010 12:32:37 AM org.apache.tuscany.sca.contribution.processor.ExtensibleStAXArtifactProcessor
[] (ElementCannotBeProcessed)
SEVERE: Element {http://docs.oasis-open.org/ns/opencsa/sca/200912}implementation.java cannot
be processed. ([row,col {unknown-source}]: [35,9])
Feb 23, 2010 12:32:37 AM org.apache.tuscany.sca.contribution.processor.ExtensibleStAXArtifactProcessor
[] (ElementCannotBeProcessed)
SEVERE: Element {http://docs.oasis-open.org/ns/opencsa/sca/200912}interface.java cannot be
processed. ([row,col {unknown-source}]: [40,9])
Feb 23, 2010 12:32:37 AM org.apache.tuscany.sca.contribution.processor.ExtensibleStAXArtifactProcessor
[] (ElementCannotBeProcessed)
SEVERE: Element {http://tuscany.apache.org/xmlns/sca/1.1}binding.rmi cannot be processed.
([row,col {unknown-source}]: [41,9])
Running org.apache.tuscany.sca.assembly.xml.WriteNamespacesTestCase
Tests run: 1, Failures: 0, Errors: 0, Skipped: 0, Time elapsed: 0.01 sec
Running org.apache.tuscany.sca.assembly.xml.ReadDocumentTestCase
Tests run: 6, Failures: 0, Errors: 0, Skipped: 0, Time elapsed: 0.006 sec
Running org.apache.tuscany.sca.assembly.xml.ResolvePolicyTestCase
Tests run: 1, Failures: 0, Errors: 0, Skipped: 0, Time elapsed: 0.004 sec
Running org.apache.tuscany.sca.assembly.xml.ReadWriteLocalCompositeTestCase
Tests run: 2, Failures: 0, Errors: 0, Skipped: 0, Time elapsed: 0.005 sec
Running org.apache.tuscany.sca.assembly.xml.ReadWriteAnyElementTestCase
Tests run: 2, Failures: 0, Errors: 0, Skipped: 0, Time elapsed: 0.005 sec
Running org.apache.tuscany.sca.policy.xml.PolicyXPathFunctionResolverTestCase
Tests run: 4, Failures: 0, Errors: 0, Skipped: 0, Time elapsed: 0.007 sec
Running org.apache.tuscany.sca.assembly.xml.ReadWriteAnyAttributeTestCase
Tests run: 2, Failures: 0, Errors: 0, Skipped: 0, Time elapsed: 0.006 sec
Running org.apache.tuscany.sca.assembly.xml.ResolveTestCase
Tests run: 1, Failures: 0, Errors: 0, Skipped: 0, Time elapsed: 0.075 sec
Running org.apache.tuscany.sca.assembly.xml.CompositeProcessorTestCase
Tests run: 2, Failures: 0, Errors: 0, Skipped: 0, Time elapsed: 0.006 sec
Running org.apache.tuscany.sca.policy.xml.ReadDocumentTestCase
Tests run: 2, Failures: 0, Errors: 0, Skipped: 0, Time elapsed: 0.007 sec
Running org.apache.tuscany.sca.assembly.xml.WireTestCase
Tests run: 1, Failures: 0, Errors: 0, Skipped: 0, Time elapsed: 0.006 sec
Running org.apache.tuscany.sca.assembly.xml.WriteAllTestCase
Tests run: 3, Failures: 0, Errors: 0, Skipped: 0, Time elapsed: 0.006 sec
Running org.apache.tuscany.sca.assembly.xml.ReadTestCase
Tests run: 3, Failures: 0, Errors: 0, Skipped: 0, Time elapsed: 0.006 sec
Running org.apache.tuscany.sca.definitions.xml.ReadDocumentTestCase
Tests run: 2, Failures: 0, Errors: 0, Skipped: 0, Time elapsed: 0.057 sec
Running org.apache.tuscany.sca.assembly.xml.MultiplicityReadWriteTestCase
Tests run: 1, Failures: 0, Errors: 0, Skipped: 0, Time elapsed: 0.008 sec
Running org.apache.tuscany.sca.assembly.xml.ReadAllTestCase
Tests run: 1, Failures: 0, Errors: 0, Skipped: 0, Time elapsed: 0.036 sec

Results :

Tests run: 34, Failures: 0, Errors: 0, Skipped: 0

[HUDSON] Recording test results
[INFO] [jar:jar {execution: default-jar}]
[INFO] Building jar: <http://hudson.zones.apache.org/hudson/job/Tuscany-2x/ws/sca-2x/modules/assembly-xml/target/tuscany-assembly-xml-2.0-SNAPSHOT.jar>
[INFO] [install:install {execution: default-install}]
[INFO] Installing <http://hudson.zones.apache.org/hudson/job/Tuscany-2x/ws/sca-2x/modules/assembly-xml/target/tuscany-assembly-xml-2.0-SNAPSHOT.jar>
to /export/home/hudson/.m2/repository/org/apache/tuscany/sca/tuscany-assembly-xml/2.0-SNAPSHOT/tuscany-assembly-xml-2.0-SNAPSHOT.jar
[HUDSON] Archiving <http://hudson.zones.apache.org/hudson/job/Tuscany-2x/ws/sca-2x/modules/assembly-xml/pom.xml>
to /export/home/hudson/hudson/jobs/Tuscany-2x/modules/org.apache.tuscany.sca$tuscany-assembly-xml/builds/2010-02-23_00-30-57/archive/org.apache.tuscany.sca/tuscany-assembly-xml/2.0-SNAPSHOT/pom.xml
[HUDSON] Archiving <http://hudson.zones.apache.org/hudson/job/Tuscany-2x/ws/sca-2x/modules/assembly-xml/target/tuscany-assembly-xml-2.0-SNAPSHOT.jar>
to /export/home/hudson/hudson/jobs/Tuscany-2x/modules/org.apache.tuscany.sca$tuscany-assembly-xml/builds/2010-02-23_00-30-57/archive/org.apache.tuscany.sca/tuscany-assembly-xml/2.0-SNAPSHOT/tuscany-assembly-xml-2.0-SNAPSHOT.jar
[INFO] ------------------------------------------------------------------------
[INFO] Building Apache Tuscany SCA Atom Feed Binding Extension
[INFO]    task-segment: [clean, install]
[INFO] ------------------------------------------------------------------------
[INFO] [clean:clean {execution: default-clean}]
[INFO] Deleting file set: <http://hudson.zones.apache.org/hudson/job/Tuscany-2x/ws/sca-2x/modules/binding-atom/target>
(included: [**], excluded: [])
[INFO] [enforcer:enforce {execution: enforce-plugin-versions}]
[INFO] [resources:resources {execution: default-resources}]
[WARNING] Using platform encoding (ISO646-US actually) to copy filtered resources, i.e. build
is platform dependent!
[INFO] Copying 2 resources
[INFO] Copying 5 resources
[INFO] [compiler:compile {execution: default-compile}]
[INFO] Invoking Tuscany Eclipse JDT compiler
[INFO] Compiling 4 to <http://hudson.zones.apache.org/hudson/job/Tuscany-2x/ws/sca-2x/modules/binding-atom/target/classes>
[INFO] Resolving OSGi bundle: org.apache.tuscany.sca.binding.atom
[ERROR] --> [org.apache.tuscany.sca.binding.atom] Missing Constraint: Import-Package: org.apache.tuscany.sca.assembly.xml;
version="2.0.0"
[INFO] [resources:testResources {execution: default-testResources}]
[WARNING] Using platform encoding (ISO646-US actually) to copy filtered resources, i.e. build
is platform dependent!
[INFO] Copying 0 resource
[INFO] [compiler:testCompile {execution: default-testCompile}]
[INFO] Invoking Tuscany Eclipse JDT compiler
[INFO] Compiling 1 to <http://hudson.zones.apache.org/hudson/job/Tuscany-2x/ws/sca-2x/modules/binding-atom/target/test-classes>
[INFO] [surefire:test {execution: default-test}]
[INFO] Concurrency config is {parallel=classes, configurableParallelComputerPresent=false}
[INFO] Surefire report directory: <http://hudson.zones.apache.org/hudson/job/Tuscany-2x/ws/sca-2x/modules/binding-atom/target/surefire-reports>

-------------------------------------------------------
 T E S T S
-------------------------------------------------------
Feb 23, 2010 12:32:43 AM org.apache.tuscany.sca.contribution.processor.ExtensibleStAXArtifactProcessor
[] (ElementCannotBeProcessed)
SEVERE: Element {http://docs.oasis-open.org/ns/opencsa/sca/200912}implementation.java cannot
be processed. ([row,col {unknown-source}]: [1,263])
Running org.apache.tuscany.sca.binding.atom.AtomBindingProcessorTestCase
Tests run: 1, Failures: 0, Errors: 0, Skipped: 0, Time elapsed: 0.026 sec

Results :

Tests run: 1, Failures: 0, Errors: 0, Skipped: 0

[HUDSON] Recording test results
[INFO] [jar:jar {execution: default-jar}]
[INFO] Building jar: <http://hudson.zones.apache.org/hudson/job/Tuscany-2x/ws/sca-2x/modules/binding-atom/target/tuscany-binding-atom-2.0-SNAPSHOT.jar>
[INFO] [install:install {execution: default-install}]
[INFO] Installing <http://hudson.zones.apache.org/hudson/job/Tuscany-2x/ws/sca-2x/modules/binding-atom/target/tuscany-binding-atom-2.0-SNAPSHOT.jar>
to /export/home/hudson/.m2/repository/org/apache/tuscany/sca/tuscany-binding-atom/2.0-SNAPSHOT/tuscany-binding-atom-2.0-SNAPSHOT.jar
[HUDSON] Archiving <http://hudson.zones.apache.org/hudson/job/Tuscany-2x/ws/sca-2x/modules/binding-atom/pom.xml>
to /export/home/hudson/hudson/jobs/Tuscany-2x/modules/org.apache.tuscany.sca$tuscany-binding-atom/builds/2010-02-23_00-30-57/archive/org.apache.tuscany.sca/tuscany-binding-atom/2.0-SNAPSHOT/pom.xml
[HUDSON] Archiving <http://hudson.zones.apache.org/hudson/job/Tuscany-2x/ws/sca-2x/modules/binding-atom/target/tuscany-binding-atom-2.0-SNAPSHOT.jar>
to /export/home/hudson/hudson/jobs/Tuscany-2x/modules/org.apache.tuscany.sca$tuscany-binding-atom/builds/2010-02-23_00-30-57/archive/org.apache.tuscany.sca/tuscany-binding-atom/2.0-SNAPSHOT/tuscany-binding-atom-2.0-SNAPSHOT.jar
[INFO] ------------------------------------------------------------------------
[INFO] Building Apache Tuscany SCA Core SPI
[INFO]    task-segment: [clean, install]
[INFO] ------------------------------------------------------------------------
[INFO] [clean:clean {execution: default-clean}]
[INFO] Deleting file set: <http://hudson.zones.apache.org/hudson/job/Tuscany-2x/ws/sca-2x/modules/core-spi/target>
(included: [**], excluded: [])
[INFO] [enforcer:enforce {execution: enforce-plugin-versions}]
[INFO] [buildnumber:create {execution: default}]
[INFO] Checking for local modifications: skipped.
[INFO] Executing: /bin/sh -c cd <http://hudson.zones.apache.org/hudson/job/Tuscany-2x/ws/sca-2x/modules/core-spi>
&& svn --non-interactive update <http://hudson.zones.apache.org/hudson/job/Tuscany-2x/ws/sca-2x/modules/core-spi>
[INFO] Working directory: <http://hudson.zones.apache.org/hudson/job/Tuscany-2x/ws/sca-2x/modules/core-spi>
Provider message:
The svn command failed.
Command output:
svn: PROPFIND request failed on '/repos/asf/tuscany/sca-java-2.x/trunk/modules'
svn: PROPFIND of '/repos/asf/tuscany/sca-java-2.x/trunk/modules': could not connect to server
(https://svn.apache.org)

[HUDSON] Archiving <http://hudson.zones.apache.org/hudson/job/Tuscany-2x/ws/sca-2x/modules/core-spi/pom.xml>
to /export/home/hudson/hudson/jobs/Tuscany-2x/modules/org.apache.tuscany.sca$tuscany-core-spi/builds/2010-02-23_00-30-58/archive/org.apache.tuscany.sca/tuscany-core-spi/2.0-SNAPSHOT/pom.xml
[INFO] ------------------------------------------------------------------------
[ERROR] BUILD ERROR
[INFO] ------------------------------------------------------------------------
[INFO] Couldn't update project.

Embedded error: Error!
[INFO] ------------------------------------------------------------------------
[INFO] For more information, run Maven with the -e switch
[INFO] ------------------------------------------------------------------------
[INFO] Total time: 5 minutes 29 seconds
[INFO] Finished at: Tue Feb 23 00:36:39 UTC 2010
[INFO] Final Memory: 47M/748M
[INFO] ------------------------------------------------------------------------
Sending e-mails to: commits@tuscany.apache.org
channel stopped


Mime
View raw message