tuscany-commits mailing list archives

Site index · List index
Message view « Date » · « Thread »
Top « Date » · « Thread »
From Apache Hudson Server <hud...@hudson.zones.apache.org>
Subject Build failed in Hudson: Tuscany-2x » Apache Tuscany SCA Sample Calculator OSGi #484
Date Thu, 11 Feb 2010 00:22:36 GMT
See <http://hudson.zones.apache.org/hudson/job/Tuscany-2x/org.apache.tuscany.sca$sample-calculator-osgi/484/>

------------------------------------------
[INFO] ------------------------------------------------------------------------
[INFO] Building Apache Tuscany SCA Sample Calculator OSGi
[INFO]    task-segment: [clean, install]
[INFO] ------------------------------------------------------------------------
[INFO] [clean:clean {execution: default-clean}]
[INFO] Deleting file set: <http://hudson.zones.apache.org/hudson/job/Tuscany-2x/org.apache.tuscany.sca$sample-calculator-osgi/ws/target>
(included: [**], excluded: [])
[INFO] [enforcer:enforce {execution: enforce-plugin-versions}]
[INFO] [resources:resources {execution: default-resources}]
[WARNING] Using platform encoding (UTF-8 actually) to copy filtered resources, i.e. build
is platform dependent!
[INFO] Copying 1 resource
[INFO] Copying 2 resources
[INFO] [compiler:compile {execution: default-compile}]
[INFO] Invoking Tuscany Eclipse JDT compiler
[INFO] Compiling 12 to <http://hudson.zones.apache.org/hudson/job/Tuscany-2x/org.apache.tuscany.sca$sample-calculator-osgi/ws/target/classes>
[INFO] Resolving OSGi bundle: sample-calculator-osgi
[INFO] OSGi bundle is resolved: sample-calculator-osgi
[INFO] [resources:testResources {execution: default-testResources}]
[WARNING] Using platform encoding (UTF-8 actually) to copy filtered resources, i.e. build
is platform dependent!
[INFO] skip non existing resourceDirectory <http://hudson.zones.apache.org/hudson/job/Tuscany-2x/org.apache.tuscany.sca$sample-calculator-osgi/ws/src/test/resources>
[INFO] [compiler:testCompile {execution: default-testCompile}]
[INFO] Invoking Tuscany Eclipse JDT compiler
[INFO] Compiling 1 to <http://hudson.zones.apache.org/hudson/job/Tuscany-2x/org.apache.tuscany.sca$sample-calculator-osgi/ws/target/test-classes>
[INFO] [surefire:test {execution: default-test}]
[INFO] Concurrency config is {parallel=classes, configurableParallelComputerPresent=false}
[INFO] Surefire report directory: <http://hudson.zones.apache.org/hudson/job/Tuscany-2x/org.apache.tuscany.sca$sample-calculator-osgi/ws/target/surefire-reports>

-------------------------------------------------------
 T E S T S
-------------------------------------------------------
SCA Node API ClassLoader: sun.misc.Launcher$AppClassLoader@360be0
Feb 11, 2010 12:21:58 AM org.apache.tuscany.sca.node.impl.NodeImpl start
INFO: Starting node: http://tuscany.apache.org/sca/1.1/nodes/default0 domain: default
Feb 11, 2010 12:21:58 AM org.apache.tuscany.sca.node.impl.NodeFactoryImpl loadContributions
INFO: Loading contribution: <http://hudson.zones.apache.org/hudson/job/Tuscany-2x/org.apache.tuscany.sca$sample-calculator-osgi/ws/target/classes/>
Feb 11, 2010 12:21:59 AM org.apache.tuscany.sca.core.assembly.impl.EndpointRegistryImpl addEndpoint
INFO: Add endpoint - (@21422977)Endpoint:  URI = CalculatorServiceComponent#service-binding(CalculatorServiceImpl/CalculatorServiceImpl)
Feb 11, 2010 12:21:59 AM org.apache.tuscany.sca.core.assembly.impl.EndpointRegistryImpl addEndpoint
INFO: Add endpoint - (@16927124)Endpoint:  URI = AddServiceComponent#service-binding(AddServiceImpl/AddServiceImpl)
Feb 11, 2010 12:21:59 AM org.apache.tuscany.sca.core.assembly.impl.EndpointRegistryImpl addEndpoint
INFO: Add endpoint - (@19714461)Endpoint:  URI = SubtractServiceComponent#service-binding(SubtractServiceImpl/SubtractServiceImpl)
Feb 11, 2010 12:21:59 AM org.apache.tuscany.sca.core.assembly.impl.EndpointRegistryImpl addEndpoint
INFO: Add endpoint - (@24485138)Endpoint:  URI = MultiplyServiceComponent#service-binding(MultiplyServiceImpl/MultiplyServiceImpl)
Feb 11, 2010 12:21:59 AM org.apache.tuscany.sca.core.assembly.impl.EndpointRegistryImpl addEndpoint
INFO: Add endpoint - (@10168913)Endpoint:  URI = DivideServiceComponent#service-binding(DivideServiceImpl/DivideServiceImpl)
Feb 11, 2010 12:21:59 AM org.apache.tuscany.sca.core.assembly.impl.EndpointRegistryImpl addEndpoint
INFO: Add endpoint - (@16200795)Endpoint:  URI = CalculatorClient#service-binding(CalculatorClient/CalculatorClient)
SCA API ClassLoader: sun.misc.Launcher$AppClassLoader@360be0
3 + 2=5.0
3 - 2=1.0
3 * 2=6.0
3 / 2=1.5
Feb 11, 2010 12:21:59 AM org.apache.tuscany.sca.node.impl.NodeImpl stop
INFO: Stopping node: http://tuscany.apache.org/sca/1.1/nodes/default0
Running calculator.CalculatorTestCase
Tests run: 1, Failures: 0, Errors: 0, Skipped: 0, Time elapsed: 0.009 sec

Results :

Tests run: 1, Failures: 0, Errors: 0, Skipped: 0

[HUDSON] Recording test results
[INFO] [osgi-junit:test {execution: osgi-test}]
[INFO] snapshot org.apache.tuscany.sca:tuscany-extensibility-equinox:2.0-SNAPSHOT: checking
for updates from apache.snapshots
[INFO] snapshot org.apache.tuscany.sca:tuscany-extensibility-equinox:2.0-SNAPSHOT: checking
for updates from codehaus-snapshot
[INFO] snapshot org.apache.tuscany.sca:tuscany-contribution-osgi:2.0-SNAPSHOT: checking for
updates from apache.snapshots
[INFO] snapshot org.apache.tuscany.sca:tuscany-contribution-osgi:2.0-SNAPSHOT: checking for
updates from codehaus-snapshot
[INFO] Generating <http://hudson.zones.apache.org/hudson/job/Tuscany-2x/org.apache.tuscany.sca$sample-calculator-osgi/ws/target/sample-calculator-osgi-osgi.jar>
[INFO] Generating <http://hudson.zones.apache.org/hudson/job/Tuscany-2x/org.apache.tuscany.sca$sample-calculator-osgi/ws/target/sample-calculator-osgi-osgi-tests.jar>
[INFO] Surefire report directory: <http://hudson.zones.apache.org/hudson/job/Tuscany-2x/org.apache.tuscany.sca$sample-calculator-osgi/ws/target/surefire-osgi-reports>

-------------------------------------------------------
 T E S T S
-------------------------------------------------------
Running calculator.CalculatorTestCase
SCA Node API ClassLoader: org.eclipse.osgi.internal.baseadaptor.DefaultClassLoader@e753
Feb 11, 2010 12:22:03 AM org.apache.tuscany.sca.node.impl.NodeImpl start
INFO: Starting node: http://tuscany.apache.org/sca/1.1/nodes/default0 domain: default
Feb 11, 2010 12:22:03 AM org.apache.tuscany.sca.node.impl.NodeFactoryImpl loadContributions
INFO: Loading contribution: <http://hudson.zones.apache.org/hudson/job/Tuscany-2x/org.apache.tuscany.sca$sample-calculator-osgi/ws/target/sample-calculator-osgi-osgi.jar>
Feb 11, 2010 12:22:04 AM org.apache.tuscany.sca.node.impl.NodeImpl stop
INFO: Stopping node: http://tuscany.apache.org/sca/1.1/nodes/default0
Tests run: 1, Failures: 0, Errors: 1, Skipped: 0, Time elapsed: 1.015 sec <<< FAILURE!

Results :

Tests in error: 
  calculator.CalculatorTestCase

Tests run: 1, Failures: 0, Errors: 1, Skipped: 0

[HUDSON] Archiving <http://hudson.zones.apache.org/hudson/job/Tuscany-2x/org.apache.tuscany.sca$sample-calculator-osgi/ws/pom.xml>
to /export/home/hudson/hudson/jobs/Tuscany-2x/modules/org.apache.tuscany.sca$sample-calculator-osgi/builds/2010-02-11_00-12-45/archive/org.apache.tuscany.sca/sample-calculator-osgi/2.0-SNAPSHOT/pom.xml
[INFO] ------------------------------------------------------------------------
[ERROR] BUILD FAILURE
[INFO] ------------------------------------------------------------------------
[INFO] There are test failures.

Please refer to <http://hudson.zones.apache.org/hudson/job/Tuscany-2x/org.apache.tuscany.sca$sample-calculator-osgi/ws/target/surefire-osgi-reports>
for the individual test results.
[INFO] ------------------------------------------------------------------------
[INFO] For more information, run Maven with the -e switch
[INFO] ------------------------------------------------------------------------
[INFO] Total time: 8 minutes 59 seconds
[INFO] Finished at: Thu Feb 11 00:22:13 UTC 2010
[INFO] Final Memory: 88M/751M
[INFO] ------------------------------------------------------------------------
Waiting for Hudson to finish collecting data


Mime
View raw message