tuscany-commits mailing list archives

Site index · List index
Message view « Date » · « Thread »
Top « Date » · « Thread »
From Apache Hudson Server <hud...@hudson.zones.apache.org>
Subject Build failed in Hudson: Tuscany-SCA-J-CAA #121
Date Thu, 11 Feb 2010 00:28:05 GMT
See <http://hudson.zones.apache.org/hudson/job/Tuscany-SCA-J-CAA/121/changes>

Changes:

[rfeng] Fix some of minor bugs discovered by FindBugs

[rfeng] Fix some of minor bugs discovered by FindBugs

[kelvingoodson] link pd info back to spec conformance statement 50004

[kelvingoodson] link pd info back to spec conformance statement 50009

[kelvingoodson] link pd info back to spec conformance statement 50008

[kelvingoodson] add some conformance numbers to error messages

[slaws] Call node init() to ensure that the extension point registry is initialized. Remove
the local test from the default client impl. This local test will be carried out by the default
binding.

[rfeng] Remove OptimizableBinding as now it is not used any more

[rfeng] Remove OptimizableBinding as now it is not used any more

[rfeng] Rename ExtensibleDomainRegistry to ExtensibleDomainRegistryFactory

[rfeng] Rename ExtensibleDomainRegistry to ExtensibleDomainRegistryFactory

[rfeng] Rename ExtensibleDomainRegistry to ExtensibleDomainRegistryFactory

[rfeng] Rename ExtensibleDomainRegistry to ExtensibleDomainRegistryFactory

[rfeng] Rename ExtensibleDomainRegistry to ExtensibleDomainRegistryFactory

[rfeng] Remove getDomainName

[rfeng] Remove getDomainName

[rfeng] Remove org.apache.tuscany.sca.node.Client and merge the methods into org.apache.tuscany.sca.node.Node

[rfeng] Remove org.apache.tuscany.sca.node.Client and merge the methods into org.apache.tuscany.sca.node.Node

[rfeng] Remove the calls to Node.destroy

[rfeng] Start to clean up the node-api (remove Node.destroy())

[rfeng] Start to clean up the node-api (remove Node.destroy())

[rfeng] Start to clean up the node-api (remove Node.destroy())

[rfeng] Start to clean up the node-api (remove Node.destroy())

[rfeng] Start to clean up the node-api (remove Node.destroy())

[rfeng] Fix the bundle-version attr for Fragment-Host

[rfeng] Remove unused code

[rfeng] Remove unused code

------------------------------------------
[...truncated 4450 lines...]
21 org.apache.tuscany.sca.extensibility.equinox ACTIVE reference:file:/<http://hudson.zones.apache.org/hudson/job/Tuscany-SCA-J-CAA/ws/scajcaa/extensibility-equinox/target/tuscany-extensibility-equinox-2.0-SNAPSHOT.jar>
22 org.apache.tuscany.sca.node.impl RESOLVED reference:file:/<http://hudson.zones.apache.org/hudson/job/Tuscany-SCA-J-CAA/ws/scajcaa/node-impl/target/tuscany-node-impl-2.0-SNAPSHOT.jar>
23 org.apache.tuscany.sca.binding.sca.runtime RESOLVED reference:file:/<http://hudson.zones.apache.org/hudson/job/Tuscany-SCA-J-CAA/ws/scajcaa/binding-sca-runtime/target/tuscany-binding-sca-runtime-2.0-SNAPSHOT.jar>
24 org.apache.tuscany.sca.xsd RESOLVED reference:file:/<http://hudson.zones.apache.org/hudson/job/Tuscany-SCA-J-CAA/ws/scajcaa/xsd/target/tuscany-xsd-2.0-SNAPSHOT.jar>
25 org.apache.tuscany.sca.contribution RESOLVED reference:file:/<http://hudson.zones.apache.org/hudson/job/Tuscany-SCA-J-CAA/ws/scajcaa/contribution/target/tuscany-contribution-2.0-SNAPSHOT.jar>
26 org.apache.tuscany.sca.assembly RESOLVED reference:file:/<http://hudson.zones.apache.org/hudson/job/Tuscany-SCA-J-CAA/ws/scajcaa/assembly/target/tuscany-assembly-2.0-SNAPSHOT.jar>
27 org.apache.tuscany.sca.builder RESOLVED reference:file:/<http://hudson.zones.apache.org/hudson/job/Tuscany-SCA-J-CAA/ws/scajcaa/builder/target/tuscany-builder-2.0-SNAPSHOT.jar>
28 org.apache.tuscany.sca.assembly.xsd RESOLVED reference:file:/<http://hudson.zones.apache.org/hudson/job/Tuscany-SCA-J-CAA/ws/scajcaa/assembly-xsd/target/tuscany-assembly-xsd-2.0-SNAPSHOT.jar>
29 org.apache.tuscany.sca.implementation.java.runtime RESOLVED reference:file:/<http://hudson.zones.apache.org/hudson/job/Tuscany-SCA-J-CAA/ws/scajcaa/implementation-java-runtime/target/tuscany-implementation-java-runtime-2.0-SNAPSHOT.jar>
30 org.apache.tuscany.sca.core.spi RESOLVED reference:file:/<http://hudson.zones.apache.org/hudson/job/Tuscany-SCA-J-CAA/ws/scajcaa/core-spi/target/tuscany-core-spi-2.0-SNAPSHOT.jar>
31 org.apache.tuscany.sca.databinding.jaxb RESOLVED reference:file:/<http://hudson.zones.apache.org/hudson/job/Tuscany-SCA-J-CAA/ws/scajcaa/databinding-jaxb/target/tuscany-databinding-jaxb-2.0-SNAPSHOT.jar>
32 org.apache.tuscany.sca.monitor RESOLVED reference:file:/<http://hudson.zones.apache.org/hudson/job/Tuscany-SCA-J-CAA/ws/scajcaa/monitor/target/tuscany-monitor-2.0-SNAPSHOT.jar>
33 org.apache.ws.commons.schema RESOLVED reference:file://home/hudson/.m2/repository/org/apache/ws/commons/schema/XmlSchema/1.4.3/XmlSchema-1.4.3.jar
34 org.apache.geronimo.specs.geronimo-stax-api_1.0_spec RESOLVED reference:file://home/hudson/.m2/repository/org/apache/geronimo/specs/geronimo-stax-api_1.0_spec/1.0.1/geronimo-stax-api_1.0_spec-1.0.1.jar
35 org.apache.tuscany.sca.api RESOLVED reference:file:/<http://hudson.zones.apache.org/hudson/job/Tuscany-SCA-J-CAA/ws/scajcaa/sca-api/target/tuscany-sca-api-2.0-SNAPSHOT.jar>
36 org.apache.tuscany.sca.interface.java.jaxws RESOLVED reference:file:/<http://hudson.zones.apache.org/hudson/job/Tuscany-SCA-J-CAA/ws/scajcaa/interface-java-jaxws/target/tuscany-interface-java-jaxws-2.0-SNAPSHOT.jar>
37 org.apache.tuscany.sca.deployment RESOLVED reference:file:/<http://hudson.zones.apache.org/hudson/job/Tuscany-SCA-J-CAA/ws/scajcaa/deployment/target/tuscany-deployment-2.0-SNAPSHOT.jar>
38 org.apache.tuscany.sca.assembly.xml RESOLVED reference:file:/<http://hudson.zones.apache.org/hudson/job/Tuscany-SCA-J-CAA/ws/scajcaa/assembly-xml/target/tuscany-assembly-xml-2.0-SNAPSHOT.jar>
39 org.apache.tuscany.sca.common.java RESOLVED reference:file:/<http://hudson.zones.apache.org/hudson/job/Tuscany-SCA-J-CAA/ws/scajcaa/common-java/target/tuscany-common-java-2.0-SNAPSHOT.jar>
40 org.apache.commons.cli RESOLVED reference:file://home/hudson/.m2/repository/commons-cli/commons-cli/1.2/commons-cli-1.2.jar
41 org.apache.tuscany.sca.core.databinding RESOLVED reference:file:/<http://hudson.zones.apache.org/hudson/job/Tuscany-SCA-J-CAA/ws/scajcaa/core-databinding/target/tuscany-core-databinding-2.0-SNAPSHOT.jar>
42 org.apache.tuscany.sca.common.xml RESOLVED reference:file:/<http://hudson.zones.apache.org/hudson/job/Tuscany-SCA-J-CAA/ws/scajcaa/common-xml/target/tuscany-common-xml-2.0-SNAPSHOT.jar>
43 org.apache.tuscany.sca.node.api RESOLVED reference:file:/<http://hudson.zones.apache.org/hudson/job/Tuscany-SCA-J-CAA/ws/scajcaa/node-api/target/tuscany-node-api-2.0-SNAPSHOT.jar>
44 org.apache.tuscany.sca.implementation.java RESOLVED reference:file:/<http://hudson.zones.apache.org/hudson/job/Tuscany-SCA-J-CAA/ws/scajcaa/implementation-java/target/tuscany-implementation-java-2.0-SNAPSHOT.jar>
Running org.apache.tuscany.sca.node.equinox.launcher.NodeLauncherTestCase
Tests run: 2, Failures: 0, Errors: 1, Skipped: 1, Time elapsed: 0.011 sec <<< FAILURE!
testLaunch(org.apache.tuscany.sca.node.equinox.launcher.NodeLauncherTestCase)  Time elapsed:
0.004 sec  <<< ERROR!
java.lang.IllegalStateException: java.lang.IllegalStateException: java.lang.reflect.InvocationTargetException
	at org.apache.tuscany.sca.node.impl.NodeImpl.start(NodeImpl.java:169)
	at sun.reflect.NativeMethodAccessorImpl.invoke0(Native Method)
	at sun.reflect.NativeMethodAccessorImpl.invoke(NativeMethodAccessorImpl.java:39)
	at sun.reflect.DelegatingMethodAccessorImpl.invoke(DelegatingMethodAccessorImpl.java:25)
	at java.lang.reflect.Method.invoke(Method.java:597)
	at org.apache.tuscany.sca.node.NodeFactory$NodeProxy.start(NodeFactory.java:110)
	at org.apache.tuscany.sca.node.equinox.launcher.NodeLauncherTestCase.testLaunch(NodeLauncherTestCase.java:57)
	at sun.reflect.NativeMethodAccessorImpl.invoke0(Native Method)
	at sun.reflect.NativeMethodAccessorImpl.invoke(NativeMethodAccessorImpl.java:39)
	at sun.reflect.DelegatingMethodAccessorImpl.invoke(DelegatingMethodAccessorImpl.java:25)
	at java.lang.reflect.Method.invoke(Method.java:597)
	at org.junit.runners.model.FrameworkMethod$1.runReflectiveCall(FrameworkMethod.java:44)
	at org.junit.internal.runners.model.ReflectiveCallable.run(ReflectiveCallable.java:15)
	at org.junit.runners.model.FrameworkMethod.invokeExplosively(FrameworkMethod.java:41)
	at org.junit.internal.runners.statements.InvokeMethod.evaluate(InvokeMethod.java:20)
	at org.junit.runners.BlockJUnit4ClassRunner.runChild(BlockJUnit4ClassRunner.java:76)
	at org.junit.runners.BlockJUnit4ClassRunner.runChild(BlockJUnit4ClassRunner.java:50)
	at org.junit.runners.ParentRunner$3.run(ParentRunner.java:193)
	at org.junit.runners.ParentRunner$1.schedule(ParentRunner.java:52)
	at org.junit.runners.ParentRunner.runChildren(ParentRunner.java:191)
	at org.junit.runners.ParentRunner.access$000(ParentRunner.java:42)
	at org.junit.runners.ParentRunner$2.evaluate(ParentRunner.java:184)
	at org.junit.internal.runners.statements.RunBefores.evaluate(RunBefores.java:28)
	at org.junit.internal.runners.statements.RunAfters.evaluate(RunAfters.java:31)
	at org.junit.runners.ParentRunner.run(ParentRunner.java:236)
	at org.junit.runners.Suite.runChild(Suite.java:128)
	at org.junit.runners.Suite.runChild(Suite.java:24)
	at org.junit.runners.ParentRunner$3.run(ParentRunner.java:193)
	at org.junit.runners.ParentRunner$1.schedule(ParentRunner.java:52)
	at org.junit.runners.ParentRunner.runChildren(ParentRunner.java:191)
	at org.junit.runners.ParentRunner.access$000(ParentRunner.java:42)
	at org.junit.runners.ParentRunner$2.evaluate(ParentRunner.java:184)
	at org.junit.runners.ParentRunner.run(ParentRunner.java:236)
	at org.junit.runner.JUnitCore.run(JUnitCore.java:157)
	at org.junit.runner.JUnitCore.run(JUnitCore.java:136)
	at org.junit.runner.JUnitCore.run(JUnitCore.java:127)
	at org.apache.maven.surefire.junitcore.JUnitCoreTestSet.runJunitCore(JUnitCoreTestSet.java:180)
	at org.apache.maven.surefire.junitcore.JUnitCoreTestSet.execute(JUnitCoreTestSet.java:86)
	at org.apache.maven.surefire.junitcore.JUnitCoreDirectoryTestSuite.execute(JUnitCoreDirectoryTestSuite.java:58)
	at org.apache.maven.surefire.Surefire.run(Surefire.java:180)
	at sun.reflect.NativeMethodAccessorImpl.invoke0(Native Method)
	at sun.reflect.NativeMethodAccessorImpl.invoke(NativeMethodAccessorImpl.java:39)
	at sun.reflect.DelegatingMethodAccessorImpl.invoke(DelegatingMethodAccessorImpl.java:25)
	at java.lang.reflect.Method.invoke(Method.java:597)
	at org.apache.maven.surefire.booter.SurefireBooter.runSuitesInProcess(SurefireBooter.java:350)
	at org.apache.maven.surefire.booter.SurefireBooter.main(SurefireBooter.java:1021)
Caused by: java.lang.IllegalStateException: java.lang.reflect.InvocationTargetException
	at org.apache.tuscany.sca.assembly.builder.DefaultBuilderExtensionPoint$LazyCompositeBuilder.getBuilder(DefaultBuilderExtensionPoint.java:257)
	at org.apache.tuscany.sca.assembly.builder.DefaultBuilderExtensionPoint$LazyCompositeBuilder.build(DefaultBuilderExtensionPoint.java:232)
	at org.apache.tuscany.sca.deployment.impl.DeployerImpl.build(DeployerImpl.java:484)
	at org.apache.tuscany.sca.node.impl.NodeFactoryImpl.configureNode(NodeFactoryImpl.java:287)
	at org.apache.tuscany.sca.node.impl.NodeImpl.start(NodeImpl.java:128)
	... 45 more
Caused by: java.lang.reflect.InvocationTargetException
	at sun.reflect.NativeConstructorAccessorImpl.newInstance0(Native Method)
	at sun.reflect.NativeConstructorAccessorImpl.newInstance(NativeConstructorAccessorImpl.java:39)
	at sun.reflect.DelegatingConstructorAccessorImpl.newInstance(DelegatingConstructorAccessorImpl.java:27)
	at java.lang.reflect.Constructor.newInstance(Constructor.java:513)
	at org.apache.tuscany.sca.assembly.builder.DefaultBuilderExtensionPoint$LazyCompositeBuilder.getBuilder(DefaultBuilderExtensionPoint.java:253)
	... 49 more
Caused by: java.lang.NoClassDefFoundError: org/oasisopen/sca/ServiceRuntimeException
	at org.apache.tuscany.sca.builder.impl.ModelBuilderImpl.<init>(ModelBuilderImpl.java:78)
	... 54 more
Caused by: java.lang.ClassNotFoundException: org.oasisopen.sca.ServiceRuntimeException
	at org.eclipse.osgi.internal.loader.BundleLoader.findClassInternal(BundleLoader.java:489)
	at org.eclipse.osgi.internal.loader.BundleLoader.findClass(BundleLoader.java:405)
	at org.eclipse.osgi.internal.loader.BundleLoader.findClass(BundleLoader.java:393)
	at org.eclipse.osgi.internal.baseadaptor.DefaultClassLoader.loadClass(DefaultClassLoader.java:105)
	at java.lang.ClassLoader.loadClass(ClassLoader.java:248)
	at java.lang.ClassLoader.loadClassInternal(ClassLoader.java:316)
	... 55 more

Running org.apache.tuscany.sca.node.equinox.launcher.EquinoxOSGiHostTestCase
Tests run: 2, Failures: 0, Errors: 0, Skipped: 0, Time elapsed: 0.004 sec

Results :

Tests in error: 
  testLaunch(org.apache.tuscany.sca.node.equinox.launcher.NodeLauncherTestCase)

Tests run: 4, Failures: 0, Errors: 1, Skipped: 1

[ERROR] There are test failures.

Please refer to <http://hudson.zones.apache.org/hudson/job/Tuscany-SCA-J-CAA/ws/scajcaa/node-launcher-equinox/target/surefire-reports>
for the individual test results.
[HUDSON] Recording test results
[INFO] [jar:jar {execution: default-jar}]
[INFO] Building jar: <http://hudson.zones.apache.org/hudson/job/Tuscany-SCA-J-CAA/ws/scajcaa/node-launcher-equinox/target/tuscany-node-launcher-equinox-2.0-SNAPSHOT.jar>
[INFO] [install:install {execution: default-install}]
[INFO] Installing <http://hudson.zones.apache.org/hudson/job/Tuscany-SCA-J-CAA/ws/scajcaa/node-launcher-equinox/target/tuscany-node-launcher-equinox-2.0-SNAPSHOT.jar>
to /home/hudson/.m2/repository/org/apache/tuscany/sca/tuscany-node-launcher-equinox/2.0-SNAPSHOT/tuscany-node-launcher-equinox-2.0-SNAPSHOT.jar
[HUDSON] Archiving <http://hudson.zones.apache.org/hudson/job/Tuscany-SCA-J-CAA/ws/scajcaa/node-launcher-equinox/pom.xml>
to /export/home/hudson/hudson/jobs/Tuscany-SCA-J-CAA/modules/org.apache.tuscany.sca$tuscany-node-launcher-equinox/builds/2010-02-11_00-23-47/archive/org.apache.tuscany.sca/tuscany-node-launcher-equinox/2.0-SNAPSHOT/pom.xml
[HUDSON] Archiving <http://hudson.zones.apache.org/hudson/job/Tuscany-SCA-J-CAA/ws/scajcaa/node-launcher-equinox/target/tuscany-node-launcher-equinox-2.0-SNAPSHOT.jar>
to /export/home/hudson/hudson/jobs/Tuscany-SCA-J-CAA/modules/org.apache.tuscany.sca$tuscany-node-launcher-equinox/builds/2010-02-11_00-23-47/archive/org.apache.tuscany.sca/tuscany-node-launcher-equinox/2.0-SNAPSHOT/tuscany-node-launcher-equinox-2.0-SNAPSHOT.jar
[INFO] ------------------------------------------------------------------------
[INFO] Building Apache Tuscany SCA Policy Security Model
[INFO]    task-segment: [clean, install]
[INFO] ------------------------------------------------------------------------
[INFO] [clean:clean {execution: default-clean}]
[INFO] Deleting file set: <http://hudson.zones.apache.org/hudson/job/Tuscany-SCA-J-CAA/ws/scajcaa/policy-security/target>
(included: [**], excluded: [])
[INFO] [enforcer:enforce {execution: enforce-plugin-versions}]
[INFO] [resources:resources {execution: default-resources}]
[WARNING] Using platform encoding (UTF-8 actually) to copy filtered resources, i.e. build
is platform dependent!
[INFO] Copying 6 resources
[INFO] Copying 3 resources
[INFO] [compiler:compile {execution: default-compile}]
[INFO] Invoking Tuscany Eclipse JDT compiler
[INFO] Compiling 23 to <http://hudson.zones.apache.org/hudson/job/Tuscany-SCA-J-CAA/ws/scajcaa/policy-security/target/classes>
[INFO] Resolving OSGi bundle: org.apache.tuscany.sca.policy.security
[INFO] OSGi bundle is resolved: org.apache.tuscany.sca.policy.security
[INFO] [resources:testResources {execution: default-testResources}]
[WARNING] Using platform encoding (UTF-8 actually) to copy filtered resources, i.e. build
is platform dependent!
[INFO] Copying 1 resource
[INFO] [compiler:testCompile {execution: default-testCompile}]
[INFO] Invoking Tuscany Eclipse JDT compiler
[INFO] Compiling 1 to <http://hudson.zones.apache.org/hudson/job/Tuscany-SCA-J-CAA/ws/scajcaa/policy-security/target/test-classes>
[INFO] [surefire:test {execution: default-test}]
[INFO] Surefire report directory: <http://hudson.zones.apache.org/hudson/job/Tuscany-SCA-J-CAA/ws/scajcaa/policy-security/target/surefire-reports>

-------------------------------------------------------
 T E S T S
-------------------------------------------------------
Running org.apache.tuscany.sca.policy.security.PolicyProcessorTestCase
Tests run: 1, Failures: 0, Errors: 0, Skipped: 0, Time elapsed: 0.106 sec

Results :

Tests run: 1, Failures: 0, Errors: 0, Skipped: 0

[HUDSON] Recording test results
[INFO] [jar:jar {execution: default-jar}]
[INFO] Building jar: <http://hudson.zones.apache.org/hudson/job/Tuscany-SCA-J-CAA/ws/scajcaa/policy-security/target/tuscany-policy-security-2.0-SNAPSHOT.jar>
[INFO] [install:install {execution: default-install}]
[INFO] Installing <http://hudson.zones.apache.org/hudson/job/Tuscany-SCA-J-CAA/ws/scajcaa/policy-security/target/tuscany-policy-security-2.0-SNAPSHOT.jar>
to /home/hudson/.m2/repository/org/apache/tuscany/sca/tuscany-policy-security/2.0-SNAPSHOT/tuscany-policy-security-2.0-SNAPSHOT.jar
[HUDSON] Archiving <http://hudson.zones.apache.org/hudson/job/Tuscany-SCA-J-CAA/ws/scajcaa/policy-security/pom.xml>
to /export/home/hudson/hudson/jobs/Tuscany-SCA-J-CAA/modules/org.apache.tuscany.sca$tuscany-policy-security/builds/2010-02-11_00-23-47/archive/org.apache.tuscany.sca/tuscany-policy-security/2.0-SNAPSHOT/pom.xml
[HUDSON] Archiving <http://hudson.zones.apache.org/hudson/job/Tuscany-SCA-J-CAA/ws/scajcaa/policy-security/target/tuscany-policy-security-2.0-SNAPSHOT.jar>
to /export/home/hudson/hudson/jobs/Tuscany-SCA-J-CAA/modules/org.apache.tuscany.sca$tuscany-policy-security/builds/2010-02-11_00-23-47/archive/org.apache.tuscany.sca/tuscany-policy-security/2.0-SNAPSHOT/tuscany-policy-security-2.0-SNAPSHOT.jar
[INFO] ------------------------------------------------------------------------
[INFO] Building Apache Tuscany SCA Policy XML WS Model
[INFO]    task-segment: [clean, install]
[INFO] ------------------------------------------------------------------------
[INFO] [clean:clean {execution: default-clean}]
[INFO] Deleting file set: <http://hudson.zones.apache.org/hudson/job/Tuscany-SCA-J-CAA/ws/scajcaa/policy-xml-ws/target>
(included: [**], excluded: [])
[INFO] [enforcer:enforce {execution: enforce-plugin-versions}]
[INFO] [resources:resources {execution: default-resources}]
[WARNING] Using platform encoding (UTF-8 actually) to copy filtered resources, i.e. build
is platform dependent!
[INFO] Copying 1 resource
[INFO] Copying 3 resources
[INFO] [compiler:compile {execution: default-compile}]
[INFO] Invoking Tuscany Eclipse JDT compiler
[INFO] Compiling 1 to <http://hudson.zones.apache.org/hudson/job/Tuscany-SCA-J-CAA/ws/scajcaa/policy-xml-ws/target/classes>
[INFO] Resolving OSGi bundle: org.apache.tuscany.sca.policy.xml.ws
[ERROR] --> [org.apache.tuscany.sca.policy.xml.ws] Missing Constraint: Import-Package:
org.apache.axiom.om; version="0.0.0"
[ERROR] --> [org.apache.ws.commons.axiom.axiom-api] Bundle unresolved: Export-Package:
org.apache.axiom.om; version="0.0.0"
[ERROR] ----> [org.apache.ws.commons.axiom.axiom-api] Missing Constraint: Import-Package:
org.apache.commons.logging; version="0.0.0"
[INFO] [resources:testResources {execution: default-testResources}]
[WARNING] Using platform encoding (UTF-8 actually) to copy filtered resources, i.e. build
is platform dependent!
[INFO] Copying 1 resource
[INFO] [compiler:testCompile {execution: default-testCompile}]
[INFO] Invoking Tuscany Eclipse JDT compiler
[INFO] Compiling 3 to <http://hudson.zones.apache.org/hudson/job/Tuscany-SCA-J-CAA/ws/scajcaa/policy-xml-ws/target/test-classes>
[INFO] [surefire:test {execution: default-test}]
[INFO] Surefire report directory: <http://hudson.zones.apache.org/hudson/job/Tuscany-SCA-J-CAA/ws/scajcaa/policy-xml-ws/target/surefire-reports>

-------------------------------------------------------
 T E S T S
-------------------------------------------------------
Running org.apache.tuscany.sca.policy.xml.ws.WSPolicyProcessorTestCase
Tests run: 1, Failures: 0, Errors: 0, Skipped: 0, Time elapsed: 0.195 sec

Results :

Tests run: 1, Failures: 0, Errors: 0, Skipped: 0

[HUDSON] Recording test results
[INFO] [jar:jar {execution: default-jar}]
[INFO] Building jar: <http://hudson.zones.apache.org/hudson/job/Tuscany-SCA-J-CAA/ws/scajcaa/policy-xml-ws/target/tuscany-policy-xml-ws-2.0-SNAPSHOT.jar>
[INFO] [install:install {execution: default-install}]
[INFO] Installing <http://hudson.zones.apache.org/hudson/job/Tuscany-SCA-J-CAA/ws/scajcaa/policy-xml-ws/target/tuscany-policy-xml-ws-2.0-SNAPSHOT.jar>
to /home/hudson/.m2/repository/org/apache/tuscany/sca/tuscany-policy-xml-ws/2.0-SNAPSHOT/tuscany-policy-xml-ws-2.0-SNAPSHOT.jar
[HUDSON] Archiving <http://hudson.zones.apache.org/hudson/job/Tuscany-SCA-J-CAA/ws/scajcaa/policy-xml-ws/pom.xml>
to /export/home/hudson/hudson/jobs/Tuscany-SCA-J-CAA/modules/org.apache.tuscany.sca$tuscany-policy-xml-ws/builds/2010-02-11_00-23-47/archive/org.apache.tuscany.sca/tuscany-policy-xml-ws/2.0-SNAPSHOT/pom.xml
[HUDSON] Archiving <http://hudson.zones.apache.org/hudson/job/Tuscany-SCA-J-CAA/ws/scajcaa/policy-xml-ws/target/tuscany-policy-xml-ws-2.0-SNAPSHOT.jar>
to /export/home/hudson/hudson/jobs/Tuscany-SCA-J-CAA/modules/org.apache.tuscany.sca$tuscany-policy-xml-ws/builds/2010-02-11_00-23-47/archive/org.apache.tuscany.sca/tuscany-policy-xml-ws/2.0-SNAPSHOT/tuscany-policy-xml-ws-2.0-SNAPSHOT.jar
[INFO] ------------------------------------------------------------------------
[INFO] Building OASIS SCA Assembly TestCase Suite (1.1) Modules
[INFO]    task-segment: [clean, install]
[INFO] ------------------------------------------------------------------------
[INFO] [clean:clean {execution: default-clean}]
[INFO] [site:attach-descriptor {execution: default-attach-descriptor}]
[INFO] [install:install {execution: default-install}]
[INFO] Installing <http://hudson.zones.apache.org/hudson/job/Tuscany-SCA-J-CAA/ws/scajcaa/sca-assembly/pom.xml>
to /home/hudson/.m2/repository/org/oasis-open/sca/assembly/assembly-modules/1.0/assembly-modules-1.0.pom
[HUDSON] Archiving <http://hudson.zones.apache.org/hudson/job/Tuscany-SCA-J-CAA/ws/scajcaa/sca-assembly/pom.xml>
to /export/home/hudson/hudson/jobs/Tuscany-SCA-J-CAA/modules/org.oasis-open.sca.assembly$assembly-modules/builds/2010-02-11_00-23-48/archive/org.oasis-open.sca.assembly/assembly-modules/1.0/pom.xml
[HUDSON] Archiving /home/hudson/.m2/repository/org/oasis-open/sca/assembly/assembly-modules/1.0/assembly-modules-1.0.pom
to /export/home/hudson/hudson/jobs/Tuscany-SCA-J-CAA/modules/org.oasis-open.sca.assembly$assembly-modules/builds/2010-02-11_00-23-48/archive/org.oasis-open.sca.assembly/assembly-modules/1.0/assembly-modules-1.0.pom
[INFO] ------------------------------------------------------------------------
[INFO] Building OASIS Assembly TestCases - Test Client
[INFO]    task-segment: [clean, install]
[INFO] ------------------------------------------------------------------------
[INFO] [clean:clean {execution: default-clean}]
[INFO] Deleting directory <http://hudson.zones.apache.org/hudson/job/Tuscany-SCA-J-CAA/ws/scajcaa/sca-assembly/Test_Client/target>
[INFO] [resources:resources {execution: default-resources}]
[WARNING] Using platform encoding (UTF-8 actually) to copy filtered resources, i.e. build
is platform dependent!
[INFO] Copying 8 resources
[INFO] Copying 1 resource
[INFO] [compiler:compile {execution: default-compile}]
[INFO] Compiling 145 source files to <http://hudson.zones.apache.org/hudson/job/Tuscany-SCA-J-CAA/ws/scajcaa/sca-assembly/Test_Client/target/classes>
[HUDSON] Archiving <http://hudson.zones.apache.org/hudson/job/Tuscany-SCA-J-CAA/ws/scajcaa/sca-assembly/Test_Client/pom.xml>
to /export/home/hudson/hudson/jobs/Tuscany-SCA-J-CAA/modules/org.oasis-open.sca.assembly$Test_Client/builds/2010-02-11_00-23-48/archive/org.oasis-open.sca.assembly/Test_Client/1.0/pom.xml
[INFO] ------------------------------------------------------------------------
[ERROR] BUILD FAILURE
[INFO] ------------------------------------------------------------------------
[INFO] Compilation failure
<http://hudson.zones.apache.org/hudson/job/Tuscany-SCA-J-CAA/ws/scajcaa/sca-assembly/Test_Client/src/main/java/client/TuscanyRuntimeBridge.java>:[126,16]
cannot find symbol
symbol  : method destroy()
location: interface org.apache.tuscany.sca.node.Node


[INFO] ------------------------------------------------------------------------
[INFO] For more information, run Maven with the -e switch
[INFO] ------------------------------------------------------------------------
[INFO] Total time: 3 minutes 54 seconds
[INFO] Finished at: Thu Feb 11 00:27:56 UTC 2010
[INFO] Final Memory: 58M/748M
[INFO] ------------------------------------------------------------------------
Waiting for Hudson to finish collecting data
Sending e-mails to: commits@tuscany.apache.org
Sending e-mails to: commits@tuscany.apache.org
channel stopped


Mime
View raw message