tuscany-commits mailing list archives

Site index · List index
Message view « Date » · « Thread »
Top « Date » · « Thread »
From Apache Hudson Server <hud...@hudson.zones.apache.org>
Subject Build failed in Hudson: Tuscany-SCA-J-CAA #129
Date Fri, 19 Feb 2010 00:20:57 GMT
See <http://hudson.zones.apache.org/hudson/job/Tuscany-SCA-J-CAA/129/>

------------------------------------------
[...truncated 4357 lines...]
29 org.apache.tuscany.sca.implementation.java.runtime RESOLVED reference:file:/<http://hudson.zones.apache.org/hudson/job/Tuscany-SCA-J-CAA/ws/scajcaa/implementation-java-runtime/target/tuscany-implementation-java-runtime-2.0-SNAPSHOT.jar>
30 org.apache.tuscany.sca.core.spi RESOLVED reference:file:/<http://hudson.zones.apache.org/hudson/job/Tuscany-SCA-J-CAA/ws/scajcaa/core-spi/target/tuscany-core-spi-2.0-SNAPSHOT.jar>
31 org.apache.tuscany.sca.databinding.jaxb RESOLVED reference:file:/<http://hudson.zones.apache.org/hudson/job/Tuscany-SCA-J-CAA/ws/scajcaa/databinding-jaxb/target/tuscany-databinding-jaxb-2.0-SNAPSHOT.jar>
32 org.apache.tuscany.sca.monitor RESOLVED reference:file:/<http://hudson.zones.apache.org/hudson/job/Tuscany-SCA-J-CAA/ws/scajcaa/monitor/target/tuscany-monitor-2.0-SNAPSHOT.jar>
33 org.apache.ws.commons.schema RESOLVED reference:file://home/hudson/.m2/repository/org/apache/ws/commons/schema/XmlSchema/1.4.3/XmlSchema-1.4.3.jar
34 org.apache.geronimo.specs.geronimo-stax-api_1.0_spec RESOLVED reference:file://home/hudson/.m2/repository/org/apache/geronimo/specs/geronimo-stax-api_1.0_spec/1.0.1/geronimo-stax-api_1.0_spec-1.0.1.jar
35 org.apache.tuscany.sca.api RESOLVED reference:file:/<http://hudson.zones.apache.org/hudson/job/Tuscany-SCA-J-CAA/ws/scajcaa/sca-api/target/tuscany-sca-api-2.0-SNAPSHOT.jar>
36 org.apache.tuscany.sca.interface.java.jaxws RESOLVED reference:file:/<http://hudson.zones.apache.org/hudson/job/Tuscany-SCA-J-CAA/ws/scajcaa/interface-java-jaxws/target/tuscany-interface-java-jaxws-2.0-SNAPSHOT.jar>
37 org.apache.tuscany.sca.deployment RESOLVED reference:file:/<http://hudson.zones.apache.org/hudson/job/Tuscany-SCA-J-CAA/ws/scajcaa/deployment/target/tuscany-deployment-2.0-SNAPSHOT.jar>
38 org.apache.tuscany.sca.assembly.xml RESOLVED reference:file:/<http://hudson.zones.apache.org/hudson/job/Tuscany-SCA-J-CAA/ws/scajcaa/assembly-xml/target/tuscany-assembly-xml-2.0-SNAPSHOT.jar>
39 org.apache.tuscany.sca.common.java RESOLVED reference:file:/<http://hudson.zones.apache.org/hudson/job/Tuscany-SCA-J-CAA/ws/scajcaa/common-java/target/tuscany-common-java-2.0-SNAPSHOT.jar>
40 org.apache.commons.cli RESOLVED reference:file://home/hudson/.m2/repository/commons-cli/commons-cli/1.2/commons-cli-1.2.jar
41 org.apache.tuscany.sca.core.databinding RESOLVED reference:file:/<http://hudson.zones.apache.org/hudson/job/Tuscany-SCA-J-CAA/ws/scajcaa/core-databinding/target/tuscany-core-databinding-2.0-SNAPSHOT.jar>
42 org.apache.tuscany.sca.common.xml RESOLVED reference:file:/<http://hudson.zones.apache.org/hudson/job/Tuscany-SCA-J-CAA/ws/scajcaa/common-xml/target/tuscany-common-xml-2.0-SNAPSHOT.jar>
43 org.apache.tuscany.sca.node.api RESOLVED reference:file:/<http://hudson.zones.apache.org/hudson/job/Tuscany-SCA-J-CAA/ws/scajcaa/node-api/target/tuscany-node-api-2.0-SNAPSHOT.jar>
44 org.apache.tuscany.sca.implementation.java RESOLVED reference:file:/<http://hudson.zones.apache.org/hudson/job/Tuscany-SCA-J-CAA/ws/scajcaa/implementation-java/target/tuscany-implementation-java-2.0-SNAPSHOT.jar>
0 org.eclipse.osgi ACTIVE System Bundle
1 org.apache.tuscany.sca.node.launcher.equinox ACTIVE <http://hudson.zones.apache.org/hudson/job/Tuscany-SCA-J-CAA/ws/scajcaa/node-launcher-equinox/target/classes/>
2 org.apache.tuscany.sca.node.launcher.equinox.libraries.jaxb-api RESOLVED org.apache.tuscany.sca.node.launcher.equinox.libraries.jaxb-api
3 org.apache.tuscany.sca.node.launcher.equinox.libraries.activation RESOLVED org.apache.tuscany.sca.node.launcher.equinox.libraries.activation
4 org.apache.tuscany.sca.node.launcher.equinox.libraries.surefirebooter7496509516769799044
RESOLVED org.apache.tuscany.sca.node.launcher.equinox.libraries.surefirebooter7496509516769799044
5 org.apache.tuscany.sca.node.launcher.equinox.libraries.servlet-api RESOLVED org.apache.tuscany.sca.node.launcher.equinox.libraries.servlet-api
6 org.apache.tuscany.sca.node.launcher.equinox.libraries.jsr181-api RESOLVED org.apache.tuscany.sca.node.launcher.equinox.libraries.jsr181-api
7 org.apache.tuscany.sca.node.launcher.equinox.libraries.wstx-asl RESOLVED org.apache.tuscany.sca.node.launcher.equinox.libraries.wstx-asl
8 org.apache.tuscany.sca.node.launcher.equinox.libraries.jaxws-api RESOLVED org.apache.tuscany.sca.node.launcher.equinox.libraries.jaxws-api
9 org.apache.tuscany.sca.node.launcher.equinox.libraries.junit RESOLVED org.apache.tuscany.sca.node.launcher.equinox.libraries.junit
10 org.apache.tuscany.sca.node.launcher.equinox.libraries.asm RESOLVED org.apache.tuscany.sca.node.launcher.equinox.libraries.asm
11 org.apache.tuscany.sca.node.launcher.equinox.libraries.surefire-booter RESOLVED org.apache.tuscany.sca.node.launcher.equinox.libraries.surefire-booter
12 org.apache.tuscany.sca.node.launcher.equinox.libraries.surefire-api RESOLVED org.apache.tuscany.sca.node.launcher.equinox.libraries.surefire-api
13 org.apache.tuscany.sca.node.launcher.equinox.libraries.cglib RESOLVED org.apache.tuscany.sca.node.launcher.equinox.libraries.cglib
14 org.apache.tuscany.sca.node.launcher.equinox.libraries.jaxb-impl RESOLVED org.apache.tuscany.sca.node.launcher.equinox.libraries.jaxb-impl
15 org.apache.tuscany.sca.node.launcher.equinox.libraries.jsr250-api RESOLVED org.apache.tuscany.sca.node.launcher.equinox.libraries.jsr250-api
16 org.apache.tuscany.sca.gateway STARTING org.apache.tuscany.sca.gateway
17 org.apache.tuscany.sca.core RESOLVED reference:file:/<http://hudson.zones.apache.org/hudson/job/Tuscany-SCA-J-CAA/ws/scajcaa/core/target/tuscany-core-2.0-SNAPSHOT.jar>
18 org.apache.tuscany.sca.interface.java RESOLVED reference:file:/<http://hudson.zones.apache.org/hudson/job/Tuscany-SCA-J-CAA/ws/scajcaa/interface-java/target/tuscany-interface-java-2.0-SNAPSHOT.jar>
19 org.apache.tuscany.sca.databinding RESOLVED reference:file:/<http://hudson.zones.apache.org/hudson/job/Tuscany-SCA-J-CAA/ws/scajcaa/databinding/target/tuscany-databinding-2.0-SNAPSHOT.jar>
20 org.apache.tuscany.sca.extensibility RESOLVED reference:file:/<http://hudson.zones.apache.org/hudson/job/Tuscany-SCA-J-CAA/ws/scajcaa/extensibility/target/tuscany-extensibility-2.0-SNAPSHOT.jar>
21 org.apache.tuscany.sca.extensibility.equinox ACTIVE reference:file:/<http://hudson.zones.apache.org/hudson/job/Tuscany-SCA-J-CAA/ws/scajcaa/extensibility-equinox/target/tuscany-extensibility-equinox-2.0-SNAPSHOT.jar>
22 org.apache.tuscany.sca.node.impl RESOLVED reference:file:/<http://hudson.zones.apache.org/hudson/job/Tuscany-SCA-J-CAA/ws/scajcaa/node-impl/target/tuscany-node-impl-2.0-SNAPSHOT.jar>
23 org.apache.tuscany.sca.binding.sca.runtime RESOLVED reference:file:/<http://hudson.zones.apache.org/hudson/job/Tuscany-SCA-J-CAA/ws/scajcaa/binding-sca-runtime/target/tuscany-binding-sca-runtime-2.0-SNAPSHOT.jar>
24 org.apache.tuscany.sca.xsd RESOLVED reference:file:/<http://hudson.zones.apache.org/hudson/job/Tuscany-SCA-J-CAA/ws/scajcaa/xsd/target/tuscany-xsd-2.0-SNAPSHOT.jar>
25 org.apache.tuscany.sca.contribution RESOLVED reference:file:/<http://hudson.zones.apache.org/hudson/job/Tuscany-SCA-J-CAA/ws/scajcaa/contribution/target/tuscany-contribution-2.0-SNAPSHOT.jar>
26 org.apache.tuscany.sca.assembly RESOLVED reference:file:/<http://hudson.zones.apache.org/hudson/job/Tuscany-SCA-J-CAA/ws/scajcaa/assembly/target/tuscany-assembly-2.0-SNAPSHOT.jar>
27 org.apache.tuscany.sca.builder RESOLVED reference:file:/<http://hudson.zones.apache.org/hudson/job/Tuscany-SCA-J-CAA/ws/scajcaa/builder/target/tuscany-builder-2.0-SNAPSHOT.jar>
28 org.apache.tuscany.sca.assembly.xsd RESOLVED reference:file:/<http://hudson.zones.apache.org/hudson/job/Tuscany-SCA-J-CAA/ws/scajcaa/assembly-xsd/target/tuscany-assembly-xsd-2.0-SNAPSHOT.jar>
29 org.apache.tuscany.sca.implementation.java.runtime RESOLVED reference:file:/<http://hudson.zones.apache.org/hudson/job/Tuscany-SCA-J-CAA/ws/scajcaa/implementation-java-runtime/target/tuscany-implementation-java-runtime-2.0-SNAPSHOT.jar>
30 org.apache.tuscany.sca.core.spi RESOLVED reference:file:/<http://hudson.zones.apache.org/hudson/job/Tuscany-SCA-J-CAA/ws/scajcaa/core-spi/target/tuscany-core-spi-2.0-SNAPSHOT.jar>
31 org.apache.tuscany.sca.databinding.jaxb RESOLVED reference:file:/<http://hudson.zones.apache.org/hudson/job/Tuscany-SCA-J-CAA/ws/scajcaa/databinding-jaxb/target/tuscany-databinding-jaxb-2.0-SNAPSHOT.jar>
32 org.apache.tuscany.sca.monitor RESOLVED reference:file:/<http://hudson.zones.apache.org/hudson/job/Tuscany-SCA-J-CAA/ws/scajcaa/monitor/target/tuscany-monitor-2.0-SNAPSHOT.jar>
33 org.apache.ws.commons.schema RESOLVED reference:file://home/hudson/.m2/repository/org/apache/ws/commons/schema/XmlSchema/1.4.3/XmlSchema-1.4.3.jar
34 org.apache.geronimo.specs.geronimo-stax-api_1.0_spec RESOLVED reference:file://home/hudson/.m2/repository/org/apache/geronimo/specs/geronimo-stax-api_1.0_spec/1.0.1/geronimo-stax-api_1.0_spec-1.0.1.jar
35 org.apache.tuscany.sca.api RESOLVED reference:file:/<http://hudson.zones.apache.org/hudson/job/Tuscany-SCA-J-CAA/ws/scajcaa/sca-api/target/tuscany-sca-api-2.0-SNAPSHOT.jar>
36 org.apache.tuscany.sca.interface.java.jaxws RESOLVED reference:file:/<http://hudson.zones.apache.org/hudson/job/Tuscany-SCA-J-CAA/ws/scajcaa/interface-java-jaxws/target/tuscany-interface-java-jaxws-2.0-SNAPSHOT.jar>
37 org.apache.tuscany.sca.deployment RESOLVED reference:file:/<http://hudson.zones.apache.org/hudson/job/Tuscany-SCA-J-CAA/ws/scajcaa/deployment/target/tuscany-deployment-2.0-SNAPSHOT.jar>
38 org.apache.tuscany.sca.assembly.xml RESOLVED reference:file:/<http://hudson.zones.apache.org/hudson/job/Tuscany-SCA-J-CAA/ws/scajcaa/assembly-xml/target/tuscany-assembly-xml-2.0-SNAPSHOT.jar>
39 org.apache.tuscany.sca.common.java RESOLVED reference:file:/<http://hudson.zones.apache.org/hudson/job/Tuscany-SCA-J-CAA/ws/scajcaa/common-java/target/tuscany-common-java-2.0-SNAPSHOT.jar>
40 org.apache.commons.cli RESOLVED reference:file://home/hudson/.m2/repository/commons-cli/commons-cli/1.2/commons-cli-1.2.jar
41 org.apache.tuscany.sca.core.databinding RESOLVED reference:file:/<http://hudson.zones.apache.org/hudson/job/Tuscany-SCA-J-CAA/ws/scajcaa/core-databinding/target/tuscany-core-databinding-2.0-SNAPSHOT.jar>
42 org.apache.tuscany.sca.common.xml RESOLVED reference:file:/<http://hudson.zones.apache.org/hudson/job/Tuscany-SCA-J-CAA/ws/scajcaa/common-xml/target/tuscany-common-xml-2.0-SNAPSHOT.jar>
43 org.apache.tuscany.sca.node.api RESOLVED reference:file:/<http://hudson.zones.apache.org/hudson/job/Tuscany-SCA-J-CAA/ws/scajcaa/node-api/target/tuscany-node-api-2.0-SNAPSHOT.jar>
44 org.apache.tuscany.sca.implementation.java RESOLVED reference:file:/<http://hudson.zones.apache.org/hudson/job/Tuscany-SCA-J-CAA/ws/scajcaa/implementation-java/target/tuscany-implementation-java-2.0-SNAPSHOT.jar>
0 org.eclipse.osgi ACTIVE System Bundle
1 org.apache.tuscany.sca.node.launcher.equinox ACTIVE <http://hudson.zones.apache.org/hudson/job/Tuscany-SCA-J-CAA/ws/scajcaa/node-launcher-equinox/target/classes/>
2 org.apache.tuscany.sca.node.launcher.equinox.libraries.jaxb-api RESOLVED org.apache.tuscany.sca.node.launcher.equinox.libraries.jaxb-api
3 org.apache.tuscany.sca.node.launcher.equinox.libraries.activation RESOLVED org.apache.tuscany.sca.node.launcher.equinox.libraries.activation
4 org.apache.tuscany.sca.node.launcher.equinox.libraries.surefirebooter7496509516769799044
RESOLVED org.apache.tuscany.sca.node.launcher.equinox.libraries.surefirebooter7496509516769799044
5 org.apache.tuscany.sca.node.launcher.equinox.libraries.servlet-api RESOLVED org.apache.tuscany.sca.node.launcher.equinox.libraries.servlet-api
6 org.apache.tuscany.sca.node.launcher.equinox.libraries.jsr181-api RESOLVED org.apache.tuscany.sca.node.launcher.equinox.libraries.jsr181-api
7 org.apache.tuscany.sca.node.launcher.equinox.libraries.wstx-asl RESOLVED org.apache.tuscany.sca.node.launcher.equinox.libraries.wstx-asl
8 org.apache.tuscany.sca.node.launcher.equinox.libraries.jaxws-api RESOLVED org.apache.tuscany.sca.node.launcher.equinox.libraries.jaxws-api
9 org.apache.tuscany.sca.node.launcher.equinox.libraries.junit RESOLVED org.apache.tuscany.sca.node.launcher.equinox.libraries.junit
10 org.apache.tuscany.sca.node.launcher.equinox.libraries.asm RESOLVED org.apache.tuscany.sca.node.launcher.equinox.libraries.asm
11 org.apache.tuscany.sca.node.launcher.equinox.libraries.surefire-booter RESOLVED org.apache.tuscany.sca.node.launcher.equinox.libraries.surefire-booter
12 org.apache.tuscany.sca.node.launcher.equinox.libraries.surefire-api RESOLVED org.apache.tuscany.sca.node.launcher.equinox.libraries.surefire-api
13 org.apache.tuscany.sca.node.launcher.equinox.libraries.cglib RESOLVED org.apache.tuscany.sca.node.launcher.equinox.libraries.cglib
14 org.apache.tuscany.sca.node.launcher.equinox.libraries.jaxb-impl RESOLVED org.apache.tuscany.sca.node.launcher.equinox.libraries.jaxb-impl
15 org.apache.tuscany.sca.node.launcher.equinox.libraries.jsr250-api RESOLVED org.apache.tuscany.sca.node.launcher.equinox.libraries.jsr250-api
16 org.apache.tuscany.sca.gateway STARTING org.apache.tuscany.sca.gateway
17 org.apache.tuscany.sca.core RESOLVED reference:file:/<http://hudson.zones.apache.org/hudson/job/Tuscany-SCA-J-CAA/ws/scajcaa/core/target/tuscany-core-2.0-SNAPSHOT.jar>
18 org.apache.tuscany.sca.interface.java RESOLVED reference:file:/<http://hudson.zones.apache.org/hudson/job/Tuscany-SCA-J-CAA/ws/scajcaa/interface-java/target/tuscany-interface-java-2.0-SNAPSHOT.jar>
19 org.apache.tuscany.sca.databinding RESOLVED reference:file:/<http://hudson.zones.apache.org/hudson/job/Tuscany-SCA-J-CAA/ws/scajcaa/databinding/target/tuscany-databinding-2.0-SNAPSHOT.jar>
20 org.apache.tuscany.sca.extensibility RESOLVED reference:file:/<http://hudson.zones.apache.org/hudson/job/Tuscany-SCA-J-CAA/ws/scajcaa/extensibility/target/tuscany-extensibility-2.0-SNAPSHOT.jar>
21 org.apache.tuscany.sca.extensibility.equinox ACTIVE reference:file:/<http://hudson.zones.apache.org/hudson/job/Tuscany-SCA-J-CAA/ws/scajcaa/extensibility-equinox/target/tuscany-extensibility-equinox-2.0-SNAPSHOT.jar>
22 org.apache.tuscany.sca.node.impl RESOLVED reference:file:/<http://hudson.zones.apache.org/hudson/job/Tuscany-SCA-J-CAA/ws/scajcaa/node-impl/target/tuscany-node-impl-2.0-SNAPSHOT.jar>
23 org.apache.tuscany.sca.binding.sca.runtime RESOLVED reference:file:/<http://hudson.zones.apache.org/hudson/job/Tuscany-SCA-J-CAA/ws/scajcaa/binding-sca-runtime/target/tuscany-binding-sca-runtime-2.0-SNAPSHOT.jar>
24 org.apache.tuscany.sca.xsd RESOLVED reference:file:/<http://hudson.zones.apache.org/hudson/job/Tuscany-SCA-J-CAA/ws/scajcaa/xsd/target/tuscany-xsd-2.0-SNAPSHOT.jar>
25 org.apache.tuscany.sca.contribution RESOLVED reference:file:/<http://hudson.zones.apache.org/hudson/job/Tuscany-SCA-J-CAA/ws/scajcaa/contribution/target/tuscany-contribution-2.0-SNAPSHOT.jar>
26 org.apache.tuscany.sca.assembly RESOLVED reference:file:/<http://hudson.zones.apache.org/hudson/job/Tuscany-SCA-J-CAA/ws/scajcaa/assembly/target/tuscany-assembly-2.0-SNAPSHOT.jar>
27 org.apache.tuscany.sca.builder RESOLVED reference:file:/<http://hudson.zones.apache.org/hudson/job/Tuscany-SCA-J-CAA/ws/scajcaa/builder/target/tuscany-builder-2.0-SNAPSHOT.jar>
28 org.apache.tuscany.sca.assembly.xsd RESOLVED reference:file:/<http://hudson.zones.apache.org/hudson/job/Tuscany-SCA-J-CAA/ws/scajcaa/assembly-xsd/target/tuscany-assembly-xsd-2.0-SNAPSHOT.jar>
29 org.apache.tuscany.sca.implementation.java.runtime RESOLVED reference:file:/<http://hudson.zones.apache.org/hudson/job/Tuscany-SCA-J-CAA/ws/scajcaa/implementation-java-runtime/target/tuscany-implementation-java-runtime-2.0-SNAPSHOT.jar>
30 org.apache.tuscany.sca.core.spi RESOLVED reference:file:/<http://hudson.zones.apache.org/hudson/job/Tuscany-SCA-J-CAA/ws/scajcaa/core-spi/target/tuscany-core-spi-2.0-SNAPSHOT.jar>
31 org.apache.tuscany.sca.databinding.jaxb RESOLVED reference:file:/<http://hudson.zones.apache.org/hudson/job/Tuscany-SCA-J-CAA/ws/scajcaa/databinding-jaxb/target/tuscany-databinding-jaxb-2.0-SNAPSHOT.jar>
32 org.apache.tuscany.sca.monitor RESOLVED reference:file:/<http://hudson.zones.apache.org/hudson/job/Tuscany-SCA-J-CAA/ws/scajcaa/monitor/target/tuscany-monitor-2.0-SNAPSHOT.jar>
33 org.apache.ws.commons.schema RESOLVED reference:file://home/hudson/.m2/repository/org/apache/ws/commons/schema/XmlSchema/1.4.3/XmlSchema-1.4.3.jar
34 org.apache.geronimo.specs.geronimo-stax-api_1.0_spec RESOLVED reference:file://home/hudson/.m2/repository/org/apache/geronimo/specs/geronimo-stax-api_1.0_spec/1.0.1/geronimo-stax-api_1.0_spec-1.0.1.jar
35 org.apache.tuscany.sca.api RESOLVED reference:file:/<http://hudson.zones.apache.org/hudson/job/Tuscany-SCA-J-CAA/ws/scajcaa/sca-api/target/tuscany-sca-api-2.0-SNAPSHOT.jar>
36 org.apache.tuscany.sca.interface.java.jaxws RESOLVED reference:file:/<http://hudson.zones.apache.org/hudson/job/Tuscany-SCA-J-CAA/ws/scajcaa/interface-java-jaxws/target/tuscany-interface-java-jaxws-2.0-SNAPSHOT.jar>
37 org.apache.tuscany.sca.deployment RESOLVED reference:file:/<http://hudson.zones.apache.org/hudson/job/Tuscany-SCA-J-CAA/ws/scajcaa/deployment/target/tuscany-deployment-2.0-SNAPSHOT.jar>
38 org.apache.tuscany.sca.assembly.xml RESOLVED reference:file:/<http://hudson.zones.apache.org/hudson/job/Tuscany-SCA-J-CAA/ws/scajcaa/assembly-xml/target/tuscany-assembly-xml-2.0-SNAPSHOT.jar>
39 org.apache.tuscany.sca.common.java RESOLVED reference:file:/<http://hudson.zones.apache.org/hudson/job/Tuscany-SCA-J-CAA/ws/scajcaa/common-java/target/tuscany-common-java-2.0-SNAPSHOT.jar>
40 org.apache.commons.cli RESOLVED reference:file://home/hudson/.m2/repository/commons-cli/commons-cli/1.2/commons-cli-1.2.jar
41 org.apache.tuscany.sca.core.databinding RESOLVED reference:file:/<http://hudson.zones.apache.org/hudson/job/Tuscany-SCA-J-CAA/ws/scajcaa/core-databinding/target/tuscany-core-databinding-2.0-SNAPSHOT.jar>
42 org.apache.tuscany.sca.common.xml RESOLVED reference:file:/<http://hudson.zones.apache.org/hudson/job/Tuscany-SCA-J-CAA/ws/scajcaa/common-xml/target/tuscany-common-xml-2.0-SNAPSHOT.jar>
43 org.apache.tuscany.sca.node.api RESOLVED reference:file:/<http://hudson.zones.apache.org/hudson/job/Tuscany-SCA-J-CAA/ws/scajcaa/node-api/target/tuscany-node-api-2.0-SNAPSHOT.jar>
44 org.apache.tuscany.sca.implementation.java RESOLVED reference:file:/<http://hudson.zones.apache.org/hudson/job/Tuscany-SCA-J-CAA/ws/scajcaa/implementation-java/target/tuscany-implementation-java-2.0-SNAPSHOT.jar>
Running org.apache.tuscany.sca.node.equinox.launcher.NodeLauncherTestCase
Tests run: 2, Failures: 0, Errors: 0, Skipped: 1, Time elapsed: 0.009 sec
Running org.apache.tuscany.sca.node.equinox.launcher.EquinoxOSGiHostTestCase
Tests run: 2, Failures: 0, Errors: 0, Skipped: 0, Time elapsed: 0.004 sec

Results :

Tests run: 4, Failures: 0, Errors: 0, Skipped: 1

[HUDSON] Recording test results
[INFO] [jar:jar {execution: default-jar}]
[INFO] Building jar: <http://hudson.zones.apache.org/hudson/job/Tuscany-SCA-J-CAA/ws/scajcaa/node-launcher-equinox/target/tuscany-node-launcher-equinox-2.0-SNAPSHOT.jar>
[INFO] [install:install {execution: default-install}]
[INFO] Installing <http://hudson.zones.apache.org/hudson/job/Tuscany-SCA-J-CAA/ws/scajcaa/node-launcher-equinox/target/tuscany-node-launcher-equinox-2.0-SNAPSHOT.jar>
to /home/hudson/.m2/repository/org/apache/tuscany/sca/tuscany-node-launcher-equinox/2.0-SNAPSHOT/tuscany-node-launcher-equinox-2.0-SNAPSHOT.jar
[HUDSON] Archiving <http://hudson.zones.apache.org/hudson/job/Tuscany-SCA-J-CAA/ws/scajcaa/node-launcher-equinox/pom.xml>
to /export/home/hudson/hudson/jobs/Tuscany-SCA-J-CAA/modules/org.apache.tuscany.sca$tuscany-node-launcher-equinox/builds/2010-02-19_00-16-14/archive/org.apache.tuscany.sca/tuscany-node-launcher-equinox/2.0-SNAPSHOT/pom.xml
[HUDSON] Archiving <http://hudson.zones.apache.org/hudson/job/Tuscany-SCA-J-CAA/ws/scajcaa/node-launcher-equinox/target/tuscany-node-launcher-equinox-2.0-SNAPSHOT.jar>
to /export/home/hudson/hudson/jobs/Tuscany-SCA-J-CAA/modules/org.apache.tuscany.sca$tuscany-node-launcher-equinox/builds/2010-02-19_00-16-14/archive/org.apache.tuscany.sca/tuscany-node-launcher-equinox/2.0-SNAPSHOT/tuscany-node-launcher-equinox-2.0-SNAPSHOT.jar
[INFO] ------------------------------------------------------------------------
[INFO] Building Apache Tuscany SCA Policy Security Model
[INFO]    task-segment: [clean, install]
[INFO] ------------------------------------------------------------------------
[INFO] [clean:clean {execution: default-clean}]
[INFO] Deleting file set: <http://hudson.zones.apache.org/hudson/job/Tuscany-SCA-J-CAA/ws/scajcaa/policy-security/target>
(included: [**], excluded: [])
[INFO] [enforcer:enforce {execution: enforce-plugin-versions}]
[INFO] [resources:resources {execution: default-resources}]
[WARNING] Using platform encoding (UTF-8 actually) to copy filtered resources, i.e. build
is platform dependent!
[INFO] Copying 6 resources
[INFO] Copying 3 resources
[INFO] [compiler:compile {execution: default-compile}]
[INFO] Invoking Tuscany Eclipse JDT compiler
[INFO] Compiling 23 to <http://hudson.zones.apache.org/hudson/job/Tuscany-SCA-J-CAA/ws/scajcaa/policy-security/target/classes>
[INFO] Resolving OSGi bundle: org.apache.tuscany.sca.policy.security
[INFO] OSGi bundle is resolved: org.apache.tuscany.sca.policy.security
[INFO] [resources:testResources {execution: default-testResources}]
[WARNING] Using platform encoding (UTF-8 actually) to copy filtered resources, i.e. build
is platform dependent!
[INFO] Copying 1 resource
[INFO] [compiler:testCompile {execution: default-testCompile}]
[INFO] Invoking Tuscany Eclipse JDT compiler
[INFO] Compiling 1 to <http://hudson.zones.apache.org/hudson/job/Tuscany-SCA-J-CAA/ws/scajcaa/policy-security/target/test-classes>
[INFO] [surefire:test {execution: default-test}]
[INFO] Surefire report directory: <http://hudson.zones.apache.org/hudson/job/Tuscany-SCA-J-CAA/ws/scajcaa/policy-security/target/surefire-reports>

-------------------------------------------------------
 T E S T S
-------------------------------------------------------
Running org.apache.tuscany.sca.policy.security.PolicyProcessorTestCase
Tests run: 1, Failures: 0, Errors: 0, Skipped: 0, Time elapsed: 0.11 sec

Results :

Tests run: 1, Failures: 0, Errors: 0, Skipped: 0

[HUDSON] Recording test results
[INFO] [jar:jar {execution: default-jar}]
[INFO] Building jar: <http://hudson.zones.apache.org/hudson/job/Tuscany-SCA-J-CAA/ws/scajcaa/policy-security/target/tuscany-policy-security-2.0-SNAPSHOT.jar>
[INFO] [install:install {execution: default-install}]
[INFO] Installing <http://hudson.zones.apache.org/hudson/job/Tuscany-SCA-J-CAA/ws/scajcaa/policy-security/target/tuscany-policy-security-2.0-SNAPSHOT.jar>
to /home/hudson/.m2/repository/org/apache/tuscany/sca/tuscany-policy-security/2.0-SNAPSHOT/tuscany-policy-security-2.0-SNAPSHOT.jar
[HUDSON] Archiving <http://hudson.zones.apache.org/hudson/job/Tuscany-SCA-J-CAA/ws/scajcaa/policy-security/pom.xml>
to /export/home/hudson/hudson/jobs/Tuscany-SCA-J-CAA/modules/org.apache.tuscany.sca$tuscany-policy-security/builds/2010-02-19_00-16-14/archive/org.apache.tuscany.sca/tuscany-policy-security/2.0-SNAPSHOT/pom.xml
[HUDSON] Archiving <http://hudson.zones.apache.org/hudson/job/Tuscany-SCA-J-CAA/ws/scajcaa/policy-security/target/tuscany-policy-security-2.0-SNAPSHOT.jar>
to /export/home/hudson/hudson/jobs/Tuscany-SCA-J-CAA/modules/org.apache.tuscany.sca$tuscany-policy-security/builds/2010-02-19_00-16-14/archive/org.apache.tuscany.sca/tuscany-policy-security/2.0-SNAPSHOT/tuscany-policy-security-2.0-SNAPSHOT.jar
[INFO] ------------------------------------------------------------------------
[INFO] Building Apache Tuscany SCA Policy XML WS Model
[INFO]    task-segment: [clean, install]
[INFO] ------------------------------------------------------------------------
[INFO] [clean:clean {execution: default-clean}]
[INFO] Deleting file set: <http://hudson.zones.apache.org/hudson/job/Tuscany-SCA-J-CAA/ws/scajcaa/policy-xml-ws/target>
(included: [**], excluded: [])
[INFO] [enforcer:enforce {execution: enforce-plugin-versions}]
[INFO] [resources:resources {execution: default-resources}]
[WARNING] Using platform encoding (UTF-8 actually) to copy filtered resources, i.e. build
is platform dependent!
[INFO] Copying 1 resource
[INFO] Copying 3 resources
[INFO] [compiler:compile {execution: default-compile}]
[INFO] Invoking Tuscany Eclipse JDT compiler
[INFO] Compiling 1 to <http://hudson.zones.apache.org/hudson/job/Tuscany-SCA-J-CAA/ws/scajcaa/policy-xml-ws/target/classes>
[INFO] Resolving OSGi bundle: org.apache.tuscany.sca.policy.xml.ws
[ERROR] --> [org.apache.tuscany.sca.policy.xml.ws] Missing Constraint: Import-Package:
org.apache.axiom.om; version="0.0.0"
[ERROR] --> [org.apache.ws.commons.axiom.axiom-api] Bundle unresolved: Export-Package:
org.apache.axiom.om; version="0.0.0"
[ERROR] ----> [org.apache.ws.commons.axiom.axiom-api] Missing Constraint: Import-Package:
org.apache.commons.logging; version="0.0.0"
[INFO] [resources:testResources {execution: default-testResources}]
[WARNING] Using platform encoding (UTF-8 actually) to copy filtered resources, i.e. build
is platform dependent!
[INFO] Copying 1 resource
[INFO] [compiler:testCompile {execution: default-testCompile}]
[INFO] Invoking Tuscany Eclipse JDT compiler
[INFO] Compiling 3 to <http://hudson.zones.apache.org/hudson/job/Tuscany-SCA-J-CAA/ws/scajcaa/policy-xml-ws/target/test-classes>
[INFO] [surefire:test {execution: default-test}]
[INFO] Surefire report directory: <http://hudson.zones.apache.org/hudson/job/Tuscany-SCA-J-CAA/ws/scajcaa/policy-xml-ws/target/surefire-reports>

-------------------------------------------------------
 T E S T S
-------------------------------------------------------
Running org.apache.tuscany.sca.policy.xml.ws.WSPolicyProcessorTestCase
Tests run: 1, Failures: 0, Errors: 0, Skipped: 0, Time elapsed: 0.226 sec

Results :

Tests run: 1, Failures: 0, Errors: 0, Skipped: 0

[HUDSON] Recording test results
[INFO] [jar:jar {execution: default-jar}]
[INFO] Building jar: <http://hudson.zones.apache.org/hudson/job/Tuscany-SCA-J-CAA/ws/scajcaa/policy-xml-ws/target/tuscany-policy-xml-ws-2.0-SNAPSHOT.jar>
[INFO] [install:install {execution: default-install}]
[INFO] Installing <http://hudson.zones.apache.org/hudson/job/Tuscany-SCA-J-CAA/ws/scajcaa/policy-xml-ws/target/tuscany-policy-xml-ws-2.0-SNAPSHOT.jar>
to /home/hudson/.m2/repository/org/apache/tuscany/sca/tuscany-policy-xml-ws/2.0-SNAPSHOT/tuscany-policy-xml-ws-2.0-SNAPSHOT.jar
[HUDSON] Archiving <http://hudson.zones.apache.org/hudson/job/Tuscany-SCA-J-CAA/ws/scajcaa/policy-xml-ws/pom.xml>
to /export/home/hudson/hudson/jobs/Tuscany-SCA-J-CAA/modules/org.apache.tuscany.sca$tuscany-policy-xml-ws/builds/2010-02-19_00-16-14/archive/org.apache.tuscany.sca/tuscany-policy-xml-ws/2.0-SNAPSHOT/pom.xml
[HUDSON] Archiving <http://hudson.zones.apache.org/hudson/job/Tuscany-SCA-J-CAA/ws/scajcaa/policy-xml-ws/target/tuscany-policy-xml-ws-2.0-SNAPSHOT.jar>
to /export/home/hudson/hudson/jobs/Tuscany-SCA-J-CAA/modules/org.apache.tuscany.sca$tuscany-policy-xml-ws/builds/2010-02-19_00-16-14/archive/org.apache.tuscany.sca/tuscany-policy-xml-ws/2.0-SNAPSHOT/tuscany-policy-xml-ws-2.0-SNAPSHOT.jar
[INFO] ------------------------------------------------------------------------
[INFO] Building OASIS SCA Assembly TestCase Suite (1.1) Modules
[INFO]    task-segment: [clean, install]
[INFO] ------------------------------------------------------------------------
[INFO] [clean:clean {execution: default-clean}]
[INFO] [site:attach-descriptor {execution: default-attach-descriptor}]
[INFO] [install:install {execution: default-install}]
[INFO] Installing <http://hudson.zones.apache.org/hudson/job/Tuscany-SCA-J-CAA/ws/scajcaa/sca-assembly/pom.xml>
to /home/hudson/.m2/repository/org/oasis-open/sca/assembly/assembly-modules/1.0/assembly-modules-1.0.pom
[HUDSON] Archiving <http://hudson.zones.apache.org/hudson/job/Tuscany-SCA-J-CAA/ws/scajcaa/sca-assembly/pom.xml>
to /export/home/hudson/hudson/jobs/Tuscany-SCA-J-CAA/modules/org.oasis-open.sca.assembly$assembly-modules/builds/2010-02-19_00-16-15/archive/org.oasis-open.sca.assembly/assembly-modules/1.0/pom.xml
[HUDSON] Archiving /home/hudson/.m2/repository/org/oasis-open/sca/assembly/assembly-modules/1.0/assembly-modules-1.0.pom
to /export/home/hudson/hudson/jobs/Tuscany-SCA-J-CAA/modules/org.oasis-open.sca.assembly$assembly-modules/builds/2010-02-19_00-16-15/archive/org.oasis-open.sca.assembly/assembly-modules/1.0/assembly-modules-1.0.pom
[INFO] ------------------------------------------------------------------------
[INFO] Building OASIS Assembly TestCases - Test Client
[INFO]    task-segment: [clean, install]
[INFO] ------------------------------------------------------------------------
[INFO] [clean:clean {execution: default-clean}]
[INFO] Deleting directory <http://hudson.zones.apache.org/hudson/job/Tuscany-SCA-J-CAA/ws/scajcaa/sca-assembly/Test_Client/target>
[INFO] [resources:resources {execution: default-resources}]
[WARNING] Using platform encoding (UTF-8 actually) to copy filtered resources, i.e. build
is platform dependent!
[INFO] Copying 8 resources
[INFO] Copying 1 resource
[INFO] [compiler:compile {execution: default-compile}]
[INFO] Compiling 145 source files to <http://hudson.zones.apache.org/hudson/job/Tuscany-SCA-J-CAA/ws/scajcaa/sca-assembly/Test_Client/target/classes>
[HUDSON] Archiving <http://hudson.zones.apache.org/hudson/job/Tuscany-SCA-J-CAA/ws/scajcaa/sca-assembly/Test_Client/pom.xml>
to /export/home/hudson/hudson/jobs/Tuscany-SCA-J-CAA/modules/org.oasis-open.sca.assembly$Test_Client/builds/2010-02-19_00-16-15/archive/org.oasis-open.sca.assembly/Test_Client/1.0/pom.xml
[INFO] ------------------------------------------------------------------------
[ERROR] BUILD FAILURE
[INFO] ------------------------------------------------------------------------
[INFO] Compilation failure
<http://hudson.zones.apache.org/hudson/job/Tuscany-SCA-J-CAA/ws/scajcaa/sca-assembly/Test_Client/src/main/java/client/TuscanyRuntimeBridge.java>:[126,16]
cannot find symbol
symbol  : method destroy()
location: interface org.apache.tuscany.sca.node.Node


[INFO] ------------------------------------------------------------------------
[INFO] For more information, run Maven with the -e switch
[INFO] ------------------------------------------------------------------------
[INFO] Total time: 4 minutes 
[INFO] Finished at: Fri Feb 19 00:20:35 UTC 2010
[INFO] Final Memory: 57M/749M
[INFO] ------------------------------------------------------------------------
Sending e-mails to: commits@tuscany.apache.org
channel stopped


Mime
View raw message