tuscany-commits mailing list archives

Site index · List index
Message view « Date » · « Thread »
Top « Date » · « Thread »
From Apache Hudson Server <hud...@hudson.zones.apache.org>
Subject Build failed in Hudson: Tuscany-2x #476
Date Fri, 05 Feb 2010 00:20:12 GMT
See <http://hudson.zones.apache.org/hudson/job/Tuscany-2x/476/changes>

Changes:

[slaws] started causing spurious compilation error so remove for now as it doesn't do anything
yet

[rfeng] Remove the threading as now we have a thread in the TopologyManager to handle import/unimport

[rfeng] Remove xmlschema 1.4.2

[rfeng] Improve the bundle discovery filtering based on the ML discussion

[rfeng] Fix the MF to match the fragment host to the host bundle symbolic name and version

[rfeng] Fix for TUSCANY-3456 (only register direct transformer with lower weight)

[antelder] Set default map config to use near cache to improve local endpoint read performance

[slaws] missed pom update from previous Axis2 1.5.1 commit

[slaws] Move the runtime over to use Axis2 1.5.1. Three main parts to this 1) replace binding-ws-axis2
and binding binding-ws-axis2-policy with binding-ws-runtime-axis which is still very much
a work in progress 2) correct the axis/axiom version references across the project and make
the various OSGi environments work 3) start fixing policy provides to allow the ws binding
to exploit the binding wire.

[slaws] add ignores

[slaws] Exploit features to define dependencies

[slaws] Add some extra debug code (mostly commented out)

[slaws] fix typo in module name

[slaws] Tidy come comments

[slaws] add ignores

[slaws] Add the runtime versions of the axis 1.5.1 manifests. These are slight different from
the tooling versions but only because it was an iterative process getting all this work and
this is where I've ended up. I want to get what I have working checked in then I'll fix then
up so they are consistent and the versions numbers are correct.

[slaws] Add local axis manifests to handle split package between kernel and transport-http.
Export package versions are a bit wonky still. These manifest a used during the distro build
to create the bundle repo that's used when you load the project using the Eclipse PDE. They
aren't used during runtime. Runtime uses the manifests in the node-launcher-equinox! Needs
work to remove this confusion.

[slaws] add ignores

[slaws] Create a place in itests for binding.ws integration tests

[slaws] add ignores

[slaws] add ignores

------------------------------------------
[...truncated 15213 lines...]
[INFO] ------------------------------------------------------------------------
[INFO] [clean:clean {execution: default-clean}]
[INFO] [enforcer:enforce {execution: enforce-plugin-versions}]
[INFO] [site:attach-descriptor {execution: default-attach-descriptor}]
[INFO] [install:install {execution: default-install}]
[INFO] Installing <http://hudson.zones.apache.org/hudson/job/Tuscany-2x/ws/sca-2x/itest/distribution/pom.xml>
to /export/home/hudson/.m2/repository/org/apache/tuscany/sca/itest-distribution/2.0-SNAPSHOT/itest-distribution-2.0-SNAPSHOT.pom
[HUDSON] Archiving <http://hudson.zones.apache.org/hudson/job/Tuscany-2x/ws/sca-2x/itest/distribution/pom.xml>
to /export/home/hudson/hudson/jobs/Tuscany-2x/modules/org.apache.tuscany.sca$itest-distribution/builds/2010-02-04_22-08-35/archive/org.apache.tuscany.sca/itest-distribution/2.0-SNAPSHOT/pom.xml
[HUDSON] Archiving /export/home/hudson/.m2/repository/org/apache/tuscany/sca/itest-distribution/2.0-SNAPSHOT/itest-distribution-2.0-SNAPSHOT.pom
to /export/home/hudson/hudson/jobs/Tuscany-2x/modules/org.apache.tuscany.sca$itest-distribution/builds/2010-02-04_22-08-35/archive/org.apache.tuscany.sca/itest-distribution/2.0-SNAPSHOT/itest-distribution-2.0-SNAPSHOT.pom
[INFO] ------------------------------------------------------------------------
[INFO] Building Apache Tuscany SCA iTest Distribution Bin Distro Unzip
[INFO]    task-segment: [clean, install]
[INFO] ------------------------------------------------------------------------
[INFO] [clean:clean {execution: default-clean}]
[INFO] Deleting file set: <http://hudson.zones.apache.org/hudson/job/Tuscany-2x/ws/sca-2x/itest/distribution/bin-distro-unzip/target>
(included: [**], excluded: [])
[INFO] [enforcer:enforce {execution: enforce-plugin-versions}]
[INFO] [resources:resources {execution: default-resources}]
[WARNING] Using platform encoding (ISO646-US actually) to copy filtered resources, i.e. build
is platform dependent!
[INFO] skip non existing resourceDirectory <http://hudson.zones.apache.org/hudson/job/Tuscany-2x/ws/sca-2x/itest/distribution/bin-distro-unzip/src/main/resources>
[INFO] Copying 0 resource
[INFO] [compiler:compile {execution: default-compile}]
[INFO] No sources to compile
[INFO] [resources:testResources {execution: default-testResources}]
[WARNING] Using platform encoding (ISO646-US actually) to copy filtered resources, i.e. build
is platform dependent!
[INFO] skip non existing resourceDirectory <http://hudson.zones.apache.org/hudson/job/Tuscany-2x/ws/sca-2x/itest/distribution/bin-distro-unzip/src/test/resources>
[INFO] [compiler:testCompile {execution: default-testCompile}]
[INFO] No sources to compile
[INFO] [surefire:test {execution: default-test}]
[INFO] No tests to run.
[HUDSON] Recording test results
[INFO] [jar:jar {execution: default-jar}]
[INFO] Building jar: <http://hudson.zones.apache.org/hudson/job/Tuscany-2x/ws/sca-2x/itest/distribution/bin-distro-unzip/target/itest-bin-distro-unzip-2.0-SNAPSHOT.jar>
[INFO] [antrun:run {execution: run-samples}]
[INFO] Executing tasks

unzip:
    [unzip] Expanding: <http://hudson.zones.apache.org/hudson/job/Tuscany-2x/ws/sca-2x/distribution/all/target/apache-tuscany-sca-all-2.0-SNAPSHOT.zip>
into <http://hudson.zones.apache.org/hudson/job/Tuscany-2x/ws/sca-2x/distribution/all/target/apache-tuscany-sca-all-2.0-SNAPSHOT.dir>
[INFO] Executed tasks
[INFO] [install:install {execution: default-install}]
[INFO] Installing <http://hudson.zones.apache.org/hudson/job/Tuscany-2x/ws/sca-2x/itest/distribution/bin-distro-unzip/target/itest-bin-distro-unzip-2.0-SNAPSHOT.jar>
to /export/home/hudson/.m2/repository/org/apache/tuscany/sca/itest-bin-distro-unzip/2.0-SNAPSHOT/itest-bin-distro-unzip-2.0-SNAPSHOT.jar
[HUDSON] Archiving <http://hudson.zones.apache.org/hudson/job/Tuscany-2x/ws/sca-2x/itest/distribution/bin-distro-unzip/pom.xml>
to /export/home/hudson/hudson/jobs/Tuscany-2x/modules/org.apache.tuscany.sca$itest-bin-distro-unzip/builds/2010-02-04_22-08-36/archive/org.apache.tuscany.sca/itest-bin-distro-unzip/2.0-SNAPSHOT/pom.xml
[HUDSON] Archiving <http://hudson.zones.apache.org/hudson/job/Tuscany-2x/ws/sca-2x/itest/distribution/bin-distro-unzip/target/itest-bin-distro-unzip-2.0-SNAPSHOT.jar>
to /export/home/hudson/hudson/jobs/Tuscany-2x/modules/org.apache.tuscany.sca$itest-bin-distro-unzip/builds/2010-02-04_22-08-36/archive/org.apache.tuscany.sca/itest-bin-distro-unzip/2.0-SNAPSHOT/itest-bin-distro-unzip-2.0-SNAPSHOT.jar
[INFO] ------------------------------------------------------------------------
[INFO] Building Apache Tuscany SCA iTest Distribution binding-ws-calculator
[INFO]    task-segment: [clean, install]
[INFO] ------------------------------------------------------------------------
[INFO] [clean:clean {execution: default-clean}]
[INFO] Deleting file set: <http://hudson.zones.apache.org/hudson/job/Tuscany-2x/ws/sca-2x/itest/distribution/binding-ws-calculator/target>
(included: [**], excluded: [])
[INFO] snapshot org.apache.tuscany.sca:itest-bin-distro-unzip:2.0-SNAPSHOT: checking for updates
from apache.snapshots
[INFO] [enforcer:enforce {execution: enforce-plugin-versions}]
[INFO] [resources:resources {execution: default-resources}]
[WARNING] Using platform encoding (ISO646-US actually) to copy filtered resources, i.e. build
is platform dependent!
[INFO] skip non existing resourceDirectory <http://hudson.zones.apache.org/hudson/job/Tuscany-2x/ws/sca-2x/itest/distribution/binding-ws-calculator/src/main/resources>
[INFO] Copying 0 resource
[INFO] [compiler:compile {execution: default-compile}]
[INFO] No sources to compile
[INFO] [resources:testResources {execution: default-testResources}]
[WARNING] Using platform encoding (ISO646-US actually) to copy filtered resources, i.e. build
is platform dependent!
[INFO] skip non existing resourceDirectory <http://hudson.zones.apache.org/hudson/job/Tuscany-2x/ws/sca-2x/itest/distribution/binding-ws-calculator/src/test/resources>
[INFO] [compiler:testCompile {execution: default-testCompile}]
[INFO] No sources to compile
[INFO] [surefire:test {execution: default-test}]
[INFO] No tests to run.
[HUDSON] Recording test results
[INFO] [jar:jar {execution: default-jar}]
[INFO] Building jar: <http://hudson.zones.apache.org/hudson/job/Tuscany-2x/ws/sca-2x/itest/distribution/binding-ws-calculator/target/itest-distribution-binding-ws-calculator-2.0-SNAPSHOT.jar>
[INFO] [antrun:run {execution: run-samples}]
[INFO] Executing tasks
     [echo] /zonestorage/hudson/home/hudson/tools/java/jdk1.6.0_06/jre

run:

init:
    [mkdir] Created dir: <http://hudson.zones.apache.org/hudson/job/Tuscany-2x/ws/sca-2x/distribution/all/target/apache-tuscany-sca-all-2.0-SNAPSHOT.dir/tuscany-sca-2.0-SNAPSHOT/samples/binding-ws-calculator/target/classes>

compile:
    [javac] Compiling 13 source files to <http://hudson.zones.apache.org/hudson/job/Tuscany-2x/ws/sca-2x/distribution/all/target/apache-tuscany-sca-all-2.0-SNAPSHOT.dir/tuscany-sca-2.0-SNAPSHOT/samples/binding-ws-calculator/target/classes>
     [copy] Copying 2 files to <http://hudson.zones.apache.org/hudson/job/Tuscany-2x/ws/sca-2x/distribution/all/target/apache-tuscany-sca-all-2.0-SNAPSHOT.dir/tuscany-sca-2.0-SNAPSHOT/samples/binding-ws-calculator/target/classes>
      [jar] Building jar: <http://hudson.zones.apache.org/hudson/job/Tuscany-2x/ws/sca-2x/distribution/all/target/apache-tuscany-sca-all-2.0-SNAPSHOT.dir/tuscany-sca-2.0-SNAPSHOT/samples/binding-ws-calculator/target/sample-binding-ws-calculator.jar>

run:
     [java] Feb 5, 2010 12:13:48 AM org.apache.tuscany.sca.node.impl.NodeImpl start
     [java] INFO: Starting node: http://tuscany.apache.org/sca/1.1/nodes/default0 domain:
default
     [java] Feb 5, 2010 12:13:50 AM org.apache.tuscany.sca.node.impl.NodeFactoryImpl loadContributions
     [java] INFO: Loading contribution: file:/zonestorage/hudson/home/hudson/hudson/jobs/Tuscany-2x/workspace/sca-2x/distribution/all/target/apache-tuscany-sca-all-2.0-SNAPSHOT.dir/tuscany-sca-2.0-SNAPSHOT/samples/binding-ws-calculator/target/sample-binding-ws-calculator.jar
     [java] Feb 5, 2010 12:13:58 AM org.apache.tuscany.sca.core.assembly.impl.EndpointRegistryImpl
addEndpoint
     [java] INFO: Add endpoint - (@1354107)Endpoint:  URI = SampleClient#service-binding(CalculatorClientImpl/CalculatorClientImpl)
     [java] Feb 5, 2010 12:13:58 AM org.apache.tuscany.sca.core.assembly.impl.EndpointRegistryImpl
addEndpoint
     [java] INFO: Add endpoint - (@8578291)Endpoint:  URI = CalculatorServiceComponent#service-binding(CalculatorServiceImpl/CalculatorServiceImpl)
     [java] Feb 5, 2010 12:13:58 AM org.mortbay.log.Slf4jLog info
     [java] INFO: Logging to org.slf4j.impl.JDK14LoggerAdapter(org.mortbay.log) via org.mortbay.log.Slf4jLog
     [java] Feb 5, 2010 12:15:08 AM org.apache.axis2.deployment.util.TempFileManager <clinit>
     [java] INFO: TempFileManager::unable to delete /var/tmp/axis2-tmp-25688.tmp
     [java] - Deploying module: rampart-1.4 - jar:file:/zonestorage/hudson/home/hudson/hudson/jobs/Tuscany-2x/workspace/sca-2x/distribution/all/target/apache-tuscany-sca-all-2.0-SNAPSHOT.dir/tuscany-sca-2.0-SNAPSHOT/modules/tuscany-binding-ws-runtime-axis2-2.0-SNAPSHOT.jar!/org/apache/tuscany/sca/binding/ws/axis2/engine/repository/modules/rampart-1.4.mar
     [java] Feb 5, 2010 12:15:10 AM org.apache.tuscany.sca.http.jetty.JettyLogger info
     [java] INFO: jetty-6.1.19
     [java] Feb 5, 2010 12:15:22 AM org.apache.tuscany.sca.http.jetty.JettyLogger info
     [java] INFO: Started SelectChannelConnector@0.0.0.0:8085
     [java] Feb 5, 2010 12:15:22 AM org.apache.tuscany.sca.http.jetty.JettyServer addServletMapping
     [java] INFO: Added Servlet mapping: http://hudson.zones.apache.org:8085/AddServiceComponent
     [java] Feb 5, 2010 12:15:22 AM org.apache.tuscany.sca.core.assembly.impl.EndpointRegistryImpl
addEndpoint
     [java] INFO: Add endpoint - (@14390689)Endpoint:  URI = AddServiceComponent#service-binding(AddService/AddService)
     [java] Feb 5, 2010 12:15:22 AM org.apache.tuscany.sca.core.assembly.impl.EndpointRegistryImpl
addEndpoint
     [java] INFO: Add endpoint - (@3970582)Endpoint:  URI = SubtractServiceComponent#service-binding(SubtractServiceImpl/SubtractServiceImpl)
     [java] Feb 5, 2010 12:15:22 AM org.apache.tuscany.sca.core.assembly.impl.EndpointRegistryImpl
addEndpoint
     [java] INFO: Add endpoint - (@27365090)Endpoint:  URI = MultiplyServiceComponent#service-binding(MultiplyServiceImpl/MultiplyServiceImpl)
     [java] Feb 5, 2010 12:15:22 AM org.apache.tuscany.sca.core.assembly.impl.EndpointRegistryImpl
addEndpoint
     [java] INFO: Add endpoint - (@28036507)Endpoint:  URI = DivideServiceComponent#service-binding(DivideServiceImpl/DivideServiceImpl)
     [java] SCA API ClassLoader: java.net.URLClassLoader@82c01f sun.misc.Launcher$AppClassLoader@1f12c4e
sun.misc.Launcher$ExtClassLoader@93dee9 
     [java] - Deploying module: rampart-1.4 - jar:file:/zonestorage/hudson/home/hudson/hudson/jobs/Tuscany-2x/workspace/sca-2x/distribution/all/target/apache-tuscany-sca-all-2.0-SNAPSHOT.dir/tuscany-sca-2.0-SNAPSHOT/modules/tuscany-binding-ws-runtime-axis2-2.0-SNAPSHOT.jar!/org/apache/tuscany/sca/binding/ws/axis2/engine/repository/modules/rampart-1.4.mar
     [java] Feb 5, 2010 12:15:23 AM org.apache.tuscany.sca.databinding.impl.DirectedGraph
addEdge
     [java] WARNING: An edge exists with higher weight: (java:simpleType)->(org.w3c.dom.Node)[org.apache.tuscany.sca.databinding.DefaultTransformerExtensionPoint$LazyPullTransformer@127d15e;className=org.apache.tuscany.sca.databinding.xml.SimpleJavaType2Node,95000]
     [java] Feb 5, 2010 12:15:23 AM org.apache.tuscany.sca.databinding.impl.DirectedGraph
addEdge
     [java] WARNING: An edge exists with lower weight: (org.w3c.dom.Node)->(java:simpleType)[org.apache.tuscany.sca.databinding.DefaultTransformerExtensionPoint$LazyPullTransformer@da1515;className=org.apache.tuscany.sca.databinding.jaxb.Node2JAXB,90000]
     [java] 3 + 2=5.0
     [java] 3 - 2=1.0
     [java] 3 * 2=6.0
     [java] 3 / 2=1.5
     [java] Feb 5, 2010 12:15:25 AM org.apache.tuscany.sca.node.impl.NodeImpl stop
     [java] INFO: Stopping node: http://tuscany.apache.org/sca/1.1/nodes/default0
     [java] Feb 5, 2010 12:15:25 AM org.apache.tuscany.sca.http.jetty.JettyServer removeServletMapping
     [java] INFO: Removed Servlet mapping: /AddServiceComponent
[INFO] Executed tasks
[INFO] [install:install {execution: default-install}]
[INFO] Installing <http://hudson.zones.apache.org/hudson/job/Tuscany-2x/ws/sca-2x/itest/distribution/binding-ws-calculator/target/itest-distribution-binding-ws-calculator-2.0-SNAPSHOT.jar>
to /export/home/hudson/.m2/repository/org/apache/tuscany/sca/itest-distribution-binding-ws-calculator/2.0-SNAPSHOT/itest-distribution-binding-ws-calculator-2.0-SNAPSHOT.jar
[HUDSON] Archiving <http://hudson.zones.apache.org/hudson/job/Tuscany-2x/ws/sca-2x/itest/distribution/binding-ws-calculator/pom.xml>
to /export/home/hudson/hudson/jobs/Tuscany-2x/modules/org.apache.tuscany.sca$itest-distribution-binding-ws-calculator/builds/2010-02-04_22-08-35/archive/org.apache.tuscany.sca/itest-distribution-binding-ws-calculator/2.0-SNAPSHOT/pom.xml
[HUDSON] Archiving <http://hudson.zones.apache.org/hudson/job/Tuscany-2x/ws/sca-2x/itest/distribution/binding-ws-calculator/target/itest-distribution-binding-ws-calculator-2.0-SNAPSHOT.jar>
to /export/home/hudson/hudson/jobs/Tuscany-2x/modules/org.apache.tuscany.sca$itest-distribution-binding-ws-calculator/builds/2010-02-04_22-08-35/archive/org.apache.tuscany.sca/itest-distribution-binding-ws-calculator/2.0-SNAPSHOT/itest-distribution-binding-ws-calculator-2.0-SNAPSHOT.jar
[INFO] ------------------------------------------------------------------------
[INFO] Building Apache Tuscany SCA iTest Distribution calculator-rmi
[INFO]    task-segment: [clean, install]
[INFO] ------------------------------------------------------------------------
[INFO] [clean:clean {execution: default-clean}]
[INFO] Deleting file set: <http://hudson.zones.apache.org/hudson/job/Tuscany-2x/ws/sca-2x/itest/distribution/calculator-rmi/target>
(included: [**], excluded: [])
[INFO] [enforcer:enforce {execution: enforce-plugin-versions}]
[INFO] [resources:resources {execution: default-resources}]
[WARNING] Using platform encoding (ISO646-US actually) to copy filtered resources, i.e. build
is platform dependent!
[INFO] skip non existing resourceDirectory <http://hudson.zones.apache.org/hudson/job/Tuscany-2x/ws/sca-2x/itest/distribution/calculator-rmi/src/main/resources>
[INFO] Copying 0 resource
[INFO] [compiler:compile {execution: default-compile}]
[INFO] No sources to compile
[INFO] [resources:testResources {execution: default-testResources}]
[WARNING] Using platform encoding (ISO646-US actually) to copy filtered resources, i.e. build
is platform dependent!
[INFO] skip non existing resourceDirectory <http://hudson.zones.apache.org/hudson/job/Tuscany-2x/ws/sca-2x/itest/distribution/calculator-rmi/src/test/resources>
[INFO] [compiler:testCompile {execution: default-testCompile}]
[INFO] No sources to compile
[INFO] [surefire:test {execution: default-test}]
[INFO] No tests to run.
[HUDSON] Recording test results
[INFO] [jar:jar {execution: default-jar}]
[INFO] Building jar: <http://hudson.zones.apache.org/hudson/job/Tuscany-2x/ws/sca-2x/itest/distribution/calculator-rmi/target/itest-distribution-calculator-rmi-2.0-SNAPSHOT.jar>
[INFO] [antrun:run {execution: run-samples}]
[INFO] Executing tasks

run:

init:
    [mkdir] Created dir: <http://hudson.zones.apache.org/hudson/job/Tuscany-2x/ws/sca-2x/distribution/all/target/apache-tuscany-sca-all-2.0-SNAPSHOT.dir/tuscany-sca-2.0-SNAPSHOT/samples/calculator-rmi-service/target/classes>

compile:
    [javac] Compiling 12 source files to <http://hudson.zones.apache.org/hudson/job/Tuscany-2x/ws/sca-2x/distribution/all/target/apache-tuscany-sca-all-2.0-SNAPSHOT.dir/tuscany-sca-2.0-SNAPSHOT/samples/calculator-rmi-service/target/classes>
     [copy] Copying 2 files to <http://hudson.zones.apache.org/hudson/job/Tuscany-2x/ws/sca-2x/distribution/all/target/apache-tuscany-sca-all-2.0-SNAPSHOT.dir/tuscany-sca-2.0-SNAPSHOT/samples/calculator-rmi-service/target/classes>
      [jar] Building jar: <http://hudson.zones.apache.org/hudson/job/Tuscany-2x/ws/sca-2x/distribution/all/target/apache-tuscany-sca-all-2.0-SNAPSHOT.dir/tuscany-sca-2.0-SNAPSHOT/samples/calculator-rmi-service/target/sample-calculator-rmi-service.jar>

run:

init:
    [mkdir] Created dir: <http://hudson.zones.apache.org/hudson/job/Tuscany-2x/ws/sca-2x/distribution/all/target/apache-tuscany-sca-all-2.0-SNAPSHOT.dir/tuscany-sca-2.0-SNAPSHOT/samples/calculator-rmi-reference/target/classes>

compile:
    [javac] Compiling 7 source files to <http://hudson.zones.apache.org/hudson/job/Tuscany-2x/ws/sca-2x/distribution/all/target/apache-tuscany-sca-all-2.0-SNAPSHOT.dir/tuscany-sca-2.0-SNAPSHOT/samples/calculator-rmi-reference/target/classes>
     [copy] Copying 1 file to <http://hudson.zones.apache.org/hudson/job/Tuscany-2x/ws/sca-2x/distribution/all/target/apache-tuscany-sca-all-2.0-SNAPSHOT.dir/tuscany-sca-2.0-SNAPSHOT/samples/calculator-rmi-reference/target/classes>
      [jar] Building jar: <http://hudson.zones.apache.org/hudson/job/Tuscany-2x/ws/sca-2x/distribution/all/target/apache-tuscany-sca-all-2.0-SNAPSHOT.dir/tuscany-sca-2.0-SNAPSHOT/samples/calculator-rmi-reference/target/sample-calculator-rmi-reference.jar>

run:
     [java] Feb 5, 2010 12:17:20 AM org.apache.tuscany.sca.node.impl.NodeImpl start
     [java] Feb 5, 2010 12:17:20 AM org.apache.tuscany.sca.node.impl.NodeImpl start
     [java] INFO: Starting node: file:/zonestorage/hudson/home/hudson/hudson/jobs/Tuscany-2x/workspace/sca-2x/distribution/all/target/apache-tuscany-sca-all-2.0-SNAPSHOT.dir/tuscany-sca-2.0-SNAPSHOT/samples/calculator-rmi-service/target/sample-calculator-rmi-service.jar
domain: defaultDoamin
     [java] INFO: Starting node: http://tuscany.apache.org/sca/1.1/nodes/default0 domain:
default
     [java] Feb 5, 2010 12:17:20 AM org.apache.tuscany.sca.node.impl.NodeFactoryImpl loadContributions
     [java] INFO: Loading contribution: file:/zonestorage/hudson/home/hudson/hudson/jobs/Tuscany-2x/workspace/sca-2x/distribution/all/target/apache-tuscany-sca-all-2.0-SNAPSHOT.dir/tuscany-sca-2.0-SNAPSHOT/samples/calculator-rmi-reference/target/sample-calculator-rmi-reference.jar
     [java] Feb 5, 2010 12:17:20 AM org.apache.tuscany.sca.node.impl.NodeFactoryImpl loadContributions
     [java] INFO: Loading contribution: file:/zonestorage/hudson/home/hudson/hudson/jobs/Tuscany-2x/workspace/sca-2x/distribution/all/target/apache-tuscany-sca-all-2.0-SNAPSHOT.dir/tuscany-sca-2.0-SNAPSHOT/samples/calculator-rmi-service/target/sample-calculator-rmi-service.jar
     [java] Feb 5, 2010 12:17:31 AM org.apache.tuscany.sca.core.assembly.impl.EndpointRegistryImpl
addEndpoint
     [java] INFO: Add endpoint - (@15606014)Endpoint:  URI = CalculatorServiceComponent#service-binding(CalculatorService/CalculatorService)
     [java] Exception in thread "main" java.lang.reflect.InvocationTargetException
     [java] 	at sun.reflect.NativeMethodAccessorImpl.invoke0(Native Method)
     [java] 	at sun.reflect.NativeMethodAccessorImpl.invoke(NativeMethodAccessorImpl.java:39)
     [java] 	at sun.reflect.DelegatingMethodAccessorImpl.invoke(DelegatingMethodAccessorImpl.java:25)
     [java] 	at java.lang.reflect.Method.invoke(Method.java:597)
     [java] 	at org.apache.tuscany.sca.launcher.LauncherMain.invokeMainMethod(LauncherMain.java:115)
     [java] 	at org.apache.tuscany.sca.launcher.LauncherMain.main(LauncherMain.java:56)
     [java] Caused by: org.apache.tuscany.sca.host.rmi.RMIHostRuntimeException: Connection
refused to host: localhost; nested exception is: 
     [java] 	java.net.ConnectException: Connection refused
     [java] 	at sun.rmi.transport.tcp.TCPEndpoint.newSocket(TCPEndpoint.java:601)
     [java] 	at sun.rmi.transport.tcp.TCPChannel.createConnection(TCPChannel.java:198)
     [java] 	at sun.rmi.transport.tcp.TCPChannel.newConnection(TCPChannel.java:184)
     [java] 	at sun.rmi.server.UnicastRef.newCall(UnicastRef.java:322)
     [java] 	at sun.rmi.registry.RegistryImpl_Stub.lookup(Unknown Source)
     [java] 	at org.apache.tuscany.sca.host.rmi.DefaultRMIHost.findService(DefaultRMIHost.java:112)
     [java] 	at org.apache.tuscany.sca.host.rmi.ExtensibleRMIHost.findService(ExtensibleRMIHost.java:56)
     [java] 	at org.apache.tuscany.sca.binding.rmi.provider.RMIBindingInvoker.invokeTarget(RMIBindingInvoker.java:81)
     [java] 	at org.apache.tuscany.sca.binding.rmi.provider.RMIBindingInvoker.invoke(RMIBindingInvoker.java:54)
     [java] 	at org.apache.tuscany.sca.core.invocation.impl.JDKInvocationHandler.invoke(JDKInvocationHandler.java:236)
     [java] 	at org.apache.tuscany.sca.core.invocation.impl.JDKInvocationHandler.invoke(JDKInvocationHandler.java:106)
     [java] 	at $Proxy6.add(Unknown Source)
     [java] 	at calculator.CalculatorServiceImpl.add(CalculatorServiceImpl.java:54)
     [java] 	at sun.reflect.NativeMethodAccessorImpl.invoke0(Native Method)
     [java] 	at sun.reflect.NativeMethodAccessorImpl.invoke(NativeMethodAccessorImpl.java:39)
     [java] 	at sun.reflect.DelegatingMethodAccessorImpl.invoke(DelegatingMethodAccessorImpl.java:25)
     [java] 	at java.lang.reflect.Method.invoke(Method.java:597)
     [java] 	at org.apache.tuscany.sca.implementation.java.invocation.JavaImplementationInvoker.invoke(JavaImplementationInvoker.java:115)
     [java] 	at org.apache.tuscany.sca.core.databinding.wire.PassByValueInterceptor.invoke(PassByValueInterceptor.java:61)
     [java] 	at org.apache.tuscany.sca.binding.sca.provider.SCABindingInvoker.invoke(SCABindingInvoker.java:61)
     [java] 	at org.apache.tuscany.sca.core.databinding.wire.PassByValueInterceptor.invoke(PassByValueInterceptor.java:61)
     [java] 	at org.apache.tuscany.sca.core.invocation.impl.JDKInvocationHandler.invoke(JDKInvocationHandler.java:236)
     [java] 	at org.apache.tuscany.sca.core.invocation.impl.JDKInvocationHandler.invoke(JDKInvocationHandler.java:106)
     [java] 	at $Proxy5.add(Unknown Source)
     [java] 	at calculator.CalculatorClient.main(CalculatorClient.java:40)
     [java] 	... 6 more
     [java] Feb 5, 2010 12:17:31 AM org.apache.tuscany.sca.host.rmi.DefaultRMIHost registerService
     [java] INFO: RMI service registered: rmi://localhost:8099/CalculatorRMIService
     [java] Feb 5, 2010 12:17:31 AM org.apache.tuscany.sca.core.assembly.impl.EndpointRegistryImpl
addEndpoint
     [java] INFO: Add endpoint - (@10232575)Endpoint:  URI = CalculatorServiceComponent#service-binding(CalculatorService/CalculatorService)
     [java] Feb 5, 2010 12:17:31 AM org.apache.tuscany.sca.core.assembly.impl.EndpointRegistryImpl
addEndpoint
     [java] INFO: Add endpoint - (@4456558)Endpoint:  URI = AddServiceComponent#service-binding(AddServiceImpl/AddServiceImpl)
     [java] Feb 5, 2010 12:17:31 AM org.apache.tuscany.sca.core.assembly.impl.EndpointRegistryImpl
addEndpoint
     [java] INFO: Add endpoint - (@7885469)Endpoint:  URI = SubtractServiceComponent#service-binding(SubtractServiceImpl/SubtractServiceImpl)
     [java] Feb 5, 2010 12:17:31 AM org.apache.tuscany.sca.core.assembly.impl.EndpointRegistryImpl
addEndpoint
     [java] INFO: Add endpoint - (@24641333)Endpoint:  URI = MultiplyServiceComponent#service-binding(MultiplyServiceImpl/MultiplyServiceImpl)
     [java] Feb 5, 2010 12:17:31 AM org.apache.tuscany.sca.core.assembly.impl.EndpointRegistryImpl
addEndpoint
     [java] INFO: Add endpoint - (@18088644)Endpoint:  URI = DivideServiceComponent#service-binding(DivideServiceImpl/DivideServiceImpl)
     [java] Hit enter to stop node...
[HUDSON] Archiving <http://hudson.zones.apache.org/hudson/job/Tuscany-2x/ws/sca-2x/itest/distribution/calculator-rmi/pom.xml>
to /export/home/hudson/hudson/jobs/Tuscany-2x/modules/org.apache.tuscany.sca$itest-distribution-calculator-rmi/builds/2010-02-04_22-08-35/archive/org.apache.tuscany.sca/itest-distribution-calculator-rmi/2.0-SNAPSHOT/pom.xml
[HUDSON] Archiving <http://hudson.zones.apache.org/hudson/job/Tuscany-2x/ws/sca-2x/itest/distribution/calculator-rmi/target/itest-distribution-calculator-rmi-2.0-SNAPSHOT.jar>
to /export/home/hudson/hudson/jobs/Tuscany-2x/modules/org.apache.tuscany.sca$itest-distribution-calculator-rmi/builds/2010-02-04_22-08-35/archive/org.apache.tuscany.sca/itest-distribution-calculator-rmi/2.0-SNAPSHOT/itest-distribution-calculator-rmi-2.0-SNAPSHOT.jar
[INFO] ------------------------------------------------------------------------
[ERROR] BUILD ERROR
[INFO] ------------------------------------------------------------------------
[INFO] An Ant BuildException has occured: The following error occurred while executing this
line:
<http://hudson.zones.apache.org/hudson/job/Tuscany-2x/ws/sca-2x/itest/distribution/calculator-rmi/build.xml>:44:
The following error occurred while executing this line:
<http://hudson.zones.apache.org/hudson/job/Tuscany-2x/ws/sca-2x/distribution/all/target/apache-tuscany-sca-all-2.0-SNAPSHOT.dir/tuscany-sca-2.0-SNAPSHOT/samples/calculator-rmi-reference/build.xml>:59:
Java returned: 1

[INFO] ------------------------------------------------------------------------
[INFO] For more information, run Maven with the -e switch
[INFO] ------------------------------------------------------------------------
[INFO] Total time: 128 minutes 41 seconds
[INFO] Finished at: Fri Feb 05 00:17:33 UTC 2010
[INFO] Final Memory: 115M/747M
[INFO] ------------------------------------------------------------------------
Sending e-mails to: commits@tuscany.apache.org
channel stopped


Mime
View raw message