tuscany-commits mailing list archives

Site index · List index
Message view « Date » · « Thread »
Top « Date » · « Thread »
From Apache Hudson Server <hud...@hudson.zones.apache.org>
Subject Build failed in Hudson: Tuscany-2x #484
Date Thu, 11 Feb 2010 00:22:59 GMT
See <http://hudson.zones.apache.org/hudson/job/Tuscany-2x/484/>

------------------------------------------
[...truncated 7866 lines...]
[INFO] Building Apache Tuscany SCA Enterprise Java Feature
[INFO]    task-segment: [clean, install]
[INFO] ------------------------------------------------------------------------
[INFO] [clean:clean {execution: default-clean}]
[INFO] [enforcer:enforce {execution: enforce-plugin-versions}]
[INFO] [site:attach-descriptor {execution: default-attach-descriptor}]
[INFO] [install:install {execution: default-install}]
[INFO] Installing <http://hudson.zones.apache.org/hudson/job/Tuscany-2x/ws/sca-2x/features/ejava/pom.xml>
to /home/hudson/.m2/repository/org/apache/tuscany/sca/tuscany-feature-ejava/2.0-SNAPSHOT/tuscany-feature-ejava-2.0-SNAPSHOT.pom
[HUDSON] Archiving <http://hudson.zones.apache.org/hudson/job/Tuscany-2x/ws/sca-2x/features/ejava/pom.xml>
to /export/home/hudson/hudson/jobs/Tuscany-2x/modules/org.apache.tuscany.sca$tuscany-feature-ejava/builds/2010-02-11_00-12-51/archive/org.apache.tuscany.sca/tuscany-feature-ejava/2.0-SNAPSHOT/pom.xml
[HUDSON] Archiving /home/hudson/.m2/repository/org/apache/tuscany/sca/tuscany-feature-ejava/2.0-SNAPSHOT/tuscany-feature-ejava-2.0-SNAPSHOT.pom
to /export/home/hudson/hudson/jobs/Tuscany-2x/modules/org.apache.tuscany.sca$tuscany-feature-ejava/builds/2010-02-11_00-12-51/archive/org.apache.tuscany.sca/tuscany-feature-ejava/2.0-SNAPSHOT/tuscany-feature-ejava-2.0-SNAPSHOT.pom
[INFO] ------------------------------------------------------------------------
[INFO] Building Apache Tuscany SCA Sample Binding WS Calculator
[INFO]    task-segment: [clean, install]
[INFO] ------------------------------------------------------------------------
[INFO] [clean:clean {execution: default-clean}]
[INFO] Deleting file set: <http://hudson.zones.apache.org/hudson/job/Tuscany-2x/ws/sca-2x/samples/binding-ws-calculator/target>
(included: [**], excluded: [])
[INFO] [enforcer:enforce {execution: enforce-plugin-versions}]
[INFO] [resources:resources {execution: default-resources}]
[WARNING] Using platform encoding (UTF-8 actually) to copy filtered resources, i.e. build
is platform dependent!
[INFO] Copying 2 resources
[INFO] Copying 1 resource
[INFO] [compiler:compile {execution: default-compile}]
[INFO] Invoking Tuscany Eclipse JDT compiler
[INFO] Compiling 13 to <http://hudson.zones.apache.org/hudson/job/Tuscany-2x/ws/sca-2x/samples/binding-ws-calculator/target/classes>
[INFO] [resources:testResources {execution: default-testResources}]
[WARNING] Using platform encoding (UTF-8 actually) to copy filtered resources, i.e. build
is platform dependent!
[INFO] skip non existing resourceDirectory <http://hudson.zones.apache.org/hudson/job/Tuscany-2x/ws/sca-2x/samples/binding-ws-calculator/src/test/resources>
[INFO] [compiler:testCompile {execution: default-testCompile}]
[INFO] Invoking Tuscany Eclipse JDT compiler
[INFO] Compiling 1 to <http://hudson.zones.apache.org/hudson/job/Tuscany-2x/ws/sca-2x/samples/binding-ws-calculator/target/test-classes>
[INFO] [surefire:test {execution: default-test}]
[INFO] Tests are skipped.
[INFO] [jar:jar {execution: default-jar}]
[INFO] Building jar: <http://hudson.zones.apache.org/hudson/job/Tuscany-2x/ws/sca-2x/samples/binding-ws-calculator/target/sample-binding-ws-calculator.jar>
[INFO] [install:install {execution: default-install}]
[INFO] Installing <http://hudson.zones.apache.org/hudson/job/Tuscany-2x/ws/sca-2x/samples/binding-ws-calculator/target/sample-binding-ws-calculator.jar>
to /home/hudson/.m2/repository/org/apache/tuscany/sca/sample-binding-ws-calculator/2.0-SNAPSHOT/sample-binding-ws-calculator-2.0-SNAPSHOT.jar
[HUDSON] Archiving <http://hudson.zones.apache.org/hudson/job/Tuscany-2x/ws/sca-2x/samples/binding-ws-calculator/pom.xml>
to /export/home/hudson/hudson/jobs/Tuscany-2x/modules/org.apache.tuscany.sca$sample-binding-ws-calculator/builds/2010-02-11_00-12-45/archive/org.apache.tuscany.sca/sample-binding-ws-calculator/2.0-SNAPSHOT/pom.xml
[HUDSON] Archiving <http://hudson.zones.apache.org/hudson/job/Tuscany-2x/ws/sca-2x/samples/binding-ws-calculator/target/sample-binding-ws-calculator.jar>
to /export/home/hudson/hudson/jobs/Tuscany-2x/modules/org.apache.tuscany.sca$sample-binding-ws-calculator/builds/2010-02-11_00-12-45/archive/org.apache.tuscany.sca/sample-binding-ws-calculator/2.0-SNAPSHOT/sample-binding-ws-calculator.jar
[INFO] ------------------------------------------------------------------------
[INFO] Building Apache Tuscany SCA Sample Calculator
[INFO]    task-segment: [clean, install]
[INFO] ------------------------------------------------------------------------
[INFO] [clean:clean {execution: default-clean}]
[INFO] Deleting file set: <http://hudson.zones.apache.org/hudson/job/Tuscany-2x/ws/sca-2x/samples/calculator/target>
(included: [**], excluded: [])
[INFO] [enforcer:enforce {execution: enforce-plugin-versions}]
[INFO] [resources:resources {execution: default-resources}]
[WARNING] Using platform encoding (UTF-8 actually) to copy filtered resources, i.e. build
is platform dependent!
[INFO] Copying 2 resources
[INFO] Copying 1 resource
[INFO] [compiler:compile {execution: default-compile}]
[INFO] Invoking Tuscany Eclipse JDT compiler
[INFO] Compiling 11 to <http://hudson.zones.apache.org/hudson/job/Tuscany-2x/ws/sca-2x/samples/calculator/target/classes>
[INFO] [resources:testResources {execution: default-testResources}]
[WARNING] Using platform encoding (UTF-8 actually) to copy filtered resources, i.e. build
is platform dependent!
[INFO] skip non existing resourceDirectory <http://hudson.zones.apache.org/hudson/job/Tuscany-2x/ws/sca-2x/samples/calculator/src/test/resources>
[INFO] [compiler:testCompile {execution: default-testCompile}]
[INFO] Invoking Tuscany Eclipse JDT compiler
[INFO] Compiling 1 to <http://hudson.zones.apache.org/hudson/job/Tuscany-2x/ws/sca-2x/samples/calculator/target/test-classes>
[INFO] [surefire:test {execution: default-test}]
[INFO] Concurrency config is {parallel=classes, configurableParallelComputerPresent=false}
[INFO] Surefire report directory: <http://hudson.zones.apache.org/hudson/job/Tuscany-2x/ws/sca-2x/samples/calculator/target/surefire-reports>

-------------------------------------------------------
 T E S T S
-------------------------------------------------------
Feb 11, 2010 12:21:50 AM org.apache.tuscany.sca.node.impl.NodeImpl start
INFO: Starting node: http://tuscany.apache.org/sca/1.1/nodes/default0 domain: default
Feb 11, 2010 12:21:50 AM org.apache.tuscany.sca.node.impl.NodeFactoryImpl loadContributions
INFO: Loading contribution: <http://hudson.zones.apache.org/hudson/job/Tuscany-2x/ws/sca-2x/samples/calculator/target/classes/>
Feb 11, 2010 12:21:51 AM org.apache.tuscany.sca.core.assembly.impl.EndpointRegistryImpl addEndpoint
INFO: Add endpoint - (@20296179)Endpoint:  URI = CalculatorServiceComponent#service-binding(CalculatorService/CalculatorService)
Feb 11, 2010 12:21:51 AM org.apache.tuscany.sca.core.assembly.impl.EndpointRegistryImpl addEndpoint
INFO: Add endpoint - (@3532515)Endpoint:  URI = AddServiceComponent#service-binding(AddService/AddService)
Feb 11, 2010 12:21:51 AM org.apache.tuscany.sca.core.assembly.impl.EndpointRegistryImpl addEndpoint
INFO: Add endpoint - (@13198090)Endpoint:  URI = SubtractServiceComponent#service-binding(SubtractService/SubtractService)
Feb 11, 2010 12:21:51 AM org.apache.tuscany.sca.core.assembly.impl.EndpointRegistryImpl addEndpoint
INFO: Add endpoint - (@25515818)Endpoint:  URI = MultiplyServiceComponent#service-binding(MultiplyService/MultiplyService)
Feb 11, 2010 12:21:51 AM org.apache.tuscany.sca.core.assembly.impl.EndpointRegistryImpl addEndpoint
INFO: Add endpoint - (@18721294)Endpoint:  URI = DivideServiceComponent#service-binding(DivideService/DivideService)
Feb 11, 2010 12:21:51 AM org.apache.tuscany.sca.node.impl.NodeImpl stop
INFO: Stopping node: http://tuscany.apache.org/sca/1.1/nodes/default0
Running calculator.CalculatorTestCase
Tests run: 1, Failures: 0, Errors: 0, Skipped: 0, Time elapsed: 0.008 sec

Results :

Tests run: 1, Failures: 0, Errors: 0, Skipped: 0

[HUDSON] Recording test results
[INFO] [jar:jar {execution: default-jar}]
[INFO] Building jar: <http://hudson.zones.apache.org/hudson/job/Tuscany-2x/ws/sca-2x/samples/calculator/target/sample-calculator.jar>
[INFO] [install:install {execution: default-install}]
[INFO] Installing <http://hudson.zones.apache.org/hudson/job/Tuscany-2x/ws/sca-2x/samples/calculator/target/sample-calculator.jar>
to /home/hudson/.m2/repository/org/apache/tuscany/sca/sample-calculator/2.0-SNAPSHOT/sample-calculator-2.0-SNAPSHOT.jar
[HUDSON] Archiving <http://hudson.zones.apache.org/hudson/job/Tuscany-2x/ws/sca-2x/samples/calculator/pom.xml>
to /export/home/hudson/hudson/jobs/Tuscany-2x/modules/org.apache.tuscany.sca$sample-calculator/builds/2010-02-11_00-12-45/archive/org.apache.tuscany.sca/sample-calculator/2.0-SNAPSHOT/pom.xml
[HUDSON] Archiving <http://hudson.zones.apache.org/hudson/job/Tuscany-2x/ws/sca-2x/samples/calculator/target/sample-calculator.jar>
to /export/home/hudson/hudson/jobs/Tuscany-2x/modules/org.apache.tuscany.sca$sample-calculator/builds/2010-02-11_00-12-45/archive/org.apache.tuscany.sca/sample-calculator/2.0-SNAPSHOT/sample-calculator.jar
[INFO] ------------------------------------------------------------------------
[INFO] Building Apache Tuscany SCA Sample Calculator Equinox
[INFO]    task-segment: [clean, install]
[INFO] ------------------------------------------------------------------------
[INFO] [clean:clean {execution: default-clean}]
[INFO] Deleting file set: <http://hudson.zones.apache.org/hudson/job/Tuscany-2x/ws/sca-2x/samples/calculator-equinox/target>
(included: [**], excluded: [])
[INFO] [enforcer:enforce {execution: enforce-plugin-versions}]
[INFO] [resources:resources {execution: default-resources}]
[WARNING] Using platform encoding (UTF-8 actually) to copy filtered resources, i.e. build
is platform dependent!
[INFO] Copying 1 resource
[INFO] Copying 1 resource
[INFO] [compiler:compile {execution: default-compile}]
[INFO] Invoking Tuscany Eclipse JDT compiler
[INFO] Compiling 11 to <http://hudson.zones.apache.org/hudson/job/Tuscany-2x/ws/sca-2x/samples/calculator-equinox/target/classes>
[INFO] [resources:testResources {execution: default-testResources}]
[WARNING] Using platform encoding (UTF-8 actually) to copy filtered resources, i.e. build
is platform dependent!
[INFO] skip non existing resourceDirectory <http://hudson.zones.apache.org/hudson/job/Tuscany-2x/ws/sca-2x/samples/calculator-equinox/src/test/resources>
[INFO] [compiler:testCompile {execution: default-testCompile}]
[INFO] Invoking Tuscany Eclipse JDT compiler
[INFO] Compiling 1 to <http://hudson.zones.apache.org/hudson/job/Tuscany-2x/ws/sca-2x/samples/calculator-equinox/target/test-classes>
[INFO] [surefire:test {execution: default-test}]
[INFO] Concurrency config is {parallel=classes, configurableParallelComputerPresent=false}
[INFO] Surefire report directory: <http://hudson.zones.apache.org/hudson/job/Tuscany-2x/ws/sca-2x/samples/calculator-equinox/target/surefire-reports>

-------------------------------------------------------
 T E S T S
-------------------------------------------------------
SCA Node API ClassLoader: sun.misc.Launcher$AppClassLoader@360be0
Feb 11, 2010 12:21:54 AM org.apache.tuscany.sca.node.impl.NodeImpl start
INFO: Starting node: http://tuscany.apache.org/sca/1.1/nodes/default0 domain: default
Feb 11, 2010 12:21:54 AM org.apache.tuscany.sca.node.impl.NodeFactoryImpl loadContributions
INFO: Loading contribution: <http://hudson.zones.apache.org/hudson/job/Tuscany-2x/ws/sca-2x/samples/calculator-equinox/target/classes/>
Feb 11, 2010 12:21:55 AM org.apache.tuscany.sca.node.impl.NodeImpl stop
INFO: Stopping node: http://tuscany.apache.org/sca/1.1/nodes/default0

Results :

Tests run: 0, Failures: 0, Errors: 0, Skipped: 0

[HUDSON] Recording test results
[INFO] [jar:jar {execution: default-jar}]
[INFO] Building jar: <http://hudson.zones.apache.org/hudson/job/Tuscany-2x/ws/sca-2x/samples/calculator-equinox/target/sample-calculator-equinox.jar>
[INFO] [install:install {execution: default-install}]
[INFO] Installing <http://hudson.zones.apache.org/hudson/job/Tuscany-2x/ws/sca-2x/samples/calculator-equinox/target/sample-calculator-equinox.jar>
to /home/hudson/.m2/repository/org/apache/tuscany/sca/sample-calculator-equinox/2.0-SNAPSHOT/sample-calculator-equinox-2.0-SNAPSHOT.jar
[HUDSON] Archiving <http://hudson.zones.apache.org/hudson/job/Tuscany-2x/ws/sca-2x/samples/calculator-equinox/pom.xml>
to /export/home/hudson/hudson/jobs/Tuscany-2x/modules/org.apache.tuscany.sca$sample-calculator-equinox/builds/2010-02-11_00-12-45/archive/org.apache.tuscany.sca/sample-calculator-equinox/2.0-SNAPSHOT/pom.xml
[HUDSON] Archiving <http://hudson.zones.apache.org/hudson/job/Tuscany-2x/ws/sca-2x/samples/calculator-equinox/target/sample-calculator-equinox.jar>
to /export/home/hudson/hudson/jobs/Tuscany-2x/modules/org.apache.tuscany.sca$sample-calculator-equinox/builds/2010-02-11_00-12-45/archive/org.apache.tuscany.sca/sample-calculator-equinox/2.0-SNAPSHOT/sample-calculator-equinox.jar
[INFO] ------------------------------------------------------------------------
[INFO] Building Apache Tuscany SCA Sample Calculator OSGi
[INFO]    task-segment: [clean, install]
[INFO] ------------------------------------------------------------------------
[INFO] [clean:clean {execution: default-clean}]
[INFO] Deleting file set: <http://hudson.zones.apache.org/hudson/job/Tuscany-2x/ws/sca-2x/samples/calculator-osgi/target>
(included: [**], excluded: [])
[INFO] [enforcer:enforce {execution: enforce-plugin-versions}]
[INFO] [resources:resources {execution: default-resources}]
[WARNING] Using platform encoding (UTF-8 actually) to copy filtered resources, i.e. build
is platform dependent!
[INFO] Copying 1 resource
[INFO] Copying 2 resources
[INFO] [compiler:compile {execution: default-compile}]
[INFO] Invoking Tuscany Eclipse JDT compiler
[INFO] Compiling 12 to <http://hudson.zones.apache.org/hudson/job/Tuscany-2x/ws/sca-2x/samples/calculator-osgi/target/classes>
[INFO] Resolving OSGi bundle: sample-calculator-osgi
[INFO] OSGi bundle is resolved: sample-calculator-osgi
[INFO] [resources:testResources {execution: default-testResources}]
[WARNING] Using platform encoding (UTF-8 actually) to copy filtered resources, i.e. build
is platform dependent!
[INFO] skip non existing resourceDirectory <http://hudson.zones.apache.org/hudson/job/Tuscany-2x/ws/sca-2x/samples/calculator-osgi/src/test/resources>
[INFO] [compiler:testCompile {execution: default-testCompile}]
[INFO] Invoking Tuscany Eclipse JDT compiler
[INFO] Compiling 1 to <http://hudson.zones.apache.org/hudson/job/Tuscany-2x/ws/sca-2x/samples/calculator-osgi/target/test-classes>
[INFO] [surefire:test {execution: default-test}]
[INFO] Concurrency config is {parallel=classes, configurableParallelComputerPresent=false}
[INFO] Surefire report directory: <http://hudson.zones.apache.org/hudson/job/Tuscany-2x/ws/sca-2x/samples/calculator-osgi/target/surefire-reports>

-------------------------------------------------------
 T E S T S
-------------------------------------------------------
SCA Node API ClassLoader: sun.misc.Launcher$AppClassLoader@360be0
Feb 11, 2010 12:21:58 AM org.apache.tuscany.sca.node.impl.NodeImpl start
INFO: Starting node: http://tuscany.apache.org/sca/1.1/nodes/default0 domain: default
Feb 11, 2010 12:21:58 AM org.apache.tuscany.sca.node.impl.NodeFactoryImpl loadContributions
INFO: Loading contribution: <http://hudson.zones.apache.org/hudson/job/Tuscany-2x/ws/sca-2x/samples/calculator-osgi/target/classes/>
Feb 11, 2010 12:21:59 AM org.apache.tuscany.sca.core.assembly.impl.EndpointRegistryImpl addEndpoint
INFO: Add endpoint - (@21422977)Endpoint:  URI = CalculatorServiceComponent#service-binding(CalculatorServiceImpl/CalculatorServiceImpl)
Feb 11, 2010 12:21:59 AM org.apache.tuscany.sca.core.assembly.impl.EndpointRegistryImpl addEndpoint
INFO: Add endpoint - (@16927124)Endpoint:  URI = AddServiceComponent#service-binding(AddServiceImpl/AddServiceImpl)
Feb 11, 2010 12:21:59 AM org.apache.tuscany.sca.core.assembly.impl.EndpointRegistryImpl addEndpoint
INFO: Add endpoint - (@19714461)Endpoint:  URI = SubtractServiceComponent#service-binding(SubtractServiceImpl/SubtractServiceImpl)
Feb 11, 2010 12:21:59 AM org.apache.tuscany.sca.core.assembly.impl.EndpointRegistryImpl addEndpoint
INFO: Add endpoint - (@24485138)Endpoint:  URI = MultiplyServiceComponent#service-binding(MultiplyServiceImpl/MultiplyServiceImpl)
Feb 11, 2010 12:21:59 AM org.apache.tuscany.sca.core.assembly.impl.EndpointRegistryImpl addEndpoint
INFO: Add endpoint - (@10168913)Endpoint:  URI = DivideServiceComponent#service-binding(DivideServiceImpl/DivideServiceImpl)
Feb 11, 2010 12:21:59 AM org.apache.tuscany.sca.core.assembly.impl.EndpointRegistryImpl addEndpoint
INFO: Add endpoint - (@16200795)Endpoint:  URI = CalculatorClient#service-binding(CalculatorClient/CalculatorClient)
SCA API ClassLoader: sun.misc.Launcher$AppClassLoader@360be0
3 + 2=5.0
3 - 2=1.0
3 * 2=6.0
3 / 2=1.5
Feb 11, 2010 12:21:59 AM org.apache.tuscany.sca.node.impl.NodeImpl stop
INFO: Stopping node: http://tuscany.apache.org/sca/1.1/nodes/default0
Running calculator.CalculatorTestCase
Tests run: 1, Failures: 0, Errors: 0, Skipped: 0, Time elapsed: 0.009 sec

Results :

Tests run: 1, Failures: 0, Errors: 0, Skipped: 0

[HUDSON] Recording test results
[INFO] [osgi-junit:test {execution: osgi-test}]
[INFO] snapshot org.apache.tuscany.sca:tuscany-extensibility-equinox:2.0-SNAPSHOT: checking
for updates from apache.snapshots
[INFO] snapshot org.apache.tuscany.sca:tuscany-extensibility-equinox:2.0-SNAPSHOT: checking
for updates from codehaus-snapshot
[INFO] snapshot org.apache.tuscany.sca:tuscany-contribution-osgi:2.0-SNAPSHOT: checking for
updates from apache.snapshots
[INFO] snapshot org.apache.tuscany.sca:tuscany-contribution-osgi:2.0-SNAPSHOT: checking for
updates from codehaus-snapshot
[INFO] Generating <http://hudson.zones.apache.org/hudson/job/Tuscany-2x/ws/sca-2x/samples/calculator-osgi/target/sample-calculator-osgi-osgi.jar>
[INFO] Generating <http://hudson.zones.apache.org/hudson/job/Tuscany-2x/ws/sca-2x/samples/calculator-osgi/target/sample-calculator-osgi-osgi-tests.jar>
[INFO] Surefire report directory: <http://hudson.zones.apache.org/hudson/job/Tuscany-2x/ws/sca-2x/samples/calculator-osgi/target/surefire-osgi-reports>

-------------------------------------------------------
 T E S T S
-------------------------------------------------------
Running calculator.CalculatorTestCase
SCA Node API ClassLoader: org.eclipse.osgi.internal.baseadaptor.DefaultClassLoader@e753
Feb 11, 2010 12:22:03 AM org.apache.tuscany.sca.node.impl.NodeImpl start
INFO: Starting node: http://tuscany.apache.org/sca/1.1/nodes/default0 domain: default
Feb 11, 2010 12:22:03 AM org.apache.tuscany.sca.node.impl.NodeFactoryImpl loadContributions
INFO: Loading contribution: <http://hudson.zones.apache.org/hudson/job/Tuscany-2x/ws/sca-2x/samples/calculator-osgi/target/sample-calculator-osgi-osgi.jar>
Feb 11, 2010 12:22:04 AM org.apache.tuscany.sca.node.impl.NodeImpl stop
INFO: Stopping node: http://tuscany.apache.org/sca/1.1/nodes/default0
Tests run: 1, Failures: 0, Errors: 1, Skipped: 0, Time elapsed: 1.015 sec <<< FAILURE!

Results :

Tests in error: 
  calculator.CalculatorTestCase

Tests run: 1, Failures: 0, Errors: 1, Skipped: 0

[HUDSON] Archiving <http://hudson.zones.apache.org/hudson/job/Tuscany-2x/ws/sca-2x/samples/calculator-osgi/pom.xml>
to /export/home/hudson/hudson/jobs/Tuscany-2x/modules/org.apache.tuscany.sca$sample-calculator-osgi/builds/2010-02-11_00-12-45/archive/org.apache.tuscany.sca/sample-calculator-osgi/2.0-SNAPSHOT/pom.xml
[INFO] ------------------------------------------------------------------------
[ERROR] BUILD FAILURE
[INFO] ------------------------------------------------------------------------
[INFO] There are test failures.

Please refer to <http://hudson.zones.apache.org/hudson/job/Tuscany-2x/ws/sca-2x/samples/calculator-osgi/target/surefire-osgi-reports>
for the individual test results.
[INFO] ------------------------------------------------------------------------
[INFO] For more information, run Maven with the -e switch
[INFO] ------------------------------------------------------------------------
[INFO] Total time: 8 minutes 59 seconds
[INFO] Finished at: Thu Feb 11 00:22:13 UTC 2010
[INFO] Final Memory: 88M/751M
[INFO] ------------------------------------------------------------------------
Waiting for Hudson to finish collecting data
Sending e-mails to: commits@tuscany.apache.org
Sending e-mails to: commits@tuscany.apache.org
channel stopped


Mime
View raw message