tez-issues mailing list archives

Site index · List index
Message view « Date » · « Thread »
Top « Date » · « Thread »
From Apache Jenkins Server <jenk...@builds.apache.org>
Subject Failed: TEZ-3985 PreCommit Build #2902
Date Tue, 28 Aug 2018 19:45:08 GMT
Jira: https://issues.apache.org/jira/browse/TEZ-3985
Build: https://builds.apache.org/job/PreCommit-TEZ-Build/2902/

###################################################################################
########################## LAST 60 LINES OF THE CONSOLE ###########################
[...truncated 373.23 KB...]
[ERROR] For more information about the errors and possible solutions, please read the following
articles:
[ERROR] [Help 1] http://cwiki.apache.org/confluence/display/MAVEN/MojoFailureException
[ERROR] [Help 2] http://cwiki.apache.org/confluence/display/MAVEN/MojoExecutionException
[ERROR] 
[ERROR] After correcting the problems, you can resume the build with the command
[ERROR]   mvn <goals> -rf :tez-tests
[INFO] Build failures were ignored.




{color:red}-1 overall{color}.  Here are the results of testing the latest attachment
  http://issues.apache.org/jira/secure/attachment/12937490/TEZ-3985.2.patch
  against master revision a37a367.

    {color:green}+1 @author{color}.  The patch does not contain any @author tags.

    {color:green}+1 tests included{color}.  The patch appears to include 1 new or modified
test files.

    {color:green}+1 javac{color}.  The applied patch does not increase the total number of
javac compiler warnings.

    {color:green}+1 javadoc{color}.  There were no new javadoc warning messages.

    {color:green}+1 findbugs{color}.  The patch does not introduce any new Findbugs (version
3.0.1) warnings.

    {color:green}+1 release audit{color}.  The applied patch does not increase the total number
of release audit warnings.

    {color:red}-1 core tests{color}.  The patch failed these unit tests in :
                   org.apache.tez.test.TestRecovery

Test results: https://builds.apache.org/job/PreCommit-TEZ-Build/2902//testReport/
Console output: https://builds.apache.org/job/PreCommit-TEZ-Build/2902//console

This message is automatically generated.


======================================================================
======================================================================
    Adding comment to Jira.
======================================================================
======================================================================




======================================================================
======================================================================
    Finished build.
======================================================================
======================================================================


Build step 'Execute shell' marked build as failure
Archiving artifacts
[Fast Archiver] Compressed 4.09 MB of artifacts by 11.5% relative to #2901
[description-setter] Could not determine description.
Recording test results
Email was triggered for: Failure - Any
Sending email for trigger: Failure - Any



###################################################################################
############################## FAILED TESTS (if any) ##############################
1 tests failed.
FAILED:  org.apache.tez.test.TestRecovery.testRecovery_HashJoin

Error Message:
port out of range:-1

Stack Trace:
java.lang.IllegalArgumentException: port out of range:-1
	at java.net.InetSocketAddress.checkPort(InetSocketAddress.java:143)
	at java.net.InetSocketAddress.<init>(InetSocketAddress.java:188)
	at org.apache.hadoop.net.NetUtils.createSocketAddrForHost(NetUtils.java:243)
	at org.apache.tez.client.TezClientUtils.getAMProxy(TezClientUtils.java:927)
	at org.apache.tez.dag.api.client.rpc.DAGClientRPCImpl.createAMProxyIfNeeded(DAGClientRPCImpl.java:288)
	at org.apache.tez.dag.api.client.rpc.DAGClientRPCImpl.getDAGStatus(DAGClientRPCImpl.java:95)
	at org.apache.tez.dag.api.client.DAGClientImpl.getDAGStatusViaAM(DAGClientImpl.java:376)
	at org.apache.tez.dag.api.client.DAGClientImpl.getDAGStatusInternal(DAGClientImpl.java:221)
	at org.apache.tez.dag.api.client.DAGClientImpl.getDAGStatus(DAGClientImpl.java:208)
	at org.apache.tez.dag.api.client.DAGClientImpl._waitForCompletionWithStatusUpdates(DAGClientImpl.java:555)
	at org.apache.tez.dag.api.client.DAGClientImpl.waitForCompletionWithStatusUpdates(DAGClientImpl.java:354)
	at org.apache.tez.examples.TezExampleBase.runDag(TezExampleBase.java:200)
	at org.apache.tez.examples.HashJoinExample.runJob(HashJoinExample.java:130)
	at org.apache.tez.examples.TezExampleBase._execute(TezExampleBase.java:245)
	at org.apache.tez.examples.TezExampleBase.run(TezExampleBase.java:126)
	at org.apache.tez.test.TestRecovery.testHashJoinExample(TestRecovery.java:531)
	at org.apache.tez.test.TestRecovery.testRecovery_HashJoin(TestRecovery.java:457)
Mime
  • Unnamed multipart/mixed (inline, None, 0 bytes)
View raw message