tez-issues mailing list archives

Site index · List index
Message view « Date » · « Thread »
Top « Date » · « Thread »
From Apache Jenkins Server <jenk...@builds.apache.org>
Subject Failed: TEZ-3698 PreCommit Build #2519
Date Fri, 09 Jun 2017 22:54:20 GMT
Jira: https://issues.apache.org/jira/browse/TEZ-3698
Build: https://builds.apache.org/job/PreCommit-TEZ-Build/2519/

###################################################################################
########################## LAST 60 LINES OF THE CONSOLE ###########################
[...truncated 336.37 KB...]
[ERROR] 
[ERROR] After correcting the problems, you can resume the build with the command
[ERROR]   mvn <goals> -rf :tez-runtime-library
[INFO] Build failures were ignored.




{color:red}-1 overall{color}.  Here are the results of testing the latest attachment
  http://issues.apache.org/jira/secure/attachment/12872198/TEZ-3698.4.patch
  against master revision 29b45bc.

    {color:green}+1 @author{color}.  The patch does not contain any @author tags.

    {color:green}+1 tests included{color}.  The patch appears to include 1 new or modified
test files.

    {color:green}+1 javac{color}.  The applied patch does not increase the total number of
javac compiler warnings.

    {color:green}+1 javadoc{color}.  There were no new javadoc warning messages.

    {color:green}+1 findbugs{color}.  The patch does not introduce any new Findbugs (version
3.0.1) warnings.

    {color:green}+1 release audit{color}.  The applied patch does not increase the total number
of release audit warnings.

    {color:red}-1 core tests{color}.  The patch failed these unit tests in :
                   org.apache.tez.runtime.library.output.TestOnFileUnorderedKVOutput
                  org.apache.tez.runtime.library.common.writers.TestUnorderedPartitionedKVWriter

Test results: https://builds.apache.org/job/PreCommit-TEZ-Build/2519//testReport/
Console output: https://builds.apache.org/job/PreCommit-TEZ-Build/2519//console

This message is automatically generated.


======================================================================
======================================================================
    Adding comment to Jira.
======================================================================
======================================================================


Comment added.
fca6be147c260daa299f5b54d036f6d82f024cb7 logged out


======================================================================
======================================================================
    Finished build.
======================================================================
======================================================================


Build step 'Execute shell' marked build as failure
Archiving artifacts
Compressed 3.50 MB of artifacts by 10.7% relative to #2515
[description-setter] Could not determine description.
Recording test results
Email was triggered for: Failure - Any
Sending email for trigger: Failure - Any



###################################################################################
############################## FAILED TESTS (if any) ##############################
2 tests failed.
FAILED:  org.apache.tez.runtime.library.common.writers.TestUnorderedPartitionedKVWriter.testMultipleSpills_WithPipelinedShuffle[test[true,
PRECISE]]

Error Message:
Task com.google.common.util.concurrent.ListenableFutureTask@6a73359f rejected from java.util.concurrent.ThreadPoolExecutor@2c13c88a[Running,
pool size = 2, active threads = 2, queued tasks = 0, completed tasks = 1]

Stack Trace:
java.util.concurrent.RejectedExecutionException: Task com.google.common.util.concurrent.ListenableFutureTask@6a73359f
rejected from java.util.concurrent.ThreadPoolExecutor@2c13c88a[Running, pool size = 2, active
threads = 2, queued tasks = 0, completed tasks = 1]
	at java.util.concurrent.ThreadPoolExecutor$AbortPolicy.rejectedExecution(ThreadPoolExecutor.java:2047)
	at java.util.concurrent.ThreadPoolExecutor.reject(ThreadPoolExecutor.java:823)
	at java.util.concurrent.ThreadPoolExecutor.execute(ThreadPoolExecutor.java:1369)
	at com.google.common.util.concurrent.MoreExecutors$ListeningDecorator.execute(MoreExecutors.java:440)
	at com.google.common.util.concurrent.AbstractListeningExecutorService.submit(AbstractListeningExecutorService.java:56)
	at org.apache.tez.runtime.library.common.writers.UnorderedPartitionedKVWriter.scheduleSpill(UnorderedPartitionedKVWriter.java:498)
	at org.apache.tez.runtime.library.common.writers.UnorderedPartitionedKVWriter.mayBeSpill(UnorderedPartitionedKVWriter.java:472)
	at org.apache.tez.runtime.library.common.writers.UnorderedPartitionedKVWriter.getNextAvailableBuffer(UnorderedPartitionedKVWriter.java:536)
	at org.apache.tez.runtime.library.common.writers.UnorderedPartitionedKVWriter.setupNextBuffer(UnorderedPartitionedKVWriter.java:462)
	at org.apache.tez.runtime.library.common.writers.UnorderedPartitionedKVWriter.write(UnorderedPartitionedKVWriter.java:408)
	at org.apache.tez.runtime.library.common.writers.UnorderedPartitionedKVWriter.write(UnorderedPartitionedKVWriter.java:360)
	at org.apache.tez.runtime.library.common.writers.TestUnorderedPartitionedKVWriter.baseTestWithPipelinedTransfer(TestUnorderedPartitionedKVWriter.java:670)
	at org.apache.tez.runtime.library.common.writers.TestUnorderedPartitionedKVWriter.testMultipleSpills_WithPipelinedShuffle(TestUnorderedPartitionedKVWriter.java:603)


FAILED:  org.apache.tez.runtime.library.output.TestOnFileUnorderedKVOutput.testWithPipelinedShuffle

Error Message:
null

Stack Trace:
java.lang.AssertionError: null
	at org.junit.Assert.fail(Assert.java:86)
	at org.junit.Assert.assertTrue(Assert.java:41)
	at org.junit.Assert.assertTrue(Assert.java:52)
	at org.apache.tez.runtime.library.output.TestOnFileUnorderedKVOutput.testWithPipelinedShuffle(TestOnFileUnorderedKVOutput.java:191)
Mime
  • Unnamed multipart/mixed (inline, None, 0 bytes)
View raw message