tez-issues mailing list archives

Site index · List index
Message view « Date » · « Thread »
Top « Date » · « Thread »
From Apache Jenkins Server <jenk...@builds.apache.org>
Subject Failed: TEZ-3753 PreCommit Build #2517
Date Tue, 06 Jun 2017 21:53:25 GMT
Jira: https://issues.apache.org/jira/browse/TEZ-3753
Build: https://builds.apache.org/job/PreCommit-TEZ-Build/2517/

###################################################################################
########################## LAST 60 LINES OF THE CONSOLE ###########################
[...truncated 335.28 KB...]
[ERROR] After correcting the problems, you can resume the build with the command
[ERROR]   mvn <goals> -rf :tez-job-analyzer
[INFO] Build failures were ignored.




{color:red}-1 overall{color}.  Here are the results of testing the latest attachment
  http://issues.apache.org/jira/secure/attachment/12871685/tez-3753.001.patch
  against master revision 29b45bc.

    {color:green}+1 @author{color}.  The patch does not contain any @author tags.

    {color:red}-1 tests included{color}.  The patch doesn't appear to include any new or modified
tests.
                        Please justify why no new tests are needed for this patch.
                        Also please list what manual steps were performed to verify this patch.

    {color:green}+1 javac{color}.  The applied patch does not increase the total number of
javac compiler warnings.

    {color:green}+1 javadoc{color}.  There were no new javadoc warning messages.

    {color:green}+1 findbugs{color}.  The patch does not introduce any new Findbugs (version
3.0.1) warnings.

    {color:green}+1 release audit{color}.  The applied patch does not increase the total number
of release audit warnings.

    {color:red}-1 core tests{color}.  The patch failed these unit tests in :
                   org.apache.tez.analyzer.TestAnalyzer

Test results: https://builds.apache.org/job/PreCommit-TEZ-Build/2517//testReport/
Console output: https://builds.apache.org/job/PreCommit-TEZ-Build/2517//console

This message is automatically generated.


======================================================================
======================================================================
    Adding comment to Jira.
======================================================================
======================================================================


Comment added.
27065a89dbd2972f55b2a63397ff04944fb0bb32 logged out


======================================================================
======================================================================
    Finished build.
======================================================================
======================================================================


Build step 'Execute shell' marked build as failure
Archiving artifacts
Compressed 3.50 MB of artifacts by 10.7% relative to #2515
[description-setter] Could not determine description.
Recording test results
Email was triggered for: Failure - Any
Sending email for trigger: Failure - Any



###################################################################################
############################## FAILED TESTS (if any) ##############################
1 tests failed.
FAILED:  org.apache.tez.analyzer.TestAnalyzer.testWithATS

Error Message:
null

Stack Trace:
java.lang.AssertionError: null
	at org.junit.Assert.fail(Assert.java:86)
	at org.junit.Assert.assertTrue(Assert.java:41)
	at org.junit.Assert.assertTrue(Assert.java:52)
	at org.apache.tez.analyzer.TestAnalyzer.getDagInfo(TestAnalyzer.java:264)
	at org.apache.tez.analyzer.TestAnalyzer.verify(TestAnalyzer.java:251)
	at org.apache.tez.analyzer.TestAnalyzer.runTests(TestAnalyzer.java:390)
	at org.apache.tez.analyzer.TestAnalyzer.testWithATS(TestAnalyzer.java:354)
Mime
  • Unnamed multipart/mixed (inline, None, 0 bytes)
View raw message