tephra-dev mailing list archives

Site index · List index
Message view « Date » · « Thread »
Top « Date » · « Thread »
From "Lars Hofhansl (JIRA)" <j...@apache.org>
Subject [jira] [Commented] (TEPHRA-303) HBase 1.1 tests don't compile
Date Fri, 28 Jun 2019 04:50:00 GMT

    [ https://issues.apache.org/jira/browse/TEPHRA-303?page=com.atlassian.jira.plugin.system.issuetabpanels:comment-tabpanel&focusedCommentId=16874673#comment-16874673
] 

Lars Hofhansl commented on TEPHRA-303:
--------------------------------------

Hmm... Weird! I do the same and I get:
{code:java}
[INFO] 14 errors
[INFO] -------------------------------------------------------------
[INFO] ------------------------------------------------------------------------
[INFO] Reactor Summary for Apache Tephra 0.16.0-incubating-SNAPSHOT:
[INFO]
[INFO] Apache Tephra ...................................... SUCCESS [ 2.639 s]
[INFO] Apache Tephra API .................................. SUCCESS [ 1.669 s]
[INFO] Apache Tephra Core ................................. SUCCESS [ 7.824 s]
[INFO] Apache Tephra HBase 1.1 Compatibility Base ......... SUCCESS [ 3.411 s]
[INFO] Apache Tephra HBase 1.1 Compatibility .............. FAILURE [ 0.471 s]
[INFO] Apache Tephra HBase 1.2 Compatibility .............. SKIPPED
[INFO] Apache Tephra Examples ............................. SKIPPED
[INFO] Apache Tephra Examples For Hbase 1.1 ............... SKIPPED
[INFO] Apache Tephra Examples For HBase 1.2 ............... SKIPPED
[INFO] ------------------------------------------------------------------------
[INFO] BUILD FAILURE
[INFO] ------------------------------------------------------------------------
[INFO] Total time: 16.484 s
[INFO] Finished at: 2019-06-27T21:48:49-07:00
[INFO] ------------------------------------------------------------------------
[ERROR] Failed to execute goal org.apache.maven.plugins:maven-compiler-plugin:3.1:compile
(default-compile) on project tephra-hbase-compat-1.1: Compilation failure: Compilation failure:
[ERROR] /home/lars/dev/incubator-tephra/tephra-hbase-compat-1.1-base/src/main/java/org/apache/tephra/hbase/coprocessor/TransactionProcessor.java:[105,8]
duplicate class: org.apache.tephra.hbase.coprocessor.TransactionProcessor
[ERROR] /home/lars/dev/incubator-tephra/tephra-hbase-compat-1.1-base/src/main/java/org/apache/tephra/hbase/txprune/InvalidListPruningDebugTool.java:[61,8]
duplicate class: org.apache.tephra.hbase.txprune.InvalidListPruningDebugTool
[ERROR] /home/lars/dev/incubator-tephra/tephra-hbase-compat-1.1-base/src/main/java/org/apache/tephra/hbase/txprune/DataJanitorState.java:[56,8]
duplicate class: org.apache.tephra.hbase.txprune.DataJanitorState
[ERROR] /home/lars/dev/incubator-tephra/tephra-hbase-compat-1.1-base/src/main/java/org/apache/tephra/hbase/HBase11ConfigurationProvider.java:[28,8]
duplicate class: org.apache.tephra.hbase.HBase11ConfigurationProvider
[ERROR] /home/lars/dev/incubator-tephra/tephra-hbase-compat-1.1-base/src/main/java/org/apache/tephra/hbase/txprune/TimeRegions.java:[34,8]
duplicate class: org.apache.tephra.hbase.txprune.TimeRegions
[ERROR] /home/lars/dev/incubator-tephra/tephra-hbase-compat-1.1-base/src/main/java/org/apache/tephra/hbase/txprune/PruneUpperBoundWriterSupplier.java:[30,8]
duplicate class: org.apache.tephra.hbase.txprune.PruneUpperBoundWriterSupplier
[ERROR] /home/lars/dev/incubator-tephra/tephra-hbase-compat-1.1-base/src/main/java/org/apache/tephra/hbase/coprocessor/CellSkipFilter.java:[38,8]
duplicate class: org.apache.tephra.hbase.coprocessor.CellSkipFilter
[ERROR] /home/lars/dev/incubator-tephra/tephra-hbase-compat-1.1-base/src/main/java/org/apache/tephra/hbase/coprocessor/TransactionFilters.java:[31,8]
duplicate class: org.apache.tephra.hbase.coprocessor.TransactionFilters
[ERROR] /home/lars/dev/incubator-tephra/tephra-hbase-compat-1.1-base/src/main/java/org/apache/tephra/hbase/SecondaryIndexTable.java:[51,8]
duplicate class: org.apache.tephra.hbase.SecondaryIndexTable
[ERROR] /home/lars/dev/incubator-tephra/tephra-hbase-compat-1.1-base/src/main/java/org/apache/tephra/hbase/coprocessor/TransactionVisibilityFilter.java:[45,8]
duplicate class: org.apache.tephra.hbase.coprocessor.TransactionVisibilityFilter
[ERROR] /home/lars/dev/incubator-tephra/tephra-hbase-compat-1.1-base/src/main/java/org/apache/tephra/hbase/txprune/HBaseTransactionPruningPlugin.java:[117,8]
duplicate class: org.apache.tephra.hbase.txprune.HBaseTransactionPruningPlugin
[ERROR] /home/lars/dev/incubator-tephra/tephra-hbase-compat-1.1-base/src/main/java/org/apache/tephra/hbase/txprune/CompactionState.java:[38,8]
duplicate class: org.apache.tephra.hbase.txprune.CompactionState
[ERROR] /home/lars/dev/incubator-tephra/tephra-hbase-compat-1.1-base/src/main/java/org/apache/tephra/hbase/txprune/PruneUpperBoundWriter.java:[38,8]
duplicate class: org.apache.tephra.hbase.txprune.PruneUpperBoundWriter
[ERROR] /home/lars/dev/incubator-tephra/tephra-hbase-compat-1.1-base/src/main/java/org/apache/tephra/hbase/TransactionAwareHTable.java:[67,8]
duplicate class: org.apache.tephra.hbase.TransactionAwareHTable
{code}

> HBase 1.1 tests don't compile
> -----------------------------
>
>                 Key: TEPHRA-303
>                 URL: https://issues.apache.org/jira/browse/TEPHRA-303
>             Project: Tephra
>          Issue Type: Bug
>    Affects Versions: 0.15.0-incubating
>            Reporter: Lars Hofhansl
>            Assignee: Poorna Chandra
>            Priority: Major
>             Fix For: 0.16.0-incubating
>
>
> Compiling the tests fails with "duplicate classes".



--
This message was sent by Atlassian JIRA
(v7.6.3#76005)

Mime
View raw message