subversion-notifications mailing list archives

Site index · List index
Message view « Date » · « Thread »
Top « Date » · « Thread »
From Apache Hudson Server <hud...@hudson.zones.apache.org>
Subject Build failed in Hudson: subversion-1.6.x-solaris #30
Date Thu, 03 Dec 2009 11:35:47 GMT
See <http://hudson.zones.apache.org/hudson/job/subversion-1.6.x-solaris/30/changes>

Changes:

[rhuijben] * STATUS: Cast some votes, update comments and change a -0 to a -1 vote.
          Approves r886164 group

------------------------------------------
[...truncated 4189 lines...]
Running all tests in checkout_tests.py [32/67]...success
Running all tests in commit_tests.py [33/67]...success
Running all tests in update_tests.py [34/67]...success
Running all tests in switch_tests.py [35/67]...success
Running all tests in prop_tests.py [36/67]...FAILURE
Running all tests in schedule_tests.py [37/67]...success
Running all tests in log_tests.py [38/67]...success
Running all tests in copy_tests.py [39/67]...success
Running all tests in diff_tests.py [40/67]...success
Running all tests in export_tests.py [41/67]...success
Running all tests in externals_tests.py [42/67]...success
Running all tests in merge_tests.py [43/67]...success
Running all tests in merge_authz_tests.py [44/67]...success
Running all tests in revert_tests.py [45/67]...success
Running all tests in mergeinfo_tests.py [46/67]...success
Running all tests in stat_tests.py [47/67]...success
Running all tests in trans_tests.py [48/67]...success
Running all tests in autoprop_tests.py [49/67]...success
Running all tests in blame_tests.py [50/67]...success
Running all tests in special_tests.py [51/67]...success
Running all tests in svnadmin_tests.py [52/67]...success
Running all tests in svnlook_tests.py [53/67]...success
Running all tests in svnversion_tests.py [54/67]...success
Running all tests in utf8_tests.py [55/67]...success
Running all tests in history_tests.py [56/67]...success
Running all tests in lock_tests.py [57/67]...success
Running all tests in cat_tests.py [58/67]...success
Running all tests in import_tests.py [59/67]...success
Running all tests in svnsync_tests.py [60/67]...success
Running all tests in authz_tests.py [61/67]...success
Running all tests in depth_tests.py [62/67]...success
Running all tests in svndumpfilter_tests.py [63/67]...success
Running all tests in changelist_tests.py [64/67]...success
Running all tests in info_tests.py [65/67]...success
Running all tests in tree_conflict_tests.py [66/67]...success
Running all tests in resolved_tests.py [67/67]...success
At least one test was SKIPPED, checking <http://hudson.zones.apache.org/hudson/job/subversion-1.6.x-solaris/ws/subversion-1.6.x/tests.log>
SKIP:  cache-test 2: basic memcache svn_cache test
SKIP:  cache-test 3: memcache svn_cache with very long keys
SKIP:  update_tests.py 32: update wc on the root of a Windows (virtual) drive
SKIP:  merge_tests.py 101: commits to subtrees added by merge wreak havoc
SKIP:  merge_authz_tests.py 1: skipped paths get overriding mergeinfo
SKIP:  utf8_tests.py 1: conversion of paths and logs to/from utf8
SKIP:  svnsync_tests.py 14: verify that unreadable content is not synced
SKIP:  svnsync_tests.py 15: verify that copies from unreadable dirs work
SKIP:  svnsync_tests.py 16: verify copies with mods from unreadable dirs
SKIP:  svnsync_tests.py 17: verify copies with mods from unreadable dirs +copy
SKIP:  authz_tests.py 1: authz issue #2486 - open root
SKIP:  authz_tests.py 2: authz issue #2486 - open directory
SKIP:  authz_tests.py 3: broken authz files cause errors
SKIP:  authz_tests.py 4: test authz for read operations
SKIP:  authz_tests.py 5: test authz for write operations
SKIP:  authz_tests.py 6: test authz for checkout
SKIP:  authz_tests.py 7: test authz for log and tracing path changes
SKIP:  authz_tests.py 8: test authz for checkout and update
SKIP:  authz_tests.py 9: test authz for export with unreadable subfolder
SKIP:  authz_tests.py 10: test authz for aliases
SKIP:  authz_tests.py 11: test the authz validation rules
SKIP:  authz_tests.py 12: test authz for locking
SKIP:  authz_tests.py 13: authz issue #2712
SKIP:  authz_tests.py 14: switched to directory, no read access on parents
At least one test XFAILED, checking <http://hudson.zones.apache.org/hudson/job/subversion-1.6.x-solaris/ws/subversion-1.6.x/tests.log>
XFAIL: fs-test 18: merging commit
XFAIL: locks-test 9: able to reserve a name (lock non-existent path)
XFAIL: locks-test 10: directory locks (kinda)
XFAIL: tree-conflict-data-test 3: detect broken tree conflict data
XFAIL: basic_tests.py 39: remotely remove directories from two repositories
XFAIL: update_tests.py 50: tree conflicts 2.3: skip on 2nd update
XFAIL: switch_tests.py 10: switch a file to a dir and back to the file
XFAIL: log_tests.py 21: test log -c on range of changes
XFAIL: diff_tests.py 28: diff a renamed directory
XFAIL: diff_tests.py 49: diff URL against working copy with local mods
XFAIL: diff_tests.py 50: diff -r1 of removed file to its local addition
XFAIL: merge_tests.py 34: replace both dir and one of its children
XFAIL: merge_tests.py 55: avoid repeated merges for cyclic merging
XFAIL: merge_tests.py 72: merge target with non inheritable mergeinfo
XFAIL: merge_tests.py 91: merge added subtree
XFAIL: merge_tests.py 115: tree conflicts 5.1: leaf edit, tree del
XFAIL: merge_tests.py 116: tree conflicts 5.2: leaf del, tree del
XFAIL: merge_tests.py 120: tree conflicts 5.1: leaf edit (no ci), tree del
XFAIL: merge_tests.py 121: tree conflicts 5.2: leaf del (no ci), tree del
XFAIL: merge_tests.py 125: merge prior to rename src existence still dels src
XFAIL: revert_tests.py 4: revert a moved file
XFAIL: mergeinfo_tests.py 4: 'mergeinfo' with uninteresting source selection
XFAIL: special_tests.py 10: diff a symlink to a directory
XFAIL: info_tests.py 2: info on added file
XFAIL: tree_conflict_tests.py 14: merge dir: del/rpl/mv onto not-same
At least one test FAILED, checking <http://hudson.zones.apache.org/hudson/job/subversion-1.6.x-solaris/ws/subversion-1.6.x/tests.log>
FAIL:  utf-test 3: test svn_utf_cstring_to_utf8_ex2
FAIL:  utf-test 4: test svn_utf_cstring_from_utf8_ex2
FAIL:  prop_tests.py 22: test prop* handle invalid property names
Summary of test results:
  24 tests SKIPPED
  25 tests XFAILED
  3 tests FAILED
*** Error code 1
The following command caused the error:
if test "/usr/bin/python" != "none"; then                                 \
  flags="--verbose";                                                 \
  if test "" != ""; then                                   \
    flags="--cleanup $flags";                                       \
  fi;                                                                \
  if test "" != ""; then                                  \
    flags="--url  $flags";                               \
  fi;                                                                \
  if test "" != ""; then                                   \
    flags="--fs-type  $flags";                            \
  fi;                                                                \
  if test "" != ""; then                              \
    flags="--http-library  $flags";                  \
  fi;                                                                \
  if test "" != ""; then                      \
    flags="--server-minor-version  $flags";  \
  fi;                                                                \
  if test "" != ""; then                               \
    flags="--enable-sasl $flags";                                   \
  fi;                                                                \
  if test "" != ""; then                             \
    flags="--fsfs-sharding  $flags";                \
  fi;                                                                \
  if test "" != ""; then                              \
    flags="--fsfs-packing $flags";                                  \
  fi;                                                                \
  if test "" != ""; then                                  \
    flags="--parallel $flags";                                      \
  fi;                                                                \
  /usr/bin/python ./build/run_tests.py                         \
            --config-file ./subversion/tests/tests.conf  \
            $flags                                                  \
            '<http://hudson.zones.apache.org/hudson/job/subversion-1.6.x-solaris/ws/subversion-1.6.x'>
'<http://hudson.zones.apache.org/hudson/job/subversion-1.6.x-solaris/ws/subversion-1.6.x'>
subversion/tests/libsvn_subr/auth-test subversion/tests/libsvn_subr/cache-test subversion/tests/libsvn_subr/checksum-test
subversion/tests/libsvn_client/client-test subversion/tests/libsvn_subr/compat-test subversion/tests/libsvn_subr/config-test
subversion/tests/libsvn_diff/diff-diff3-test subversion/tests/libsvn_subr/dirent_uri-test
subversion/tests/libsvn_subr/error-test subversion/tests/libsvn_fs_fs/fs-pack-test subversion/tests/libsvn_fs/fs-test
subversion/tests/libsvn_subr/hashdump-test subversion/tests/libsvn_fs/locks-test subversion/tests/libsvn_subr/mergeinfo-test
subversion/tests/libsvn_subr/opt-test subversion/tests/libsvn_subr/path-test subversion/tests/libsvn_ra_local/ra-local-test
subversion/tests/libsvn_delta/random-test subversion/tests/libsvn_repos/repos-test subversion/tests/libsvn_subr/revision-test
subversion/tests/libsvn_subr/skel-test subversion/tests/libsvn_subr/stream-test subversion/tests/libsvn_subr/string-test
subversion/tests/libsvn_subr/target-test subversion/tests/libsvn_subr/time-test subversion/tests/libsvn_subr/translate-test
subversion/tests/libsvn_wc/tree-conflict-data-test subversion/tests/libsvn_subr/utf-test subversion/tests/libsvn_delta/window-test
subversion/tests/cmdline/getopt_tests.py subversion/tests/cmdline/basic_tests.py subversion/tests/cmdline/checkout_tests.py
subversion/tests/cmdline/commit_tests.py subversion/tests/cmdline/update_tests.py subversion/tests/cmdline/switch_tests.py
subversion/tests/cmdline/prop_tests.py subversion/tests/cmdline/schedule_tests.py subversion/tests/cmdline/log_tests.py
subversion/tests/cmdline/copy_tests.py subversion/tests/cmdline/diff_tests.py subversion/tests/cmdline/export_tests.py
subversion/tests/cmdline/externals_tests.py subversion/tests/cmdline/merge_tests.py subversion/tests/cmdline/merge_authz_tests.py
subversion/tests/cmdline/revert_tests.py subversion/tests/cmdline/mergeinfo_tests.py subversion/tests/cmdline/stat_tests.py
subversion/tests/cmdline/trans_tests.py subversion/tests/cmdline/autoprop_tests.py subversion/tests/cmdline/blame_tests.py
subversion/tests/cmdline/special_tests.py subversion/tests/cmdline/svnadmin_tests.py subversion/tests/cmdline/svnlook_tests.py
subversion/tests/cmdline/svnversion_tests.py subversion/tests/cmdline/utf8_tests.py subversion/tests/cmdline/history_tests.py
subversion/tests/cmdline/lock_tests.py subversion/tests/cmdline/cat_tests.py subversion/tests/cmdline/import_tests.py
subversion/tests/cmdline/svnsync_tests.py subversion/tests/cmdline/authz_tests.py subversion/tests/cmdline/depth_tests.py
subversion/tests/cmdline/svndumpfilter_tests.py subversion/tests/cmdline/changelist_tests.py
subversion/tests/cmdline/info_tests.py subversion/tests/cmdline/tree_conflict_tests.py subversion/tests/cmdline/resolved_tests.py;
             \
else                                                                 \
  echo "make check: Python 2.4 or greater is required,";             \
  echo "            but was not detected during configure";          \
  exit 1;                                                            \
fi;
make: Fatal error: Command failed for target `check'
Generating junit files ...

subversion/libsvn_subr/utf.c:547: (apr_err=22)
svn_tests: Safe data 'Edelwei' was followed by non-ASCII byte 223: unable to convert to/from
UTF-8

subversion/libsvn_subr/utf.c:547: (apr_err=22)
svn_tests: Safe data 'Edelwei' was followed by non-ASCII byte 195: unable to convert to/from
UTF-8

CMD: svnadmin create svn-test-work/repositories/prop_tests-22 --bdb-txn-nosync <TIME =
0.527056>
CMD: svnadmindump svn-test-work/local_tmp/repos | svnadminload svn-test-work/repositories/prop_tests-22
--ignore-uuid <TIME = 0.967304>
CMD: svn co file://<http://hudson.zones.apache.org/hudson/job/subversion-1.6.x-solaris/ws/subversion-1.6.x/subversion/tests/cmdline/svn-test-work/repositories/prop_tests-22>
svn-test-work/working_copies/prop_tests-22 --config-dir <http://hudson.zones.apache.org/hudson/job/subversion-1.6.x-solaris/ws/subversion-1.6.x/subversion/tests/cmdline/svn-test-work/local_tmp/config>
--password rayjandom --no-auth-cache --username jrandom <TIME = 0.562214>
A    svn-test-work/working_copies/prop_tests-22/A
A    svn-test-work/working_copies/prop_tests-22/A/B
A    svn-test-work/working_copies/prop_tests-22/A/B/lambda
A    svn-test-work/working_copies/prop_tests-22/A/B/E
A    svn-test-work/working_copies/prop_tests-22/A/B/E/alpha
A    svn-test-work/working_copies/prop_tests-22/A/B/E/beta
A    svn-test-work/working_copies/prop_tests-22/A/B/F
A    svn-test-work/working_copies/prop_tests-22/A/mu
A    svn-test-work/working_copies/prop_tests-22/A/C
A    svn-test-work/working_copies/prop_tests-22/A/D
A    svn-test-work/working_copies/prop_tests-22/A/D/gamma
A    svn-test-work/working_copies/prop_tests-22/A/D/G
A    svn-test-work/working_copies/prop_tests-22/A/D/G/pi
A    svn-test-work/working_copies/prop_tests-22/A/D/G/rho
A    svn-test-work/working_copies/prop_tests-22/A/D/G/tau
A    svn-test-work/working_copies/prop_tests-22/A/D/H
A    svn-test-work/working_copies/prop_tests-22/A/D/H/chi
A    svn-test-work/working_copies/prop_tests-22/A/D/H/omega
A    svn-test-work/working_copies/prop_tests-22/A/D/H/psi
A    svn-test-work/working_copies/prop_tests-22/iota
Checked out revision 1.
CMD: svn propdel "" --config-dir <http://hudson.zones.apache.org/hudson/job/subversion-1.6.x-solaris/ws/subversion-1.6.x/subversion/tests/cmdline/svn-test-work/local_tmp/config>
--password rayjandom --no-auth-cache --username jrandom CMD: <http://hudson.zones.apache.org/hudson/job/subversion-1.6.x-solaris/ws/subversion-1.6.x/subversion/svn/svn>
propdel  --config-dir <http://hudson.zones.apache.org/hudson/job/subversion-1.6.x-solaris/ws/subversion-1.6.x/subversion/tests/cmdline/svn-test-work/local_tmp/config>
--password rayjandom --no-auth-cache --username jrandom exited with 1
<TIME = 0.491603>
subversion/libsvn_subr/utf.c:555: (apr_err=22)
svn: Non-ASCII character (code 8) detected, and unable to convert to/from UTF-8
EXPECTED STDERR (regexp):
.*Attempting to delete nonexistent property ''.*
ACTUAL STDERR:
subversion/libsvn_subr/utf.c:555: (apr_err=22)
svn: Non-ASCII character (code 8) detected, and unable to convert to/from UTF-8
EXCEPTION: SVNUnmatchedError
Traceback (most recent call last):
File "<http://hudson.zones.apache.org/hudson/job/subversion-1.6.x-solaris/ws/subversion-1.6.x/subversion/tests/cmdline/svntest/main.py",>
line 1224, in run
rc = self.pred.run(**kw)
File "<http://hudson.zones.apache.org/hudson/job/subversion-1.6.x-solaris/ws/subversion-1.6.x/subversion/tests/cmdline/svntest/testcase.py",>
line 121, in run
return self.func(sandbox)
File "<http://hudson.zones.apache.org/hudson/job/subversion-1.6.x-solaris/ws/subversion-1.6.x/subversion/tests/cmdline/prop_tests.py",>
line 1463, in invalid_propnames
'propdel', propname)
File "<http://hudson.zones.apache.org/hudson/job/subversion-1.6.x-solaris/ws/subversion-1.6.x/subversion/tests/cmdline/svntest/actions.py",>
line 202, in run_and_verify_svn
expected_exit, *varargs)
File "<http://hudson.zones.apache.org/hudson/job/subversion-1.6.x-solaris/ws/subversion-1.6.x/subversion/tests/cmdline/svntest/actions.py",>
line 236, in run_and_verify_svn2
verify.verify_outputs(message, out, err, expected_stdout, expected_stderr)
File "<http://hudson.zones.apache.org/hudson/job/subversion-1.6.x-solaris/ws/subversion-1.6.x/subversion/tests/cmdline/svntest/verify.py",>
line 350, in verify_outputs
compare_and_display_lines(message, label, expected, actual, raisable)
File "<http://hudson.zones.apache.org/hudson/job/subversion-1.6.x-solaris/ws/subversion-1.6.x/subversion/tests/cmdline/svntest/verify.py",>
line 322, in compare_and_display_lines
raise raisable
SVNUnmatchedError
Recording test results
ERROR: Failed to archive test reports
hudson.util.IOException2: remote file operation failed
	at hudson.FilePath.act(FilePath.java:672)
	at hudson.FilePath.act(FilePath.java:660)
	at hudson.tasks.junit.JUnitResultArchiver.perform(JUnitResultArchiver.java:117)
	at hudson.tasks.BuildStepMonitor$1.perform(BuildStepMonitor.java:19)
	at hudson.model.AbstractBuild$AbstractRunner.perform(AbstractBuild.java:480)
	at hudson.model.AbstractBuild$AbstractRunner.performAllBuildStep(AbstractBuild.java:466)
	at hudson.model.AbstractBuild$AbstractRunner.performAllBuildStep(AbstractBuild.java:454)
	at hudson.model.Build$RunnerImpl.post2(Build.java:181)
	at hudson.model.AbstractBuild$AbstractRunner.post(AbstractBuild.java:438)
	at hudson.model.Run.run(Run.java:1143)
	at hudson.model.FreeStyleBuild.run(FreeStyleBuild.java:46)
	at hudson.model.ResourceController.execute(ResourceController.java:88)
	at hudson.model.Executor.run(Executor.java:123)
Caused by: hudson.util.IOException2: Failed to read <http://hudson.zones.apache.org/hudson/job/subversion-1.6.x-solaris/ws/subversion-1.6.x/build/junit-reports/prop_tests.py.junit.xml>
	at hudson.tasks.junit.TestResult.parse(TestResult.java:195)
	at hudson.tasks.junit.TestResult.parse(TestResult.java:136)
	at hudson.tasks.junit.TestResult.<init>(TestResult.java:99)
	at hudson.tasks.junit.JUnitResultArchiver$ParseResultCallable.invoke(JUnitResultArchiver.java:230)
	at hudson.tasks.junit.JUnitResultArchiver$ParseResultCallable.invoke(JUnitResultArchiver.java:205)
	at hudson.FilePath$FileCallableWrapper.call(FilePath.java:2052)
	at hudson.remoting.UserRequest.perform(UserRequest.java:69)
	at hudson.remoting.UserRequest.perform(UserRequest.java:23)
	at hudson.remoting.Request$2.run(Request.java:200)
	at java.util.concurrent.Executors$RunnableAdapter.call(Executors.java:441)
	at java.util.concurrent.FutureTask$Sync.innerRun(FutureTask.java:303)
	at java.util.concurrent.FutureTask.run(FutureTask.java:138)
	at java.util.concurrent.ThreadPoolExecutor$Worker.runTask(ThreadPoolExecutor.java:885)
	at java.util.concurrent.ThreadPoolExecutor$Worker.run(ThreadPoolExecutor.java:907)
	at java.lang.Thread.run(Thread.java:619)
Caused by: org.dom4j.DocumentException: Error on line 49 of document file://<http://hudson.zones.apache.org/hudson/job/subversion-1.6.x-solaris/ws/subversion-1.6.x/build/junit-reports/prop_tests.py.junit.xml>
: An invalid XML character (Unicode: 0x8) was found in the CDATA section. Nested exception:
An invalid XML character (Unicode: 0x8) was found in the CDATA section.
	at org.dom4j.io.SAXReader.read(SAXReader.java:482)
	at org.dom4j.io.SAXReader.read(SAXReader.java:264)
	at hudson.tasks.junit.SuiteResult.parse(SuiteResult.java:93)
	at hudson.tasks.junit.TestResult.parse(TestResult.java:180)
	... 14 more
Caused by: org.xml.sax.SAXParseException: An invalid XML character (Unicode: 0x8) was found
in the CDATA section.
	at com.sun.org.apache.xerces.internal.util.ErrorHandlerWrapper.createSAXParseException(ErrorHandlerWrapper.java:195)
	at com.sun.org.apache.xerces.internal.util.ErrorHandlerWrapper.fatalError(ErrorHandlerWrapper.java:174)
	at com.sun.org.apache.xerces.internal.impl.XMLErrorReporter.reportError(XMLErrorReporter.java:388)
	at com.sun.org.apache.xerces.internal.impl.XMLScanner.reportFatalError(XMLScanner.java:1411)
	at com.sun.org.apache.xerces.internal.impl.XMLDocumentFragmentScannerImpl.scanCDATASection(XMLDocumentFragmentScannerImpl.java:1680)
	at com.sun.org.apache.xerces.internal.impl.XMLDocumentFragmentScannerImpl$FragmentContentDriver.next(XMLDocumentFragmentScannerImpl.java:2970)
	at com.sun.org.apache.xerces.internal.impl.XMLDocumentScannerImpl.next(XMLDocumentScannerImpl.java:645)
	at com.sun.org.apache.xerces.internal.impl.XMLNSDocumentScannerImpl.next(XMLNSDocumentScannerImpl.java:140)
	at com.sun.org.apache.xerces.internal.impl.XMLDocumentFragmentScannerImpl.scanDocument(XMLDocumentFragmentScannerImpl.java:508)
	at com.sun.org.apache.xerces.internal.parsers.XML11Configuration.parse(XML11Configuration.java:807)
	at com.sun.org.apache.xerces.internal.parsers.XML11Configuration.parse(XML11Configuration.java:737)
	at com.sun.org.apache.xerces.internal.parsers.XMLParser.parse(XMLParser.java:107)
	at com.sun.org.apache.xerces.internal.parsers.AbstractSAXParser.parse(AbstractSAXParser.java:1205)
	at com.sun.org.apache.xerces.internal.jaxp.SAXParserImpl$JAXPSAXParser.parse(SAXParserImpl.java:522)
	at org.dom4j.io.SAXReader.read(SAXReader.java:465)
	... 17 more


Mime
View raw message