subversion-notifications mailing list archives

Site index · List index
Message view « Date » · « Thread »
Top « Date » · « Thread »
From Apache Hudson Server <hud...@hudson.zones.apache.org>
Subject Build failed in Hudson: subversion-trunk-ubuntu #124
Date Fri, 11 Dec 2009 11:19:55 GMT
See <http://hudson.zones.apache.org/hudson/job/subversion-trunk-ubuntu/124/changes>

Changes:

[julianfoad] Fix some portability problems with the python tests for obliterate which I
added in r889342. Remove the "import csvn" statement, as that module may not
be available and is not needed. Ignore any error in trying to dump the BDB
repository state using an external "db_dump" program, as that program may not
be available and the purpose is only to assist with external debugging.
When creating the empty repository, use a function that deletes any previous
repository at that location, so that it does not fail if a previous test run
did not clean up.

* subversion/tests/cmdline/svntest/objects.py
  Remove the "import csvn" statement and the associated commented-out usage.

* subversion/tests/cmdline/svntest/actions.py
  (guarantee_empty_repository): New function.

* subversion/tests/cmdline/obliterate_tests.py
  (obliterate_1): Use guarantee_empty_repository() instead of trying to
    create a repository directly. If an exception is thrown when dumping the
    BDB repository state, ignore it and continue.

[rhuijben] * build/win32/svn.rc
  Update copyright information shown in the Windows file details of
  the Subversion executables to reflect our move to the ASF.

------------------------------------------
[...truncated 2057 lines...]
subversion/tests/cmdline/entries-dump.c: In function ?entries_dump?:
subversion/tests/cmdline/entries-dump.c:70: warning: ?svn_wc_locked? is deprecated (declared at ./subversion/include/svn_wc.h:574)
subversion/tests/cmdline/entries-dump.c:71: warning: ?svn_wc_adm_open3? is deprecated (declared at ./subversion/include/svn_wc.h:276)
subversion/tests/cmdline/entries-dump.c:73: warning: ?svn_wc_entries_read? is deprecated (declared at ./subversion/include/svn_wc.h:3043)
subversion/tests/cmdline/entries-dump.c: In function ?main?:
subversion/tests/cmdline/entries-dump.c:171: warning: will never be executed
cd subversion/tests/cmdline && <http://hudson.zones.apache.org/hudson/job/subversion-trunk-ubuntu/ws/subversion-trunk/apr/libtool> --tag=CC --silent --mode=link gcc -static  -Wold-style-definition -Wdeclaration-after-statement -Wpointer-arith -Wwrite-strings -Wshadow -ansi -Wall -Wformat=2 -Wunused -Waggregate-return -Wstrict-prototypes -Wmissing-prototypes -Wmissing-declarations -Wno-multichar -Wredundant-decls -Wnested-externs -Wunreachable-code -Winline -Wno-long-long -g -g -Wall -Wmissing-prototypes -Wstrict-prototypes -Wmissing-declarations -pthread -Werror=implicit-function-declaration  -DSVN_DEBUG -DAP_DEBUG   -rpath /usr/local/lib  -o entries-dump  entries-dump.lo ../../../subversion/libsvn_wc/libsvn_wc-1.la ../../../subversion/libsvn_subr/libsvn_subr-1.la -L<http://hudson.zones.apache.org/hudson/job/subversion-trunk-ubuntu/ws/subversion-trunk/apr-util> -laprutil-1 -L<http://hudson.zones.apache.org/hudson/job/subversion-trunk-ubuntu/ws/subversion-trunk/apr> -lapr-1 
<http://hudson.zones.apache.org/hudson/job/subversion-trunk-ubuntu/ws/subversion-trunk/apr/libtool> --tag=CC --silent --mode=compile gcc -DLINUX=2 -D_REENTRANT -D_GNU_SOURCE  -Wold-style-definition -Wdeclaration-after-statement -Wpointer-arith -Wwrite-strings -Wshadow -ansi -Wall -Wformat=2 -Wunused -Waggregate-return -Wstrict-prototypes -Wmissing-prototypes -Wmissing-declarations -Wno-multichar -Wredundant-decls -Wnested-externs -Wunreachable-code -Winline -Wno-long-long -g -g -Wall -Wmissing-prototypes -Wstrict-prototypes -Wmissing-declarations -pthread -Werror=implicit-function-declaration  -DSVN_DEBUG -DAP_DEBUG  -I./subversion/include -I./subversion -I<http://hudson.zones.apache.org/hudson/job/subversion-trunk-ubuntu/ws/subversion-trunk/apr/include>   -I<http://hudson.zones.apache.org/hudson/job/subversion-trunk-ubuntu/ws/subversion-trunk/apr-util/include> -I<http://hudson.zones.apache.org/hudson/job/subversion-trunk-ubuntu/ws/subversion-trunk/sqlite-amalgamation>  -static  -o subversion/tests/libsvn_subr/eol-test.lo -c subversion/tests/libsvn_subr/eol-test.c
cd subversion/tests/libsvn_subr && <http://hudson.zones.apache.org/hudson/job/subversion-trunk-ubuntu/ws/subversion-trunk/apr/libtool> --tag=CC --silent --mode=link gcc -static  -Wold-style-definition -Wdeclaration-after-statement -Wpointer-arith -Wwrite-strings -Wshadow -ansi -Wall -Wformat=2 -Wunused -Waggregate-return -Wstrict-prototypes -Wmissing-prototypes -Wmissing-declarations -Wno-multichar -Wredundant-decls -Wnested-externs -Wunreachable-code -Winline -Wno-long-long -g -g -Wall -Wmissing-prototypes -Wstrict-prototypes -Wmissing-declarations -pthread -Werror=implicit-function-declaration  -DSVN_DEBUG -DAP_DEBUG   -rpath /usr/local/lib  -o eol-test  eol-test.lo ../../../subversion/tests/libsvn_test-1.la ../../../subversion/libsvn_subr/libsvn_subr-1.la -L<http://hudson.zones.apache.org/hudson/job/subversion-trunk-ubuntu/ws/subversion-trunk/apr-util> -laprutil-1 -L<http://hudson.zones.apache.org/hudson/job/subversion-trunk-ubuntu/ws/subversion-trunk/apr> -lapr-1 
<http://hudson.zones.apache.org/hudson/job/subversion-trunk-ubuntu/ws/subversion-trunk/apr/libtool> --tag=CC --silent --mode=compile gcc -DLINUX=2 -D_REENTRANT -D_GNU_SOURCE  -Wold-style-definition -Wdeclaration-after-statement -Wpointer-arith -Wwrite-strings -Wshadow -ansi -Wall -Wformat=2 -Wunused -Waggregate-return -Wstrict-prototypes -Wmissing-prototypes -Wmissing-declarations -Wno-multichar -Wredundant-decls -Wnested-externs -Wunreachable-code -Winline -Wno-long-long -g -g -Wall -Wmissing-prototypes -Wstrict-prototypes -Wmissing-declarations -pthread -Werror=implicit-function-declaration  -DSVN_DEBUG -DAP_DEBUG  -I./subversion/include -I./subversion -I<http://hudson.zones.apache.org/hudson/job/subversion-trunk-ubuntu/ws/subversion-trunk/apr/include>   -I<http://hudson.zones.apache.org/hudson/job/subversion-trunk-ubuntu/ws/subversion-trunk/apr-util/include> -I<http://hudson.zones.apache.org/hudson/job/subversion-trunk-ubuntu/ws/subversion-trunk/sqlite-amalgamation>  -static  -o subversion/tests/libsvn_subr/error-test.lo -c subversion/tests/libsvn_subr/error-test.c
cd subversion/tests/libsvn_subr && <http://hudson.zones.apache.org/hudson/job/subversion-trunk-ubuntu/ws/subversion-trunk/apr/libtool> --tag=CC --silent --mode=link gcc -static  -Wold-style-definition -Wdeclaration-after-statement -Wpointer-arith -Wwrite-strings -Wshadow -ansi -Wall -Wformat=2 -Wunused -Waggregate-return -Wstrict-prototypes -Wmissing-prototypes -Wmissing-declarations -Wno-multichar -Wredundant-decls -Wnested-externs -Wunreachable-code -Winline -Wno-long-long -g -g -Wall -Wmissing-prototypes -Wstrict-prototypes -Wmissing-declarations -pthread -Werror=implicit-function-declaration  -DSVN_DEBUG -DAP_DEBUG   -rpath /usr/local/lib  -o error-test  error-test.lo ../../../subversion/tests/libsvn_test-1.la ../../../subversion/libsvn_subr/libsvn_subr-1.la -L<http://hudson.zones.apache.org/hudson/job/subversion-trunk-ubuntu/ws/subversion-trunk/apr-util> -laprutil-1 -L<http://hudson.zones.apache.org/hudson/job/subversion-trunk-ubuntu/ws/subversion-trunk/apr> -lapr-1 
<http://hudson.zones.apache.org/hudson/job/subversion-trunk-ubuntu/ws/subversion-trunk/apr/libtool> --tag=CC --silent --mode=compile gcc -DLINUX=2 -D_REENTRANT -D_GNU_SOURCE  -Wold-style-definition -Wdeclaration-after-statement -Wpointer-arith -Wwrite-strings -Wshadow -ansi -Wall -Wformat=2 -Wunused -Waggregate-return -Wstrict-prototypes -Wmissing-prototypes -Wmissing-declarations -Wno-multichar -Wredundant-decls -Wnested-externs -Wunreachable-code -Winline -Wno-long-long -g -g -Wall -Wmissing-prototypes -Wstrict-prototypes -Wmissing-declarations -pthread -Werror=implicit-function-declaration  -DSVN_DEBUG -DAP_DEBUG  -I./subversion/include -I./subversion -I<http://hudson.zones.apache.org/hudson/job/subversion-trunk-ubuntu/ws/subversion-trunk/apr/include>   -I<http://hudson.zones.apache.org/hudson/job/subversion-trunk-ubuntu/ws/subversion-trunk/apr-util/include> -I<http://hudson.zones.apache.org/hudson/job/subversion-trunk-ubuntu/ws/subversion-trunk/sqlite-amalgamation>  -static  -o subversion/tests/libsvn_fs_fs/fs-pack-test.lo -c subversion/tests/libsvn_fs_fs/fs-pack-test.c
cd subversion/tests/libsvn_fs_fs && <http://hudson.zones.apache.org/hudson/job/subversion-trunk-ubuntu/ws/subversion-trunk/apr/libtool> --tag=CC --silent --mode=link gcc -static  -Wold-style-definition -Wdeclaration-after-statement -Wpointer-arith -Wwrite-strings -Wshadow -ansi -Wall -Wformat=2 -Wunused -Waggregate-return -Wstrict-prototypes -Wmissing-prototypes -Wmissing-declarations -Wno-multichar -Wredundant-decls -Wnested-externs -Wunreachable-code -Winline -Wno-long-long -g -g -Wall -Wmissing-prototypes -Wstrict-prototypes -Wmissing-declarations -pthread -Werror=implicit-function-declaration  -DSVN_DEBUG -DAP_DEBUG   -rpath /usr/local/lib  -o fs-pack-test  fs-pack-test.lo ../../../subversion/tests/libsvn_test-1.la ../../../subversion/libsvn_fs/libsvn_fs-1.la ../../../subversion/libsvn_fs_fs/libsvn_fs_fs-1.la ../../../subversion/libsvn_delta/libsvn_delta-1.la ../../../subversion/libsvn_subr/libsvn_subr-1.la -L<http://hudson.zones.apache.org/hudson/job/subversion-trunk-ubuntu/ws/subversion-trunk/apr-util> -laprutil-1 -L<http://hudson.zones.apache.org/hudson/job/subversion-trunk-ubuntu/ws/subversion-trunk/apr> -lapr-1 
<http://hudson.zones.apache.org/hudson/job/subversion-trunk-ubuntu/ws/subversion-trunk/apr/libtool> --tag=CC --silent --mode=compile gcc -DLINUX=2 -D_REENTRANT -D_GNU_SOURCE  -Wold-style-definition -Wdeclaration-after-statement -Wpointer-arith -Wwrite-strings -Wshadow -ansi -Wall -Wformat=2 -Wunused -Waggregate-return -Wstrict-prototypes -Wmissing-prototypes -Wmissing-declarations -Wno-multichar -Wredundant-decls -Wnested-externs -Wunreachable-code -Winline -Wno-long-long -g -g -Wall -Wmissing-prototypes -Wstrict-prototypes -Wmissing-declarations -pthread -Werror=implicit-function-declaration  -DSVN_DEBUG -DAP_DEBUG  -I./subversion/include -I./subversion -I<http://hudson.zones.apache.org/hudson/job/subversion-trunk-ubuntu/ws/subversion-trunk/apr/include>   -I<http://hudson.zones.apache.org/hudson/job/subversion-trunk-ubuntu/ws/subversion-trunk/apr-util/include> -I<http://hudson.zones.apache.org/hudson/job/subversion-trunk-ubuntu/ws/subversion-trunk/sqlite-amalgamation>  -static  -o subversion/tests/libsvn_fs/fs-test.lo -c subversion/tests/libsvn_fs/fs-test.c
cd subversion/tests/libsvn_fs && <http://hudson.zones.apache.org/hudson/job/subversion-trunk-ubuntu/ws/subversion-trunk/apr/libtool> --tag=CC --silent --mode=link gcc -static  -Wold-style-definition -Wdeclaration-after-statement -Wpointer-arith -Wwrite-strings -Wshadow -ansi -Wall -Wformat=2 -Wunused -Waggregate-return -Wstrict-prototypes -Wmissing-prototypes -Wmissing-declarations -Wno-multichar -Wredundant-decls -Wnested-externs -Wunreachable-code -Winline -Wno-long-long -g -g -Wall -Wmissing-prototypes -Wstrict-prototypes -Wmissing-declarations -pthread -Werror=implicit-function-declaration  -DSVN_DEBUG -DAP_DEBUG   -rpath /usr/local/lib  -o fs-test  fs-test.lo ../../../subversion/tests/libsvn_test-1.la ../../../subversion/libsvn_fs/libsvn_fs-1.la ../../../subversion/libsvn_delta/libsvn_delta-1.la ../../../subversion/libsvn_subr/libsvn_subr-1.la -L<http://hudson.zones.apache.org/hudson/job/subversion-trunk-ubuntu/ws/subversion-trunk/apr-util> -laprutil-1 -L<http://hudson.zones.apache.org/hudson/job/subversion-trunk-ubuntu/ws/subversion-trunk/apr> -lapr-1 
<http://hudson.zones.apache.org/hudson/job/subversion-trunk-ubuntu/ws/subversion-trunk/apr/libtool> --tag=CC --silent --mode=compile gcc -DLINUX=2 -D_REENTRANT -D_GNU_SOURCE  -Wold-style-definition -Wdeclaration-after-statement -Wpointer-arith -Wwrite-strings -Wshadow -ansi -Wall -Wformat=2 -Wunused -Waggregate-return -Wstrict-prototypes -Wmissing-prototypes -Wmissing-declarations -Wno-multichar -Wredundant-decls -Wnested-externs -Wunreachable-code -Winline -Wno-long-long -g -g -Wall -Wmissing-prototypes -Wstrict-prototypes -Wmissing-declarations -pthread -Werror=implicit-function-declaration  -DSVN_DEBUG -DAP_DEBUG  -I./subversion/include -I./subversion -I<http://hudson.zones.apache.org/hudson/job/subversion-trunk-ubuntu/ws/subversion-trunk/apr/include>   -I<http://hudson.zones.apache.org/hudson/job/subversion-trunk-ubuntu/ws/subversion-trunk/apr-util/include> -I<http://hudson.zones.apache.org/hudson/job/subversion-trunk-ubuntu/ws/subversion-trunk/sqlite-amalgamation>  -static  -o subversion/tests/libsvn_subr/hashdump-test.lo -c subversion/tests/libsvn_subr/hashdump-test.c
cd subversion/tests/libsvn_subr && <http://hudson.zones.apache.org/hudson/job/subversion-trunk-ubuntu/ws/subversion-trunk/apr/libtool> --tag=CC --silent --mode=link gcc -static  -Wold-style-definition -Wdeclaration-after-statement -Wpointer-arith -Wwrite-strings -Wshadow -ansi -Wall -Wformat=2 -Wunused -Waggregate-return -Wstrict-prototypes -Wmissing-prototypes -Wmissing-declarations -Wno-multichar -Wredundant-decls -Wnested-externs -Wunreachable-code -Winline -Wno-long-long -g -g -Wall -Wmissing-prototypes -Wstrict-prototypes -Wmissing-declarations -pthread -Werror=implicit-function-declaration  -DSVN_DEBUG -DAP_DEBUG   -rpath /usr/local/lib  -o hashdump-test  hashdump-test.lo ../../../subversion/tests/libsvn_test-1.la ../../../subversion/libsvn_subr/libsvn_subr-1.la -L<http://hudson.zones.apache.org/hudson/job/subversion-trunk-ubuntu/ws/subversion-trunk/apr-util> -laprutil-1 -L<http://hudson.zones.apache.org/hudson/job/subversion-trunk-ubuntu/ws/subversion-trunk/apr> -lapr-1 
<http://hudson.zones.apache.org/hudson/job/subversion-trunk-ubuntu/ws/subversion-trunk/apr/libtool> --tag=CC --silent --mode=compile gcc -DLINUX=2 -D_REENTRANT -D_GNU_SOURCE  -Wold-style-definition -Wdeclaration-after-statement -Wpointer-arith -Wwrite-strings -Wshadow -ansi -Wall -Wformat=2 -Wunused -Waggregate-return -Wstrict-prototypes -Wmissing-prototypes -Wmissing-declarations -Wno-multichar -Wredundant-decls -Wnested-externs -Wunreachable-code -Winline -Wno-long-long -g -g -Wall -Wmissing-prototypes -Wstrict-prototypes -Wmissing-declarations -pthread -Werror=implicit-function-declaration  -DSVN_DEBUG -DAP_DEBUG  -I./subversion/include -I./subversion -I<http://hudson.zones.apache.org/hudson/job/subversion-trunk-ubuntu/ws/subversion-trunk/apr/include>   -I<http://hudson.zones.apache.org/hudson/job/subversion-trunk-ubuntu/ws/subversion-trunk/apr-util/include> -I<http://hudson.zones.apache.org/hudson/job/subversion-trunk-ubuntu/ws/subversion-trunk/sqlite-amalgamation>  -static  -o subversion/tests/libsvn_fs/locks-test.lo -c subversion/tests/libsvn_fs/locks-test.c
cd subversion/tests/libsvn_fs && <http://hudson.zones.apache.org/hudson/job/subversion-trunk-ubuntu/ws/subversion-trunk/apr/libtool> --tag=CC --silent --mode=link gcc -static  -Wold-style-definition -Wdeclaration-after-statement -Wpointer-arith -Wwrite-strings -Wshadow -ansi -Wall -Wformat=2 -Wunused -Waggregate-return -Wstrict-prototypes -Wmissing-prototypes -Wmissing-declarations -Wno-multichar -Wredundant-decls -Wnested-externs -Wunreachable-code -Winline -Wno-long-long -g -g -Wall -Wmissing-prototypes -Wstrict-prototypes -Wmissing-declarations -pthread -Werror=implicit-function-declaration  -DSVN_DEBUG -DAP_DEBUG   -rpath /usr/local/lib  -o locks-test  locks-test.lo ../../../subversion/tests/libsvn_test-1.la ../../../subversion/libsvn_fs/libsvn_fs-1.la ../../../subversion/libsvn_delta/libsvn_delta-1.la ../../../subversion/libsvn_subr/libsvn_subr-1.la -L<http://hudson.zones.apache.org/hudson/job/subversion-trunk-ubuntu/ws/subversion-trunk/apr-util> -laprutil-1 -L<http://hudson.zones.apache.org/hudson/job/subversion-trunk-ubuntu/ws/subversion-trunk/apr> -lapr-1 
<http://hudson.zones.apache.org/hudson/job/subversion-trunk-ubuntu/ws/subversion-trunk/apr/libtool> --tag=CC --silent --mode=compile gcc -DLINUX=2 -D_REENTRANT -D_GNU_SOURCE  -Wold-style-definition -Wdeclaration-after-statement -Wpointer-arith -Wwrite-strings -Wshadow -ansi -Wall -Wformat=2 -Wunused -Waggregate-return -Wstrict-prototypes -Wmissing-prototypes -Wmissing-declarations -Wno-multichar -Wredundant-decls -Wnested-externs -Wunreachable-code -Winline -Wno-long-long -g -g -Wall -Wmissing-prototypes -Wstrict-prototypes -Wmissing-declarations -pthread -Werror=implicit-function-declaration  -DSVN_DEBUG -DAP_DEBUG  -I./subversion/include -I./subversion -I<http://hudson.zones.apache.org/hudson/job/subversion-trunk-ubuntu/ws/subversion-trunk/apr/include>   -I<http://hudson.zones.apache.org/hudson/job/subversion-trunk-ubuntu/ws/subversion-trunk/apr-util/include> -I<http://hudson.zones.apache.org/hudson/job/subversion-trunk-ubuntu/ws/subversion-trunk/sqlite-amalgamation>  -static  -o subversion/tests/libsvn_subr/mergeinfo-test.lo -c subversion/tests/libsvn_subr/mergeinfo-test.c
subversion/tests/libsvn_subr/mergeinfo-test.c: In function ?test_mergeinfo_intersect?:
subversion/tests/libsvn_subr/mergeinfo-test.c:507: warning: ?svn_mergeinfo_intersect? is deprecated (declared at ./subversion/include/svn_mergeinfo.h:300)
subversion/tests/libsvn_subr/mergeinfo-test.c: In function ?test_remove_mergeinfo?:
subversion/tests/libsvn_subr/mergeinfo-test.c:1043: warning: ?svn_mergeinfo_remove? is deprecated (declared at ./subversion/include/svn_mergeinfo.h:216)
cd subversion/tests/libsvn_subr && <http://hudson.zones.apache.org/hudson/job/subversion-trunk-ubuntu/ws/subversion-trunk/apr/libtool> --tag=CC --silent --mode=link gcc -static  -Wold-style-definition -Wdeclaration-after-statement -Wpointer-arith -Wwrite-strings -Wshadow -ansi -Wall -Wformat=2 -Wunused -Waggregate-return -Wstrict-prototypes -Wmissing-prototypes -Wmissing-declarations -Wno-multichar -Wredundant-decls -Wnested-externs -Wunreachable-code -Winline -Wno-long-long -g -g -Wall -Wmissing-prototypes -Wstrict-prototypes -Wmissing-declarations -pthread -Werror=implicit-function-declaration  -DSVN_DEBUG -DAP_DEBUG   -rpath /usr/local/lib  -o mergeinfo-test  mergeinfo-test.lo ../../../subversion/tests/libsvn_test-1.la ../../../subversion/libsvn_subr/libsvn_subr-1.la -L<http://hudson.zones.apache.org/hudson/job/subversion-trunk-ubuntu/ws/subversion-trunk/apr> -lapr-1 
<http://hudson.zones.apache.org/hudson/job/subversion-trunk-ubuntu/ws/subversion-trunk/apr/libtool> --tag=CC --silent --mode=compile gcc -DLINUX=2 -D_REENTRANT -D_GNU_SOURCE  -Wold-style-definition -Wdeclaration-after-statement -Wpointer-arith -Wwrite-strings -Wshadow -ansi -Wall -Wformat=2 -Wunused -Waggregate-return -Wstrict-prototypes -Wmissing-prototypes -Wmissing-declarations -Wno-multichar -Wredundant-decls -Wnested-externs -Wunreachable-code -Winline -Wno-long-long -g -g -Wall -Wmissing-prototypes -Wstrict-prototypes -Wmissing-declarations -pthread -Werror=implicit-function-declaration  -DSVN_DEBUG -DAP_DEBUG  -I./subversion/include -I./subversion -I<http://hudson.zones.apache.org/hudson/job/subversion-trunk-ubuntu/ws/subversion-trunk/apr/include>   -I<http://hudson.zones.apache.org/hudson/job/subversion-trunk-ubuntu/ws/subversion-trunk/apr-util/include> -I<http://hudson.zones.apache.org/hudson/job/subversion-trunk-ubuntu/ws/subversion-trunk/sqlite-amalgamation>  -static  -o subversion/tests/libsvn_subr/opt-test.lo -c subversion/tests/libsvn_subr/opt-test.c
cd subversion/tests/libsvn_subr && <http://hudson.zones.apache.org/hudson/job/subversion-trunk-ubuntu/ws/subversion-trunk/apr/libtool> --tag=CC --silent --mode=link gcc -static  -Wold-style-definition -Wdeclaration-after-statement -Wpointer-arith -Wwrite-strings -Wshadow -ansi -Wall -Wformat=2 -Wunused -Waggregate-return -Wstrict-prototypes -Wmissing-prototypes -Wmissing-declarations -Wno-multichar -Wredundant-decls -Wnested-externs -Wunreachable-code -Winline -Wno-long-long -g -g -Wall -Wmissing-prototypes -Wstrict-prototypes -Wmissing-declarations -pthread -Werror=implicit-function-declaration  -DSVN_DEBUG -DAP_DEBUG   -rpath /usr/local/lib  -o opt-test  opt-test.lo ../../../subversion/tests/libsvn_test-1.la ../../../subversion/libsvn_subr/libsvn_subr-1.la -L<http://hudson.zones.apache.org/hudson/job/subversion-trunk-ubuntu/ws/subversion-trunk/apr> -lapr-1 
<http://hudson.zones.apache.org/hudson/job/subversion-trunk-ubuntu/ws/subversion-trunk/apr/libtool> --tag=CC --silent --mode=compile gcc -DLINUX=2 -D_REENTRANT -D_GNU_SOURCE  -Wold-style-definition -Wdeclaration-after-statement -Wpointer-arith -Wwrite-strings -Wshadow -ansi -Wall -Wformat=2 -Wunused -Waggregate-return -Wstrict-prototypes -Wmissing-prototypes -Wmissing-declarations -Wno-multichar -Wredundant-decls -Wnested-externs -Wunreachable-code -Winline -Wno-long-long -g -g -Wall -Wmissing-prototypes -Wstrict-prototypes -Wmissing-declarations -pthread -Werror=implicit-function-declaration  -DSVN_DEBUG -DAP_DEBUG  -I./subversion/include -I./subversion -I<http://hudson.zones.apache.org/hudson/job/subversion-trunk-ubuntu/ws/subversion-trunk/apr/include>   -I<http://hudson.zones.apache.org/hudson/job/subversion-trunk-ubuntu/ws/subversion-trunk/apr-util/include> -I<http://hudson.zones.apache.org/hudson/job/subversion-trunk-ubuntu/ws/subversion-trunk/sqlite-amalgamation>  -static  -o subversion/tests/libsvn_diff/parse-diff-test.lo -c subversion/tests/libsvn_diff/parse-diff-test.c
cd subversion/tests/libsvn_diff && <http://hudson.zones.apache.org/hudson/job/subversion-trunk-ubuntu/ws/subversion-trunk/apr/libtool> --tag=CC --silent --mode=link gcc -static  -Wold-style-definition -Wdeclaration-after-statement -Wpointer-arith -Wwrite-strings -Wshadow -ansi -Wall -Wformat=2 -Wunused -Waggregate-return -Wstrict-prototypes -Wmissing-prototypes -Wmissing-declarations -Wno-multichar -Wredundant-decls -Wnested-externs -Wunreachable-code -Winline -Wno-long-long -g -g -Wall -Wmissing-prototypes -Wstrict-prototypes -Wmissing-declarations -pthread -Werror=implicit-function-declaration  -DSVN_DEBUG -DAP_DEBUG   -rpath /usr/local/lib  -o parse-diff-test  parse-diff-test.lo ../../../subversion/tests/libsvn_test-1.la ../../../subversion/libsvn_diff/libsvn_diff-1.la ../../../subversion/libsvn_subr/libsvn_subr-1.la -L<http://hudson.zones.apache.org/hudson/job/subversion-trunk-ubuntu/ws/subversion-trunk/apr-util> -laprutil-1 -L<http://hudson.zones.apache.org/hudson/job/subversion-trunk-ubuntu/ws/subversion-trunk/apr> -lapr-1 
<http://hudson.zones.apache.org/hudson/job/subversion-trunk-ubuntu/ws/subversion-trunk/apr/libtool> --tag=CC --silent --mode=compile gcc -DLINUX=2 -D_REENTRANT -D_GNU_SOURCE  -Wold-style-definition -Wdeclaration-after-statement -Wpointer-arith -Wwrite-strings -Wshadow -ansi -Wall -Wformat=2 -Wunused -Waggregate-return -Wstrict-prototypes -Wmissing-prototypes -Wmissing-declarations -Wno-multichar -Wredundant-decls -Wnested-externs -Wunreachable-code -Winline -Wno-long-long -g -g -Wall -Wmissing-prototypes -Wstrict-prototypes -Wmissing-declarations -pthread -Werror=implicit-function-declaration  -DSVN_DEBUG -DAP_DEBUG  -I./subversion/include -I./subversion -I<http://hudson.zones.apache.org/hudson/job/subversion-trunk-ubuntu/ws/subversion-trunk/apr/include>   -I<http://hudson.zones.apache.org/hudson/job/subversion-trunk-ubuntu/ws/subversion-trunk/apr-util/include> -I<http://hudson.zones.apache.org/hudson/job/subversion-trunk-ubuntu/ws/subversion-trunk/sqlite-amalgamation>  -static  -o subversion/tests/libsvn_subr/path-test.lo -c subversion/tests/libsvn_subr/path-test.c
cd subversion/tests/libsvn_subr && <http://hudson.zones.apache.org/hudson/job/subversion-trunk-ubuntu/ws/subversion-trunk/apr/libtool> --tag=CC --silent --mode=link gcc -static  -Wold-style-definition -Wdeclaration-after-statement -Wpointer-arith -Wwrite-strings -Wshadow -ansi -Wall -Wformat=2 -Wunused -Waggregate-return -Wstrict-prototypes -Wmissing-prototypes -Wmissing-declarations -Wno-multichar -Wredundant-decls -Wnested-externs -Wunreachable-code -Winline -Wno-long-long -g -g -Wall -Wmissing-prototypes -Wstrict-prototypes -Wmissing-declarations -pthread -Werror=implicit-function-declaration  -DSVN_DEBUG -DAP_DEBUG   -rpath /usr/local/lib  -o path-test  path-test.lo ../../../subversion/tests/libsvn_test-1.la ../../../subversion/libsvn_subr/libsvn_subr-1.la -L<http://hudson.zones.apache.org/hudson/job/subversion-trunk-ubuntu/ws/subversion-trunk/apr-util> -laprutil-1 -L<http://hudson.zones.apache.org/hudson/job/subversion-trunk-ubuntu/ws/subversion-trunk/apr> -lapr-1 
<http://hudson.zones.apache.org/hudson/job/subversion-trunk-ubuntu/ws/subversion-trunk/apr/libtool> --tag=CC --silent --mode=compile gcc -DLINUX=2 -D_REENTRANT -D_GNU_SOURCE  -Wold-style-definition -Wdeclaration-after-statement -Wpointer-arith -Wwrite-strings -Wshadow -ansi -Wall -Wformat=2 -Wunused -Waggregate-return -Wstrict-prototypes -Wmissing-prototypes -Wmissing-declarations -Wno-multichar -Wredundant-decls -Wnested-externs -Wunreachable-code -Winline -Wno-long-long -g -g -Wall -Wmissing-prototypes -Wstrict-prototypes -Wmissing-declarations -pthread -Werror=implicit-function-declaration  -DSVN_DEBUG -DAP_DEBUG  -I./subversion/include -I./subversion -I<http://hudson.zones.apache.org/hudson/job/subversion-trunk-ubuntu/ws/subversion-trunk/apr/include>   -I<http://hudson.zones.apache.org/hudson/job/subversion-trunk-ubuntu/ws/subversion-trunk/apr-util/include> -I<http://hudson.zones.apache.org/hudson/job/subversion-trunk-ubuntu/ws/subversion-trunk/sqlite-amalgamation>  -static  -o subversion/tests/libsvn_ra_local/ra-local-test.lo -c subversion/tests/libsvn_ra_local/ra-local-test.c
cd subversion/tests/libsvn_ra_local && <http://hudson.zones.apache.org/hudson/job/subversion-trunk-ubuntu/ws/subversion-trunk/apr/libtool> --tag=CC --silent --mode=link gcc -static  -Wold-style-definition -Wdeclaration-after-statement -Wpointer-arith -Wwrite-strings -Wshadow -ansi -Wall -Wformat=2 -Wunused -Waggregate-return -Wstrict-prototypes -Wmissing-prototypes -Wmissing-declarations -Wno-multichar -Wredundant-decls -Wnested-externs -Wunreachable-code -Winline -Wno-long-long -g -g -Wall -Wmissing-prototypes -Wstrict-prototypes -Wmissing-declarations -pthread -Werror=implicit-function-declaration  -DSVN_DEBUG -DAP_DEBUG   -rpath /usr/local/lib  -o ra-local-test  ra-local-test.lo ../../../subversion/tests/libsvn_test-1.la ../../../subversion/libsvn_ra_local/libsvn_ra_local-1.la ../../../subversion/libsvn_ra/libsvn_ra-1.la ../../../subversion/libsvn_fs/libsvn_fs-1.la ../../../subversion/libsvn_delta/libsvn_delta-1.la ../../../subversion/libsvn_subr/libsvn_subr-1.la -L<http://hudson.zones.apache.org/hudson/job/subversion-trunk-ubuntu/ws/subversion-trunk/apr-util> -laprutil-1 -L<http://hudson.zones.apache.org/hudson/job/subversion-trunk-ubuntu/ws/subversion-trunk/apr> -lapr-1  
<http://hudson.zones.apache.org/hudson/job/subversion-trunk-ubuntu/ws/subversion-trunk/apr/libtool> --tag=CC --silent --mode=compile gcc -DLINUX=2 -D_REENTRANT -D_GNU_SOURCE  -Wold-style-definition -Wdeclaration-after-statement -Wpointer-arith -Wwrite-strings -Wshadow -ansi -Wall -Wformat=2 -Wunused -Waggregate-return -Wstrict-prototypes -Wmissing-prototypes -Wmissing-declarations -Wno-multichar -Wredundant-decls -Wnested-externs -Wunreachable-code -Winline -Wno-long-long -g -g -Wall -Wmissing-prototypes -Wstrict-prototypes -Wmissing-declarations -pthread -Werror=implicit-function-declaration  -DSVN_DEBUG -DAP_DEBUG  -I./subversion/include -I./subversion -I<http://hudson.zones.apache.org/hudson/job/subversion-trunk-ubuntu/ws/subversion-trunk/apr/include>   -I<http://hudson.zones.apache.org/hudson/job/subversion-trunk-ubuntu/ws/subversion-trunk/apr-util/include> -I<http://hudson.zones.apache.org/hudson/job/subversion-trunk-ubuntu/ws/subversion-trunk/sqlite-amalgamation>  -static  -o subversion/tests/libsvn_delta/random-test.lo -c subversion/tests/libsvn_delta/random-test.c
cd subversion/tests/libsvn_delta && <http://hudson.zones.apache.org/hudson/job/subversion-trunk-ubuntu/ws/subversion-trunk/apr/libtool> --tag=CC --silent --mode=link gcc -static  -Wold-style-definition -Wdeclaration-after-statement -Wpointer-arith -Wwrite-strings -Wshadow -ansi -Wall -Wformat=2 -Wunused -Waggregate-return -Wstrict-prototypes -Wmissing-prototypes -Wmissing-declarations -Wno-multichar -Wredundant-decls -Wnested-externs -Wunreachable-code -Winline -Wno-long-long -g -g -Wall -Wmissing-prototypes -Wstrict-prototypes -Wmissing-declarations -pthread -Werror=implicit-function-declaration  -DSVN_DEBUG -DAP_DEBUG   -rpath /usr/local/lib  -o random-test  random-test.lo ../../../subversion/tests/libsvn_test-1.la ../../../subversion/libsvn_delta/libsvn_delta-1.la ../../../subversion/libsvn_subr/libsvn_subr-1.la -L<http://hudson.zones.apache.org/hudson/job/subversion-trunk-ubuntu/ws/subversion-trunk/apr-util> -laprutil-1 -L<http://hudson.zones.apache.org/hudson/job/subversion-trunk-ubuntu/ws/subversion-trunk/apr> -lapr-1 
<http://hudson.zones.apache.org/hudson/job/subversion-trunk-ubuntu/ws/subversion-trunk/apr/libtool> --tag=CC --silent --mode=compile gcc -DLINUX=2 -D_REENTRANT -D_GNU_SOURCE  -Wold-style-definition -Wdeclaration-after-statement -Wpointer-arith -Wwrite-strings -Wshadow -ansi -Wall -Wformat=2 -Wunused -Waggregate-return -Wstrict-prototypes -Wmissing-prototypes -Wmissing-declarations -Wno-multichar -Wredundant-decls -Wnested-externs -Wunreachable-code -Winline -Wno-long-long -g -g -Wall -Wmissing-prototypes -Wstrict-prototypes -Wmissing-declarations -pthread -Werror=implicit-function-declaration  -DSVN_DEBUG -DAP_DEBUG  -I./subversion/include -I./subversion -I<http://hudson.zones.apache.org/hudson/job/subversion-trunk-ubuntu/ws/subversion-trunk/apr/include>   -I<http://hudson.zones.apache.org/hudson/job/subversion-trunk-ubuntu/ws/subversion-trunk/apr-util/include> -I<http://hudson.zones.apache.org/hudson/job/subversion-trunk-ubuntu/ws/subversion-trunk/sqlite-amalgamation>  -static  -o subversion/tests/libsvn_repos/dir-delta-editor.lo -c subversion/tests/libsvn_repos/dir-delta-editor.c
subversion/tests/libsvn_repos/dir-delta-editor.c: In function ?test_delete_entry?:
subversion/tests/libsvn_repos/dir-delta-editor.c:76: warning: ?svn_path_join? is deprecated (declared at ./subversion/include/svn_path.h:108)
subversion/tests/libsvn_repos/dir-delta-editor.c: In function ?test_open_directory?:
subversion/tests/libsvn_repos/dir-delta-editor.c:111: warning: ?svn_path_join? is deprecated (declared at ./subversion/include/svn_path.h:108)
subversion/tests/libsvn_repos/dir-delta-editor.c: In function ?test_add_directory?:
subversion/tests/libsvn_repos/dir-delta-editor.c:136: warning: ?svn_path_join? is deprecated (declared at ./subversion/include/svn_path.h:108)
subversion/tests/libsvn_repos/dir-delta-editor.c: In function ?test_open_file?:
subversion/tests/libsvn_repos/dir-delta-editor.c:175: warning: ?svn_path_join? is deprecated (declared at ./subversion/include/svn_path.h:108)
subversion/tests/libsvn_repos/dir-delta-editor.c: In function ?test_add_file?:
subversion/tests/libsvn_repos/dir-delta-editor.c:199: warning: ?svn_path_join? is deprecated (declared at ./subversion/include/svn_path.h:108)
<http://hudson.zones.apache.org/hudson/job/subversion-trunk-ubuntu/ws/subversion-trunk/apr/libtool> --tag=CC --silent --mode=compile gcc -DLINUX=2 -D_REENTRANT -D_GNU_SOURCE  -Wold-style-definition -Wdeclaration-after-statement -Wpointer-arith -Wwrite-strings -Wshadow -ansi -Wall -Wformat=2 -Wunused -Waggregate-return -Wstrict-prototypes -Wmissing-prototypes -Wmissing-declarations -Wno-multichar -Wredundant-decls -Wnested-externs -Wunreachable-code -Winline -Wno-long-long -g -g -Wall -Wmissing-prototypes -Wstrict-prototypes -Wmissing-declarations -pthread -Werror=implicit-function-declaration  -DSVN_DEBUG -DAP_DEBUG  -I./subversion/include -I./subversion -I<http://hudson.zones.apache.org/hudson/job/subversion-trunk-ubuntu/ws/subversion-trunk/apr/include>   -I<http://hudson.zones.apache.org/hudson/job/subversion-trunk-ubuntu/ws/subversion-trunk/apr-util/include> -I<http://hudson.zones.apache.org/hudson/job/subversion-trunk-ubuntu/ws/subversion-trunk/sqlite-amalgamation>  -static  -o subversion/tests/libsvn_repos/repos-test.lo -c subversion/tests/libsvn_repos/repos-test.c
cd subversion/tests/libsvn_repos && <http://hudson.zones.apache.org/hudson/job/subversion-trunk-ubuntu/ws/subversion-trunk/apr/libtool> --tag=CC --silent --mode=link gcc -static  -Wold-style-definition -Wdeclaration-after-statement -Wpointer-arith -Wwrite-strings -Wshadow -ansi -Wall -Wformat=2 -Wunused -Waggregate-return -Wstrict-prototypes -Wmissing-prototypes -Wmissing-declarations -Wno-multichar -Wredundant-decls -Wnested-externs -Wunreachable-code -Winline -Wno-long-long -g -g -Wall -Wmissing-prototypes -Wstrict-prototypes -Wmissing-declarations -pthread -Werror=implicit-function-declaration  -DSVN_DEBUG -DAP_DEBUG   -rpath /usr/local/lib  -o repos-test  dir-delta-editor.lo repos-test.lo ../../../subversion/tests/libsvn_test-1.la ../../../subversion/libsvn_repos/libsvn_repos-1.la ../../../subversion/libsvn_fs/libsvn_fs-1.la ../../../subversion/libsvn_delta/libsvn_delta-1.la ../../../subversion/libsvn_subr/libsvn_subr-1.la -L<http://hudson.zones.apache.org/hudson/job/subversion-trunk-ubuntu/ws/subversion-trunk/apr-util> -laprutil-1 -L<http://hudson.zones.apache.org/hudson/job/subversion-trunk-ubuntu/ws/subversion-trunk/apr> -lapr-1 
<http://hudson.zones.apache.org/hudson/job/subversion-trunk-ubuntu/ws/subversion-trunk/apr/libtool> --tag=CC --silent --mode=compile gcc -DLINUX=2 -D_REENTRANT -D_GNU_SOURCE  -Wold-style-definition -Wdeclaration-after-statement -Wpointer-arith -Wwrite-strings -Wshadow -ansi -Wall -Wformat=2 -Wunused -Waggregate-return -Wstrict-prototypes -Wmissing-prototypes -Wmissing-declarations -Wno-multichar -Wredundant-decls -Wnested-externs -Wunreachable-code -Winline -Wno-long-long -g -g -Wall -Wmissing-prototypes -Wstrict-prototypes -Wmissing-declarations -pthread -Werror=implicit-function-declaration  -DSVN_DEBUG -DAP_DEBUG  -I./subversion/include -I./subversion -I<http://hudson.zones.apache.org/hudson/job/subversion-trunk-ubuntu/ws/subversion-trunk/apr/include>   -I<http://hudson.zones.apache.org/hudson/job/subversion-trunk-ubuntu/ws/subversion-trunk/apr-util/include> -I<http://hudson.zones.apache.org/hudson/job/subversion-trunk-ubuntu/ws/subversion-trunk/sqlite-amalgamation>  -static  -o subversion/tests/libsvn_subr/revision-test.lo -c subversion/tests/libsvn_subr/revision-test.c
cd subversion/tests/libsvn_subr && <http://hudson.zones.apache.org/hudson/job/subversion-trunk-ubuntu/ws/subversion-trunk/apr/libtool> --tag=CC --silent --mode=link gcc -static  -Wold-style-definition -Wdeclaration-after-statement -Wpointer-arith -Wwrite-strings -Wshadow -ansi -Wall -Wformat=2 -Wunused -Waggregate-return -Wstrict-prototypes -Wmissing-prototypes -Wmissing-declarations -Wno-multichar -Wredundant-decls -Wnested-externs -Wunreachable-code -Winline -Wno-long-long -g -g -Wall -Wmissing-prototypes -Wstrict-prototypes -Wmissing-declarations -pthread -Werror=implicit-function-declaration  -DSVN_DEBUG -DAP_DEBUG   -rpath /usr/local/lib  -o revision-test  revision-test.lo ../../../subversion/tests/libsvn_test-1.la ../../../subversion/libsvn_subr/libsvn_subr-1.la -L<http://hudson.zones.apache.org/hudson/job/subversion-trunk-ubuntu/ws/subversion-trunk/apr> -lapr-1 
<http://hudson.zones.apache.org/hudson/job/subversion-trunk-ubuntu/ws/subversion-trunk/apr/libtool> --tag=CC --silent --mode=compile gcc -DLINUX=2 -D_REENTRANT -D_GNU_SOURCE  -Wold-style-definition -Wdeclaration-after-statement -Wpointer-arith -Wwrite-strings -Wshadow -ansi -Wall -Wformat=2 -Wunused -Waggregate-return -Wstrict-prototypes -Wmissing-prototypes -Wmissing-declarations -Wno-multichar -Wredundant-decls -Wnested-externs -Wunreachable-code -Winline -Wno-long-long -g -g -Wall -Wmissing-prototypes -Wstrict-prototypes -Wmissing-declarations -pthread -Werror=implicit-function-declaration  -DSVN_DEBUG -DAP_DEBUG  -I./subversion/include -I./subversion -I<http://hudson.zones.apache.org/hudson/job/subversion-trunk-ubuntu/ws/subversion-trunk/apr/include>   -I<http://hudson.zones.apache.org/hudson/job/subversion-trunk-ubuntu/ws/subversion-trunk/apr-util/include> -I<http://hudson.zones.apache.org/hudson/job/subversion-trunk-ubuntu/ws/subversion-trunk/sqlite-amalgamation>  -static  -o subversion/tests/libsvn_subr/skel-test.lo -c subversion/tests/libsvn_subr/skel-test.c
cd subversion/tests/libsvn_subr && <http://hudson.zones.apache.org/hudson/job/subversion-trunk-ubuntu/ws/subversion-trunk/apr/libtool> --tag=CC --silent --mode=link gcc -static  -Wold-style-definition -Wdeclaration-after-statement -Wpointer-arith -Wwrite-strings -Wshadow -ansi -Wall -Wformat=2 -Wunused -Waggregate-return -Wstrict-prototypes -Wmissing-prototypes -Wmissing-declarations -Wno-multichar -Wredundant-decls -Wnested-externs -Wunreachable-code -Winline -Wno-long-long -g -g -Wall -Wmissing-prototypes -Wstrict-prototypes -Wmissing-declarations -pthread -Werror=implicit-function-declaration  -DSVN_DEBUG -DAP_DEBUG   -rpath /usr/local/lib  -o skel-test  skel-test.lo ../../../subversion/tests/libsvn_test-1.la ../../../subversion/libsvn_subr/libsvn_subr-1.la -L<http://hudson.zones.apache.org/hudson/job/subversion-trunk-ubuntu/ws/subversion-trunk/apr-util> -laprutil-1 -L<http://hudson.zones.apache.org/hudson/job/subversion-trunk-ubuntu/ws/subversion-trunk/apr> -lapr-1 
<http://hudson.zones.apache.org/hudson/job/subversion-trunk-ubuntu/ws/subversion-trunk/apr/libtool> --tag=CC --silent --mode=compile gcc -DLINUX=2 -D_REENTRANT -D_GNU_SOURCE  -Wold-style-definition -Wdeclaration-after-statement -Wpointer-arith -Wwrite-strings -Wshadow -ansi -Wall -Wformat=2 -Wunused -Waggregate-return -Wstrict-prototypes -Wmissing-prototypes -Wmissing-declarations -Wno-multichar -Wredundant-decls -Wnested-externs -Wunreachable-code -Winline -Wno-long-long -g -g -Wall -Wmissing-prototypes -Wstrict-prototypes -Wmissing-declarations -pthread -Werror=implicit-function-declaration  -DSVN_DEBUG -DAP_DEBUG  -I./subversion/include -I./subversion -I<http://hudson.zones.apache.org/hudson/job/subversion-trunk-ubuntu/ws/subversion-trunk/apr/include>   -I<http://hudson.zones.apache.org/hudson/job/subversion-trunk-ubuntu/ws/subversion-trunk/apr-util/include> -I<http://hudson.zones.apache.org/hudson/job/subversion-trunk-ubuntu/ws/subversion-trunk/sqlite-amalgamation>  -static  -o subversion/tests/libsvn_subr/stream-test.lo -c subversion/tests/libsvn_subr/stream-test.c
cd subversion/tests/libsvn_subr && <http://hudson.zones.apache.org/hudson/job/subversion-trunk-ubuntu/ws/subversion-trunk/apr/libtool> --tag=CC --silent --mode=link gcc -static  -Wold-style-definition -Wdeclaration-after-statement -Wpointer-arith -Wwrite-strings -Wshadow -ansi -Wall -Wformat=2 -Wunused -Waggregate-return -Wstrict-prototypes -Wmissing-prototypes -Wmissing-declarations -Wno-multichar -Wredundant-decls -Wnested-externs -Wunreachable-code -Winline -Wno-long-long -g -g -Wall -Wmissing-prototypes -Wstrict-prototypes -Wmissing-declarations -pthread -Werror=implicit-function-declaration  -DSVN_DEBUG -DAP_DEBUG   -rpath /usr/local/lib  -o stream-test  stream-test.lo ../../../subversion/tests/libsvn_test-1.la ../../../subversion/libsvn_subr/libsvn_subr-1.la -L<http://hudson.zones.apache.org/hudson/job/subversion-trunk-ubuntu/ws/subversion-trunk/apr-util> -laprutil-1 -L<http://hudson.zones.apache.org/hudson/job/subversion-trunk-ubuntu/ws/subversion-trunk/apr> -lapr-1 
<http://hudson.zones.apache.org/hudson/job/subversion-trunk-ubuntu/ws/subversion-trunk/apr/libtool> --tag=CC --silent --mode=compile gcc -DLINUX=2 -D_REENTRANT -D_GNU_SOURCE  -Wold-style-definition -Wdeclaration-after-statement -Wpointer-arith -Wwrite-strings -Wshadow -ansi -Wall -Wformat=2 -Wunused -Waggregate-return -Wstrict-prototypes -Wmissing-prototypes -Wmissing-declarations -Wno-multichar -Wredundant-decls -Wnested-externs -Wunreachable-code -Winline -Wno-long-long -g -g -Wall -Wmissing-prototypes -Wstrict-prototypes -Wmissing-declarations -pthread -Werror=implicit-function-declaration  -DSVN_DEBUG -DAP_DEBUG  -I./subversion/include -I./subversion -I<http://hudson.zones.apache.org/hudson/job/subversion-trunk-ubuntu/ws/subversion-trunk/apr/include>   -I<http://hudson.zones.apache.org/hudson/job/subversion-trunk-ubuntu/ws/subversion-trunk/apr-util/include> -I<http://hudson.zones.apache.org/hudson/job/subversion-trunk-ubuntu/ws/subversion-trunk/sqlite-amalgamation>  -static  -o subversion/tests/libsvn_subr/string-test.lo -c subversion/tests/libsvn_subr/string-test.c
cd subversion/tests/libsvn_subr && <http://hudson.zones.apache.org/hudson/job/subversion-trunk-ubuntu/ws/subversion-trunk/apr/libtool> --tag=CC --silent --mode=link gcc -static  -Wold-style-definition -Wdeclaration-after-statement -Wpointer-arith -Wwrite-strings -Wshadow -ansi -Wall -Wformat=2 -Wunused -Waggregate-return -Wstrict-prototypes -Wmissing-prototypes -Wmissing-declarations -Wno-multichar -Wredundant-decls -Wnested-externs -Wunreachable-code -Winline -Wno-long-long -g -g -Wall -Wmissing-prototypes -Wstrict-prototypes -Wmissing-declarations -pthread -Werror=implicit-function-declaration  -DSVN_DEBUG -DAP_DEBUG   -rpath /usr/local/lib  -o string-test  string-test.lo ../../../subversion/tests/libsvn_test-1.la ../../../subversion/libsvn_subr/libsvn_subr-1.la -L<http://hudson.zones.apache.org/hudson/job/subversion-trunk-ubuntu/ws/subversion-trunk/apr-util> -laprutil-1 -L<http://hudson.zones.apache.org/hudson/job/subversion-trunk-ubuntu/ws/subversion-trunk/apr> -lapr-1 
<http://hudson.zones.apache.org/hudson/job/subversion-trunk-ubuntu/ws/subversion-trunk/apr/libtool> --tag=CC --silent --mode=compile gcc -DLINUX=2 -D_REENTRANT -D_GNU_SOURCE  -Wold-style-definition -Wdeclaration-after-statement -Wpointer-arith -Wwrite-strings -Wshadow -ansi -Wall -Wformat=2 -Wunused -Waggregate-return -Wstrict-prototypes -Wmissing-prototypes -Wmissing-declarations -Wno-multichar -Wredundant-decls -Wnested-externs -Wunreachable-code -Winline -Wno-long-long -g -g -Wall -Wmissing-prototypes -Wstrict-prototypes -Wmissing-declarations -pthread -Werror=implicit-function-declaration  -DSVN_DEBUG -DAP_DEBUG  -I./subversion/include -I./subversion -I<http://hudson.zones.apache.org/hudson/job/subversion-trunk-ubuntu/ws/subversion-trunk/apr/include>   -I<http://hudson.zones.apache.org/hudson/job/subversion-trunk-ubuntu/ws/subversion-trunk/apr-util/include> -I<http://hudson.zones.apache.org/hudson/job/subversion-trunk-ubuntu/ws/subversion-trunk/sqlite-amalgamation>  -static  -o subversion/tests/libsvn_delta/svndiff-test.lo -c subversion/tests/libsvn_delta/svndiff-test.c
cd subversion/tests/libsvn_delta && <http://hudson.zones.apache.org/hudson/job/subversion-trunk-ubuntu/ws/subversion-trunk/apr/libtool> --tag=CC --silent --mode=link gcc -static  -Wold-style-definition -Wdeclaration-after-statement -Wpointer-arith -Wwrite-strings -Wshadow -ansi -Wall -Wformat=2 -Wunused -Waggregate-return -Wstrict-prototypes -Wmissing-prototypes -Wmissing-declarations -Wno-multichar -Wredundant-decls -Wnested-externs -Wunreachable-code -Winline -Wno-long-long -g -g -Wall -Wmissing-prototypes -Wstrict-prototypes -Wmissing-declarations -pthread -Werror=implicit-function-declaration  -DSVN_DEBUG -DAP_DEBUG   -rpath /usr/local/lib  -o svndiff-test  svndiff-test.lo ../../../subversion/libsvn_delta/libsvn_delta-1.la ../../../subversion/libsvn_subr/libsvn_subr-1.la -L<http://hudson.zones.apache.org/hudson/job/subversion-trunk-ubuntu/ws/subversion-trunk/apr-util> -laprutil-1 -L<http://hudson.zones.apache.org/hudson/job/subversion-trunk-ubuntu/ws/subversion-trunk/apr> -lapr-1 
<http://hudson.zones.apache.org/hudson/job/subversion-trunk-ubuntu/ws/subversion-trunk/apr/libtool> --tag=CC --silent --mode=compile gcc -DLINUX=2 -D_REENTRANT -D_GNU_SOURCE  -Wold-style-definition -Wdeclaration-after-statement -Wpointer-arith -Wwrite-strings -Wshadow -ansi -Wall -Wformat=2 -Wunused -Waggregate-return -Wstrict-prototypes -Wmissing-prototypes -Wmissing-declarations -Wno-multichar -Wredundant-decls -Wnested-externs -Wunreachable-code -Winline -Wno-long-long -g -g -Wall -Wmissing-prototypes -Wstrict-prototypes -Wmissing-declarations -pthread -Werror=implicit-function-declaration  -DSVN_DEBUG -DAP_DEBUG  -I./subversion/include -I./subversion -I<http://hudson.zones.apache.org/hudson/job/subversion-trunk-ubuntu/ws/subversion-trunk/apr/include>   -I<http://hudson.zones.apache.org/hudson/job/subversion-trunk-ubuntu/ws/subversion-trunk/apr-util/include> -I<http://hudson.zones.apache.org/hudson/job/subversion-trunk-ubuntu/ws/subversion-trunk/sqlite-amalgamation>  -static  -o subversion/tests/libsvn_subr/target-test.lo -c subversion/tests/libsvn_subr/target-test.c
subversion/tests/libsvn_subr/target-test.c: In function ?condense_targets_tests_helper?:
subversion/tests/libsvn_subr/target-test.c:73: warning: ?svn_path_internal_style? is deprecated (declared at ./subversion/include/svn_path.h:71)
subversion/tests/libsvn_subr/target-test.c:81: warning: ?svn_path_internal_style? is deprecated (declared at ./subversion/include/svn_path.h:71)
subversion/tests/libsvn_subr/target-test.c: In function ?test_path_condense_targets?:
subversion/tests/libsvn_subr/target-test.c:176: warning: ?svn_path_condense_targets? is deprecated (declared at ./subversion/include/svn_path.h:375)
cd subversion/tests/libsvn_subr && <http://hudson.zones.apache.org/hudson/job/subversion-trunk-ubuntu/ws/subversion-trunk/apr/libtool> --tag=CC --silent --mode=link gcc -static  -Wold-style-definition -Wdeclaration-after-statement -Wpointer-arith -Wwrite-strings -Wshadow -ansi -Wall -Wformat=2 -Wunused -Waggregate-return -Wstrict-prototypes -Wmissing-prototypes -Wmissing-declarations -Wno-multichar -Wredundant-decls -Wnested-externs -Wunreachable-code -Winline -Wno-long-long -g -g -Wall -Wmissing-prototypes -Wstrict-prototypes -Wmissing-declarations -pthread -Werror=implicit-function-declaration  -DSVN_DEBUG -DAP_DEBUG   -rpath /usr/local/lib  -o target-test  target-test.lo ../../../subversion/tests/libsvn_test-1.la ../../../subversion/libsvn_subr/libsvn_subr-1.la -L<http://hudson.zones.apache.org/hudson/job/subversion-trunk-ubuntu/ws/subversion-trunk/apr-util> -laprutil-1 -L<http://hudson.zones.apache.org/hudson/job/subversion-trunk-ubuntu/ws/subversion-trunk/apr> -lapr-1 
<http://hudson.zones.apache.org/hudson/job/subversion-trunk-ubuntu/ws/subversion-trunk/apr/libtool> --tag=CC --silent --mode=compile gcc -DLINUX=2 -D_REENTRANT -D_GNU_SOURCE  -Wold-style-definition -Wdeclaration-after-statement -Wpointer-arith -Wwrite-strings -Wshadow -ansi -Wall -Wformat=2 -Wunused -Waggregate-return -Wstrict-prototypes -Wmissing-prototypes -Wmissing-declarations -Wno-multichar -Wredundant-decls -Wnested-externs -Wunreachable-code -Winline -Wno-long-long -g -g -Wall -Wmissing-prototypes -Wstrict-prototypes -Wmissing-declarations -pthread -Werror=implicit-function-declaration  -DSVN_DEBUG -DAP_DEBUG  -I./subversion/include -I./subversion -I<http://hudson.zones.apache.org/hudson/job/subversion-trunk-ubuntu/ws/subversion-trunk/apr/include>   -I<http://hudson.zones.apache.org/hudson/job/subversion-trunk-ubuntu/ws/subversion-trunk/apr-util/include> -I<http://hudson.zones.apache.org/hudson/job/subversion-trunk-ubuntu/ws/subversion-trunk/sqlite-amalgamation>  -static  -o subversion/tests/libsvn_subr/time-test.lo -c subversion/tests/libsvn_subr/time-test.c
cd subversion/tests/libsvn_subr && <http://hudson.zones.apache.org/hudson/job/subversion-trunk-ubuntu/ws/subversion-trunk/apr/libtool> --tag=CC --silent --mode=link gcc -static  -Wold-style-definition -Wdeclaration-after-statement -Wpointer-arith -Wwrite-strings -Wshadow -ansi -Wall -Wformat=2 -Wunused -Waggregate-return -Wstrict-prototypes -Wmissing-prototypes -Wmissing-declarations -Wno-multichar -Wredundant-decls -Wnested-externs -Wunreachable-code -Winline -Wno-long-long -g -g -Wall -Wmissing-prototypes -Wstrict-prototypes -Wmissing-declarations -pthread -Werror=implicit-function-declaration  -DSVN_DEBUG -DAP_DEBUG   -rpath /usr/local/lib  -o time-test  time-test.lo ../../../subversion/tests/libsvn_test-1.la ../../../subversion/libsvn_subr/libsvn_subr-1.la -L<http://hudson.zones.apache.org/hudson/job/subversion-trunk-ubuntu/ws/subversion-trunk/apr-util> -laprutil-1 -L<http://hudson.zones.apache.org/hudson/job/subversion-trunk-ubuntu/ws/subversion-trunk/apr> -lapr-1 
<http://hudson.zones.apache.org/hudson/job/subversion-trunk-ubuntu/ws/subversion-trunk/apr/libtool> --tag=CC --silent --mode=compile gcc -DLINUX=2 -D_REENTRANT -D_GNU_SOURCE  -Wold-style-definition -Wdeclaration-after-statement -Wpointer-arith -Wwrite-strings -Wshadow -ansi -Wall -Wformat=2 -Wunused -Waggregate-return -Wstrict-prototypes -Wmissing-prototypes -Wmissing-declarations -Wno-multichar -Wredundant-decls -Wnested-externs -Wunreachable-code -Winline -Wno-long-long -g -g -Wall -Wmissing-prototypes -Wstrict-prototypes -Wmissing-declarations -pthread -Werror=implicit-function-declaration  -DSVN_DEBUG -DAP_DEBUG  -I./subversion/include -I./subversion -I<http://hudson.zones.apache.org/hudson/job/subversion-trunk-ubuntu/ws/subversion-trunk/apr/include>   -I<http://hudson.zones.apache.org/hudson/job/subversion-trunk-ubuntu/ws/subversion-trunk/apr-util/include> -I<http://hudson.zones.apache.org/hudson/job/subversion-trunk-ubuntu/ws/subversion-trunk/sqlite-amalgamation>  -static  -o subversion/tests/libsvn_subr/translate-test.lo -c subversion/tests/libsvn_subr/translate-test.c
cd subversion/tests/libsvn_subr && <http://hudson.zones.apache.org/hudson/job/subversion-trunk-ubuntu/ws/subversion-trunk/apr/libtool> --tag=CC --silent --mode=link gcc -static  -Wold-style-definition -Wdeclaration-after-statement -Wpointer-arith -Wwrite-strings -Wshadow -ansi -Wall -Wformat=2 -Wunused -Waggregate-return -Wstrict-prototypes -Wmissing-prototypes -Wmissing-declarations -Wno-multichar -Wredundant-decls -Wnested-externs -Wunreachable-code -Winline -Wno-long-long -g -g -Wall -Wmissing-prototypes -Wstrict-prototypes -Wmissing-declarations -pthread -Werror=implicit-function-declaration  -DSVN_DEBUG -DAP_DEBUG   -rpath /usr/local/lib  -o translate-test  translate-test.lo ../../../subversion/tests/libsvn_test-1.la ../../../subversion/libsvn_subr/libsvn_subr-1.la -L<http://hudson.zones.apache.org/hudson/job/subversion-trunk-ubuntu/ws/subversion-trunk/apr-util> -laprutil-1 -L<http://hudson.zones.apache.org/hudson/job/subversion-trunk-ubuntu/ws/subversion-trunk/apr> -lapr-1 
<http://hudson.zones.apache.org/hudson/job/subversion-trunk-ubuntu/ws/subversion-trunk/apr/libtool> --tag=CC --silent --mode=compile gcc -DLINUX=2 -D_REENTRANT -D_GNU_SOURCE  -Wold-style-definition -Wdeclaration-after-statement -Wpointer-arith -Wwrite-strings -Wshadow -ansi -Wall -Wformat=2 -Wunused -Waggregate-return -Wstrict-prototypes -Wmissing-prototypes -Wmissing-declarations -Wno-multichar -Wredundant-decls -Wnested-externs -Wunreachable-code -Winline -Wno-long-long -g -g -Wall -Wmissing-prototypes -Wstrict-prototypes -Wmissing-declarations -pthread -Werror=implicit-function-declaration  -DSVN_DEBUG -DAP_DEBUG  -I./subversion/include -I./subversion -I<http://hudson.zones.apache.org/hudson/job/subversion-trunk-ubuntu/ws/subversion-trunk/apr/include>   -I<http://hudson.zones.apache.org/hudson/job/subversion-trunk-ubuntu/ws/subversion-trunk/apr-util/include> -I<http://hudson.zones.apache.org/hudson/job/subversion-trunk-ubuntu/ws/subversion-trunk/sqlite-amalgamation>  -static  -o subversion/tests/libsvn_wc/tree-conflict-data-test.lo -c subversion/tests/libsvn_wc/tree-conflict-data-test.c
cd subversion/tests/libsvn_wc && <http://hudson.zones.apache.org/hudson/job/subversion-trunk-ubuntu/ws/subversion-trunk/apr/libtool> --tag=CC --silent --mode=link gcc -static  -Wold-style-definition -Wdeclaration-after-statement -Wpointer-arith -Wwrite-strings -Wshadow -ansi -Wall -Wformat=2 -Wunused -Waggregate-return -Wstrict-prototypes -Wmissing-prototypes -Wmissing-declarations -Wno-multichar -Wredundant-decls -Wnested-externs -Wunreachable-code -Winline -Wno-long-long -g -g -Wall -Wmissing-prototypes -Wstrict-prototypes -Wmissing-declarations -pthread -Werror=implicit-function-declaration  -DSVN_DEBUG -DAP_DEBUG   -rpath /usr/local/lib  -o tree-conflict-data-test  tree-conflict-data-test.lo ../../../subversion/tests/libsvn_test-1.la ../../../subversion/libsvn_wc/libsvn_wc-1.la ../../../subversion/libsvn_subr/libsvn_subr-1.la -L<http://hudson.zones.apache.org/hudson/job/subversion-trunk-ubuntu/ws/subversion-trunk/apr-util> -laprutil-1 -L<http://hudson.zones.apache.org/hudson/job/subversion-trunk-ubuntu/ws/subversion-trunk/apr> -lapr-1 
<http://hudson.zones.apache.org/hudson/job/subversion-trunk-ubuntu/ws/subversion-trunk/apr/libtool> --tag=CC --silent --mode=compile gcc -DLINUX=2 -D_REENTRANT -D_GNU_SOURCE  -Wold-style-definition -Wdeclaration-after-statement -Wpointer-arith -Wwrite-strings -Wshadow -ansi -Wall -Wformat=2 -Wunused -Waggregate-return -Wstrict-prototypes -Wmissing-prototypes -Wmissing-declarations -Wno-multichar -Wredundant-decls -Wnested-externs -Wunreachable-code -Winline -Wno-long-long -g -g -Wall -Wmissing-prototypes -Wstrict-prototypes -Wmissing-declarations -pthread -Werror=implicit-function-declaration  -DSVN_DEBUG -DAP_DEBUG  -I./subversion/include -I./subversion -I<http://hudson.zones.apache.org/hudson/job/subversion-trunk-ubuntu/ws/subversion-trunk/apr/include>   -I<http://hudson.zones.apache.org/hudson/job/subversion-trunk-ubuntu/ws/subversion-trunk/apr-util/include> -I<http://hudson.zones.apache.org/hudson/job/subversion-trunk-ubuntu/ws/subversion-trunk/sqlite-amalgamation>  -static  -o subversion/tests/libsvn_subr/utf-test.lo -c subversion/tests/libsvn_subr/utf-test.c
cd subversion/tests/libsvn_subr && <http://hudson.zones.apache.org/hudson/job/subversion-trunk-ubuntu/ws/subversion-trunk/apr/libtool> --tag=CC --silent --mode=link gcc -static  -Wold-style-definition -Wdeclaration-after-statement -Wpointer-arith -Wwrite-strings -Wshadow -ansi -Wall -Wformat=2 -Wunused -Waggregate-return -Wstrict-prototypes -Wmissing-prototypes -Wmissing-declarations -Wno-multichar -Wredundant-decls -Wnested-externs -Wunreachable-code -Winline -Wno-long-long -g -g -Wall -Wmissing-prototypes -Wstrict-prototypes -Wmissing-declarations -pthread -Werror=implicit-function-declaration  -DSVN_DEBUG -DAP_DEBUG   -rpath /usr/local/lib  -o utf-test  utf-test.lo ../../../subversion/tests/libsvn_test-1.la ../../../subversion/libsvn_subr/libsvn_subr-1.la -L<http://hudson.zones.apache.org/hudson/job/subversion-trunk-ubuntu/ws/subversion-trunk/apr-util> -laprutil-1 -L<http://hudson.zones.apache.org/hudson/job/subversion-trunk-ubuntu/ws/subversion-trunk/apr> -lapr-1 
<http://hudson.zones.apache.org/hudson/job/subversion-trunk-ubuntu/ws/subversion-trunk/apr/libtool> --tag=CC --silent --mode=compile gcc -DLINUX=2 -D_REENTRANT -D_GNU_SOURCE  -Wold-style-definition -Wdeclaration-after-statement -Wpointer-arith -Wwrite-strings -Wshadow -ansi -Wall -Wformat=2 -Wunused -Waggregate-return -Wstrict-prototypes -Wmissing-prototypes -Wmissing-declarations -Wno-multichar -Wredundant-decls -Wnested-externs -Wunreachable-code -Winline -Wno-long-long -g -g -Wall -Wmissing-prototypes -Wstrict-prototypes -Wmissing-declarations -pthread -Werror=implicit-function-declaration  -DSVN_DEBUG -DAP_DEBUG  -I./subversion/include -I./subversion -I<http://hudson.zones.apache.org/hudson/job/subversion-trunk-ubuntu/ws/subversion-trunk/apr/include>   -I<http://hudson.zones.apache.org/hudson/job/subversion-trunk-ubuntu/ws/subversion-trunk/apr-util/include> -I<http://hudson.zones.apache.org/hudson/job/subversion-trunk-ubuntu/ws/subversion-trunk/sqlite-amalgamation>  -static  -o subversion/tests/libsvn_delta/vdelta-test.lo -c subversion/tests/libsvn_delta/vdelta-test.c
cd subversion/tests/libsvn_delta && <http://hudson.zones.apache.org/hudson/job/subversion-trunk-ubuntu/ws/subversion-trunk/apr/libtool> --tag=CC --silent --mode=link gcc -static  -Wold-style-definition -Wdeclaration-after-statement -Wpointer-arith -Wwrite-strings -Wshadow -ansi -Wall -Wformat=2 -Wunused -Waggregate-return -Wstrict-prototypes -Wmissing-prototypes -Wmissing-declarations -Wno-multichar -Wredundant-decls -Wnested-externs -Wunreachable-code -Winline -Wno-long-long -g -g -Wall -Wmissing-prototypes -Wstrict-prototypes -Wmissing-declarations -pthread -Werror=implicit-function-declaration  -DSVN_DEBUG -DAP_DEBUG   -rpath /usr/local/lib  -o vdelta-test  vdelta-test.lo ../../../subversion/libsvn_delta/libsvn_delta-1.la ../../../subversion/libsvn_subr/libsvn_subr-1.la -L<http://hudson.zones.apache.org/hudson/job/subversion-trunk-ubuntu/ws/subversion-trunk/apr-util> -laprutil-1 -L<http://hudson.zones.apache.org/hudson/job/subversion-trunk-ubuntu/ws/subversion-trunk/apr> -lapr-1 
<http://hudson.zones.apache.org/hudson/job/subversion-trunk-ubuntu/ws/subversion-trunk/apr/libtool> --tag=CC --silent --mode=compile gcc -DLINUX=2 -D_REENTRANT -D_GNU_SOURCE  -Wold-style-definition -Wdeclaration-after-statement -Wpointer-arith -Wwrite-strings -Wshadow -ansi -Wall -Wformat=2 -Wunused -Waggregate-return -Wstrict-prototypes -Wmissing-prototypes -Wmissing-declarations -Wno-multichar -Wredundant-decls -Wnested-externs -Wunreachable-code -Winline -Wno-long-long -g -g -Wall -Wmissing-prototypes -Wstrict-prototypes -Wmissing-declarations -pthread -Werror=implicit-function-declaration  -DSVN_DEBUG -DAP_DEBUG  -I./subversion/include -I./subversion -I<http://hudson.zones.apache.org/hudson/job/subversion-trunk-ubuntu/ws/subversion-trunk/apr/include>   -I<http://hudson.zones.apache.org/hudson/job/subversion-trunk-ubuntu/ws/subversion-trunk/apr-util/include> -I<http://hudson.zones.apache.org/hudson/job/subversion-trunk-ubuntu/ws/subversion-trunk/sqlite-amalgamation>  -static  -o subversion/tests/libsvn_delta/window-test.lo -c subversion/tests/libsvn_delta/window-test.c
cd subversion/tests/libsvn_delta && <http://hudson.zones.apache.org/hudson/job/subversion-trunk-ubuntu/ws/subversion-trunk/apr/libtool> --tag=CC --silent --mode=link gcc -static  -Wold-style-definition -Wdeclaration-after-statement -Wpointer-arith -Wwrite-strings -Wshadow -ansi -Wall -Wformat=2 -Wunused -Waggregate-return -Wstrict-prototypes -Wmissing-prototypes -Wmissing-declarations -Wno-multichar -Wredundant-decls -Wnested-externs -Wunreachable-code -Winline -Wno-long-long -g -g -Wall -Wmissing-prototypes -Wstrict-prototypes -Wmissing-declarations -pthread -Werror=implicit-function-declaration  -DSVN_DEBUG -DAP_DEBUG   -rpath /usr/local/lib  -o window-test  window-test.lo ../../../subversion/tests/libsvn_test-1.la ../../../subversion/libsvn_delta/libsvn_delta-1.la ../../../subversion/libsvn_subr/libsvn_subr-1.la -L<http://hudson.zones.apache.org/hudson/job/subversion-trunk-ubuntu/ws/subversion-trunk/apr-util> -laprutil-1 -L<http://hudson.zones.apache.org/hudson/job/subversion-trunk-ubuntu/ws/subversion-trunk/apr> -lapr-1 
/usr/bin/msgfmt -c -o subversion/po/de.mo subversion/po/de.po
/usr/bin/msgfmt -c -o subversion/po/es.mo subversion/po/es.po
/usr/bin/msgfmt -c -o subversion/po/fr.mo subversion/po/fr.po
/usr/bin/msgfmt -c -o subversion/po/it.mo subversion/po/it.po
/usr/bin/msgfmt -c -o subversion/po/ja.mo subversion/po/ja.po
/usr/bin/msgfmt -c -o subversion/po/ko.mo subversion/po/ko.po
/usr/bin/msgfmt -c -o subversion/po/nb.mo subversion/po/nb.po
/usr/bin/msgfmt -c -o subversion/po/pl.mo subversion/po/pl.po
/usr/bin/msgfmt -c -o subversion/po/pt_BR.mo subversion/po/pt_BR.po
/usr/bin/msgfmt -c -o subversion/po/sv.mo subversion/po/sv.po
/usr/bin/msgfmt -c -o subversion/po/zh_CN.mo subversion/po/zh_CN.po
/usr/bin/msgfmt -c -o subversion/po/zh_TW.mo subversion/po/zh_TW.po
Running all tests in auth-test [1/74]...................success
Running all tests in cache-test [2/74]..................success
Running all tests in checksum-test [3/74]...............success
Running all tests in client-test [4/74].................success
Running all tests in compat-test [5/74].................success
Running all tests in config-test [6/74].................success
Running all tests in db-test [7/74].....................success
Running all tests in diff-diff3-test [8/74].............success
Running all tests in dirent_uri-test [9/74].............success
Running all tests in eol-test [10/74]...................success
Running all tests in error-test [11/74].................success
Running all tests in fs-pack-test [12/74]...............success
Running all tests in fs-test [13/74]....................success
Running all tests in hashdump-test [14/74]..............success
Running all tests in locks-test [15/74].................success
Running all tests in mergeinfo-test [16/74].............success
Running all tests in opt-test [17/74]...................success
Running all tests in parse-diff-test [18/74]............success
Running all tests in path-test [19/74]..................success
Running all tests in ra-local-test [20/74]..............success
Running all tests in random-test [21/74]................success
Running all tests in repos-test [22/74].................success
Running all tests in revision-test [23/74]..............success
Running all tests in skel-test [24/74]..................success
Running all tests in stream-test [25/74]................success
Running all tests in string-test [26/74]................success
Running all tests in target-test [27/74]................success
Running all tests in time-test [28/74]..................success
Running all tests in translate-test [29/74].............success
Running all tests in tree-conflict-data-test [30/74]....success
Running all tests in utf-test [31/74]...................success
Running all tests in window-test [32/74]................success
Running all tests in authz_tests.py [33/74].............success
Running all tests in autoprop_tests.py [34/74]..........success
Running all tests in basic_tests.py [35/74].............success
Running all tests in blame_tests.py [36/74].............success
Running all tests in cat_tests.py [37/74]...............success
Running all tests in changelist_tests.py [38/74]........success
Running all tests in checkout_tests.py [39/74]..........success
Running all tests in commit_tests.py [40/74]............success
Running all tests in copy_tests.py [41/74]..............success
Running all tests in depth_tests.py [42/74].............success
Running all tests in diff_tests.py [43/74]..............success
Running all tests in entries_tests.py [44/74]...........success
Running all tests in export_tests.py [45/74]............success
Running all tests in externals_tests.py [46/74].........success
Running all tests in getopt_tests.py [47/74]............success
Running all tests in history_tests.py [48/74]...........success
Running all tests in import_tests.py [49/74]............success
Running all tests in info_tests.py [50/74]..............success
Running all tests in lock_tests.py [51/74]..............success
Running all tests in log_tests.py [52/74]...............success
Running all tests in merge_authz_tests.py [53/74].......success
Running all tests in merge_tests.py [54/74].............success
Running all tests in mergeinfo_tests.py [55/74].........success
Running all tests in obliterate_tests.py [56/74]........FAILURE
Running all tests in patch_tests.py [57/74].............success
Running all tests in prop_tests.py [58/74]..............success
Running all tests in resolved_tests.py [59/74]..........success
Running all tests in revert_tests.py [60/74]............success
Running all tests in schedule_tests.py [61/74]..........success
Running all tests in special_tests.py [62/74]...........success
Running all tests in stat_tests.py [63/74]..............success
Running all tests in svnadmin_tests.py [64/74]..........success
Running all tests in svndumpfilter_tests.py [65/74].....success
Running all tests in svnlook_tests.py [66/74]...........success
Running all tests in svnsync_tests.py [67/74]...........success
Running all tests in svnversion_tests.py [68/74]........success
Running all tests in switch_tests.py [69/74]............success
Running all tests in trans_tests.py [70/74].............success
Running all tests in tree_conflict_tests.py [71/74].....success
Running all tests in update_tests.py [72/74]............success
Running all tests in upgrade_tests.py [73/74]...........success
Running all tests in utf8_tests.py [74/74]..............success
At least one test was SKIPPED, checking <http://hudson.zones.apache.org/hudson/job/subversion-trunk-ubuntu/ws/subversion-trunk/tests.log>
SKIP:  cache-test 2: basic memcache svn_cache test
SKIP:  cache-test 3: memcache svn_cache with very long keys
SKIP:  authz_tests.py 1: authz issue #2486 - open root
SKIP:  authz_tests.py 2: authz issue #2486 - open directory
SKIP:  authz_tests.py 3: broken authz files cause errors
SKIP:  authz_tests.py 4: test authz for read operations
SKIP:  authz_tests.py 5: test authz for write operations
SKIP:  authz_tests.py 6: test authz for checkout
SKIP:  authz_tests.py 7: test authz for log and tracing path changes
SKIP:  authz_tests.py 8: test authz for checkout and update
SKIP:  authz_tests.py 9: test authz for export with unreadable subfolder
SKIP:  authz_tests.py 10: test authz for aliases
SKIP:  authz_tests.py 11: test the authz validation rules
SKIP:  authz_tests.py 12: test authz for locking
SKIP:  authz_tests.py 13: authz issue #2712
SKIP:  authz_tests.py 14: switched to directory, no read access on parents
SKIP:  authz_tests.py 15: authz issue #3242 - access required at repo root
SKIP:  copy_tests.py 24: wc to wc copy with deleted=true items
SKIP:  merge_authz_tests.py 1: skipped paths get overriding mergeinfo
SKIP:  svnlook_tests.py 2: delete file in moved dir
SKIP:  svnsync_tests.py 14: verify that unreadable content is not synced
SKIP:  svnsync_tests.py 15: verify that copies from unreadable dirs work
SKIP:  svnsync_tests.py 16: verify copies with mods from unreadable dirs
SKIP:  svnsync_tests.py 17: verify copies with mods from unreadable dirs +copy
SKIP:  update_tests.py 32: update wc on the root of a Windows (virtual) drive
SKIP:  utf8_tests.py 1: conversion of paths and logs to/from utf8
At least one test XFAILED, checking <http://hudson.zones.apache.org/hudson/job/subversion-trunk-ubuntu/ws/subversion-trunk/tests.log>
XFAIL: fs-test 18: merging commit
       [[needs to be written to match new merge() algorithm expectations]]
XFAIL: fs-test 36: obliterate 1
       [[obliterate is in development]]
XFAIL: locks-test 9: able to reserve a name (lock non-existent path)
XFAIL: locks-test 10: directory locks (kinda)
XFAIL: tree-conflict-data-test 3: detect broken tree conflict data
XFAIL: basic_tests.py 7: basic mkdir, including parent directories
       [[currently, WC locks are being left behind]]
XFAIL: basic_tests.py 39: remotely remove directories from two repositories
XFAIL: changelist_tests.py 12: 'svn mv' of existing keeps the changelist
XFAIL: changelist_tests.py 13: 'svn mv' of added keeps the changelist
XFAIL: commit_tests.py 25: commit from two nested working copies
XFAIL: commit_tests.py 26: commit from two working copies
XFAIL: copy_tests.py 79: move a dir below a moved dir
XFAIL: depth_tests.py 32: make sure update handle svn_depth_exclude properly
XFAIL: depth_tests.py 36: 'info' should treat excluded item as versioned
XFAIL: diff_tests.py 28: diff a renamed directory
XFAIL: diff_tests.py 49: diff URL against working copy with local mods
XFAIL: diff_tests.py 50: diff -r1 of removed file to its local addition
XFAIL: externals_tests.py 19: delete a file external
XFAIL: externals_tests.py 20: switch a relative external
XFAIL: log_tests.py 21: test log -c on range of changes
XFAIL: merge_tests.py 33: merge a replacement of a directory
XFAIL: merge_tests.py 55: avoid repeated merges for cyclic merging
XFAIL: merge_tests.py 71: merge target with non inheritable mergeinfo
XFAIL: merge_tests.py 90: merge added subtree
XFAIL: merge_tests.py 114: tree conflicts 5.1: leaf edit, tree del
XFAIL: merge_tests.py 115: tree conflicts 5.2: leaf del, tree del
XFAIL: merge_tests.py 119: tree conflicts 5.1: leaf edit (no ci), tree del
XFAIL: merge_tests.py 120: tree conflicts 5.2: leaf del (no ci), tree del
XFAIL: merge_tests.py 124: merge prior to rename src existence still dels src
XFAIL: merge_tests.py 135: replace vs. delete tree-conflicts
XFAIL: merge_tests.py 137: automatic conflict resolutions work with merge
XFAIL: mergeinfo_tests.py 4: 'mergeinfo' with uninteresting source selection
XFAIL: revert_tests.py 4: revert a moved file
XFAIL: revert_tests.py 17: status after replace+, revert, and local rm
       [[revert behavior needs better definition]]
XFAIL: switch_tests.py 10: switch a file to a dir and back to the file
XFAIL: switch_tests.py 38: copy directory with switched subdir
XFAIL: tree_conflict_tests.py 14: merge dir: del/rpl/mv onto not-same
XFAIL: tree_conflict_tests.py 18: --force del on dir with TCs inside
XFAIL: tree_conflict_tests.py 19: --keep-local del on tree-conflicted targets
XFAIL: tree_conflict_tests.py 20: --force del on tree-conflicted targets
XFAIL: tree_conflict_tests.py 21: query an unversioned tree-conflicted dir
XFAIL: update_tests.py 50: tree conflicts 2.3: skip on 2nd update
XFAIL: update_tests.py 57: verify update of deleted locked files
XFAIL: upgrade_tests.py 3: test updating a 1.5-era working copy
At least one test FAILED, checking <http://hudson.zones.apache.org/hudson/job/subversion-trunk-ubuntu/ws/subversion-trunk/tests.log>
FAIL:  obliterate_tests.py 1: test svn obliterate
Summary of test results:
  1155 tests PASSED
  26 tests SKIPPED
  44 tests XFAILED (4 WORK-IN-PROGRESS)
  1 test FAILED
make: *** [check] Error 1
Generating junit files ...
Recording test results


Mime
View raw message