streams-commits mailing list archives

Site index · List index
Message view « Date » · « Thread »
Top « Date » · « Thread »
From Apache Jenkins Server <jenk...@builds.apache.org>
Subject Build failed in Jenkins: streams-examples #229
Date Fri, 27 Oct 2017 21:39:17 GMT
See <https://builds.apache.org/job/streams-examples/229/display/redirect>

------------------------------------------
[...truncated 79.24 KB...]
warning file=<https://builds.apache.org/job/streams-examples/ws/flink/flink-twitter-collection/src/main/scala/org/apache/streams/examples/flink/twitter/collection/FlinkTwitterPostsPipeline.scala>
message=File line length exceeds 160 characters line=112
warning file=<https://builds.apache.org/job/streams-examples/ws/flink/flink-twitter-collection/src/main/scala/org/apache/streams/examples/flink/twitter/collection/FlinkTwitterPostsPipeline.scala>
message=Magic Number line=127 column=74
warning file=<https://builds.apache.org/job/streams-examples/ws/flink/flink-twitter-collection/src/main/scala/org/apache/streams/examples/flink/twitter/collection/FlinkTwitterPostsPipeline.scala>
message=Magic Number line=129 column=86
warning file=<https://builds.apache.org/job/streams-examples/ws/flink/flink-twitter-collection/src/main/scala/org/apache/streams/examples/flink/twitter/collection/FlinkTwitterPostsPipeline.scala>
message=Magic Number line=133 column=73
warning file=<https://builds.apache.org/job/streams-examples/ws/flink/flink-twitter-collection/src/main/scala/org/apache/streams/examples/flink/twitter/collection/FlinkTwitterPostsPipeline.scala>
message=Avoid using return line=75 column=6
warning file=<https://builds.apache.org/job/streams-examples/ws/flink/flink-twitter-collection/src/main/scala/org/apache/streams/examples/flink/twitter/collection/FlinkTwitterPostsPipeline.scala>
message=Avoid using return line=81 column=6
warning file=<https://builds.apache.org/job/streams-examples/ws/flink/flink-twitter-collection/src/main/scala/org/apache/streams/examples/flink/twitter/collection/FlinkTwitterPostsPipeline.scala>
message=Avoid using return line=87 column=6
warning file=<https://builds.apache.org/job/streams-examples/ws/flink/flink-twitter-collection/src/main/scala/org/apache/streams/examples/flink/twitter/collection/FlinkTwitterPostsPipeline.scala>
message=Avoid using return line=93 column=6
warning file=<https://builds.apache.org/job/streams-examples/ws/flink/flink-twitter-collection/src/main/scala/org/apache/streams/examples/flink/twitter/collection/FlinkTwitterPostsPipeline.scala>
message=Avoid using null line=72 column=21
warning file=<https://builds.apache.org/job/streams-examples/ws/flink/flink-twitter-collection/src/main/scala/org/apache/streams/examples/flink/twitter/collection/FlinkTwitterPostsPipeline.scala>
message=Avoid using null line=78 column=31
warning file=<https://builds.apache.org/job/streams-examples/ws/flink/flink-twitter-collection/src/main/scala/org/apache/streams/examples/flink/twitter/collection/FlinkTwitterPostsPipeline.scala>
message=Avoid using null line=84 column=36
warning file=<https://builds.apache.org/job/streams-examples/ws/flink/flink-twitter-collection/src/main/scala/org/apache/streams/examples/flink/twitter/collection/FlinkTwitterPostsPipeline.scala>
message=Avoid using null line=90 column=32
warning file=<https://builds.apache.org/job/streams-examples/ws/flink/flink-twitter-collection/src/main/scala/org/apache/streams/examples/flink/twitter/collection/FlinkTwitterPostsPipeline.scala>
message=Avoid using null line=166 column=45
warning file=<https://builds.apache.org/job/streams-examples/ws/flink/flink-twitter-collection/src/main/scala/org/apache/streams/examples/flink/twitter/collection/FlinkTwitterPostsPipeline.scala>
message=Regular expression matched 'println' line=74 column=17
warning file=<https://builds.apache.org/job/streams-examples/ws/flink/flink-twitter-collection/src/main/scala/org/apache/streams/examples/flink/twitter/collection/FlinkTwitterPostsPipeline.scala>
message=Regular expression matched 'println' line=80 column=17
warning file=<https://builds.apache.org/job/streams-examples/ws/flink/flink-twitter-collection/src/main/scala/org/apache/streams/examples/flink/twitter/collection/FlinkTwitterPostsPipeline.scala>
message=Regular expression matched 'println' line=86 column=17
warning file=<https://builds.apache.org/job/streams-examples/ws/flink/flink-twitter-collection/src/main/scala/org/apache/streams/examples/flink/twitter/collection/FlinkTwitterPostsPipeline.scala>
message=Regular expression matched 'println' line=92 column=17
warning file=<https://builds.apache.org/job/streams-examples/ws/flink/flink-twitter-collection/src/main/scala/org/apache/streams/examples/flink/twitter/collection/FlinkTwitterPostsPipeline.scala>
message=Boolean expression can be simplified line=144 column=8
warning file=<https://builds.apache.org/job/streams-examples/ws/flink/flink-twitter-collection/src/main/scala/org/apache/streams/examples/flink/twitter/collection/FlinkTwitterPostsPipeline.scala>
message=If block needs braces line=144 column=4
warning file=<https://builds.apache.org/job/streams-examples/ws/flink/flink-twitter-collection/src/main/scala/org/apache/streams/examples/flink/twitter/collection/FlinkTwitterPostsPipeline.scala>
message=Public method must have explicit type line=58 column=15
warning file=<https://builds.apache.org/job/streams-examples/ws/flink/flink-twitter-collection/src/main/scala/org/apache/streams/examples/flink/twitter/collection/FlinkTwitterPostsPipeline.scala>
message=Public method must have explicit type line=159 column=8
warning file=<https://builds.apache.org/job/streams-examples/ws/flink/flink-twitter-collection/src/main/scala/org/apache/streams/examples/flink/twitter/collection/FlinkTwitterPostsPipeline.scala>
message=Field name does not match the regular expression '^[a-z][A-Za-z]*$' line=53 column=6
warning file=<https://builds.apache.org/job/streams-examples/ws/flink/flink-twitter-collection/src/main/scala/org/apache/streams/examples/flink/twitter/collection/FlinkTwitterPostsPipeline.scala>
message=Field name does not match the regular expression '^[a-z][A-Za-z]*$' line=55 column=14
warning file=<https://builds.apache.org/job/streams-examples/ws/flink/flink-twitter-collection/src/main/scala/org/apache/streams/examples/flink/twitter/collection/FlinkTwitterPostsPipeline.scala>
message=Field name does not match the regular expression '^[a-z][A-Za-z]*$' line=56 column=14
warning file=<https://builds.apache.org/job/streams-examples/ws/flink/flink-twitter-collection/src/main/scala/org/apache/streams/examples/flink/twitter/collection/FlinkTwitterPostsPipeline.scala>
message=Field name does not match the regular expression '^[a-z][A-Za-z]*$' line=129 column=8
warning file=<https://builds.apache.org/job/streams-examples/ws/flink/flink-twitter-collection/src/main/scala/org/apache/streams/examples/flink/twitter/collection/FlinkTwitterPostsPipeline.scala>
message=Field name does not match the regular expression '^[a-z][A-Za-z]*$' line=140 column=12
warning file=<https://builds.apache.org/job/streams-examples/ws/flink/flink-twitter-collection/src/main/scala/org/apache/streams/examples/flink/twitter/collection/FlinkTwitterFollowingPipeline.scala>
message=Header does not match expected text line=1
warning file=<https://builds.apache.org/job/streams-examples/ws/flink/flink-twitter-collection/src/main/scala/org/apache/streams/examples/flink/twitter/collection/FlinkTwitterFollowingPipeline.scala>
message=File line length exceeds 160 characters line=61
warning file=<https://builds.apache.org/job/streams-examples/ws/flink/flink-twitter-collection/src/main/scala/org/apache/streams/examples/flink/twitter/collection/FlinkTwitterFollowingPipeline.scala>
message=File line length exceeds 160 characters line=113
warning file=<https://builds.apache.org/job/streams-examples/ws/flink/flink-twitter-collection/src/main/scala/org/apache/streams/examples/flink/twitter/collection/FlinkTwitterFollowingPipeline.scala>
message=File line length exceeds 160 characters line=155
warning file=<https://builds.apache.org/job/streams-examples/ws/flink/flink-twitter-collection/src/main/scala/org/apache/streams/examples/flink/twitter/collection/FlinkTwitterFollowingPipeline.scala>
message=File line length exceeds 160 characters line=156
warning file=<https://builds.apache.org/job/streams-examples/ws/flink/flink-twitter-collection/src/main/scala/org/apache/streams/examples/flink/twitter/collection/FlinkTwitterFollowingPipeline.scala>
message=Magic Number line=128 column=86
warning file=<https://builds.apache.org/job/streams-examples/ws/flink/flink-twitter-collection/src/main/scala/org/apache/streams/examples/flink/twitter/collection/FlinkTwitterFollowingPipeline.scala>
message=Magic Number line=132 column=97
warning file=<https://builds.apache.org/job/streams-examples/ws/flink/flink-twitter-collection/src/main/scala/org/apache/streams/examples/flink/twitter/collection/FlinkTwitterFollowingPipeline.scala>
message=Avoid using return line=76 column=6
warning file=<https://builds.apache.org/job/streams-examples/ws/flink/flink-twitter-collection/src/main/scala/org/apache/streams/examples/flink/twitter/collection/FlinkTwitterFollowingPipeline.scala>
message=Avoid using return line=82 column=6
warning file=<https://builds.apache.org/job/streams-examples/ws/flink/flink-twitter-collection/src/main/scala/org/apache/streams/examples/flink/twitter/collection/FlinkTwitterFollowingPipeline.scala>
message=Avoid using return line=88 column=6
warning file=<https://builds.apache.org/job/streams-examples/ws/flink/flink-twitter-collection/src/main/scala/org/apache/streams/examples/flink/twitter/collection/FlinkTwitterFollowingPipeline.scala>
message=Avoid using return line=94 column=6
warning file=<https://builds.apache.org/job/streams-examples/ws/flink/flink-twitter-collection/src/main/scala/org/apache/streams/examples/flink/twitter/collection/FlinkTwitterFollowingPipeline.scala>
message=Avoid using null line=73 column=21
warning file=<https://builds.apache.org/job/streams-examples/ws/flink/flink-twitter-collection/src/main/scala/org/apache/streams/examples/flink/twitter/collection/FlinkTwitterFollowingPipeline.scala>
message=Avoid using null line=79 column=31
warning file=<https://builds.apache.org/job/streams-examples/ws/flink/flink-twitter-collection/src/main/scala/org/apache/streams/examples/flink/twitter/collection/FlinkTwitterFollowingPipeline.scala>
message=Avoid using null line=85 column=36
warning file=<https://builds.apache.org/job/streams-examples/ws/flink/flink-twitter-collection/src/main/scala/org/apache/streams/examples/flink/twitter/collection/FlinkTwitterFollowingPipeline.scala>
message=Avoid using null line=91 column=32
warning file=<https://builds.apache.org/job/streams-examples/ws/flink/flink-twitter-collection/src/main/scala/org/apache/streams/examples/flink/twitter/collection/FlinkTwitterFollowingPipeline.scala>
message=Avoid using null line=170 column=45
warning file=<https://builds.apache.org/job/streams-examples/ws/flink/flink-twitter-collection/src/main/scala/org/apache/streams/examples/flink/twitter/collection/FlinkTwitterFollowingPipeline.scala>
message=Regular expression matched 'println' line=75 column=17
warning file=<https://builds.apache.org/job/streams-examples/ws/flink/flink-twitter-collection/src/main/scala/org/apache/streams/examples/flink/twitter/collection/FlinkTwitterFollowingPipeline.scala>
message=Regular expression matched 'println' line=81 column=17
warning file=<https://builds.apache.org/job/streams-examples/ws/flink/flink-twitter-collection/src/main/scala/org/apache/streams/examples/flink/twitter/collection/FlinkTwitterFollowingPipeline.scala>
message=Regular expression matched 'println' line=87 column=17
warning file=<https://builds.apache.org/job/streams-examples/ws/flink/flink-twitter-collection/src/main/scala/org/apache/streams/examples/flink/twitter/collection/FlinkTwitterFollowingPipeline.scala>
message=Regular expression matched 'println' line=93 column=17
warning file=<https://builds.apache.org/job/streams-examples/ws/flink/flink-twitter-collection/src/main/scala/org/apache/streams/examples/flink/twitter/collection/FlinkTwitterFollowingPipeline.scala>
message=Boolean expression can be simplified line=143 column=8
warning file=<https://builds.apache.org/job/streams-examples/ws/flink/flink-twitter-collection/src/main/scala/org/apache/streams/examples/flink/twitter/collection/FlinkTwitterFollowingPipeline.scala>
message=If block needs braces line=143 column=4
warning file=<https://builds.apache.org/job/streams-examples/ws/flink/flink-twitter-collection/src/main/scala/org/apache/streams/examples/flink/twitter/collection/FlinkTwitterFollowingPipeline.scala>
message=Public method must have explicit type line=59 column=15
warning file=<https://builds.apache.org/job/streams-examples/ws/flink/flink-twitter-collection/src/main/scala/org/apache/streams/examples/flink/twitter/collection/FlinkTwitterFollowingPipeline.scala>
message=Public method must have explicit type line=163 column=8
warning file=<https://builds.apache.org/job/streams-examples/ws/flink/flink-twitter-collection/src/main/scala/org/apache/streams/examples/flink/twitter/collection/FlinkTwitterFollowingPipeline.scala>
message=File must end with newline character
warning file=<https://builds.apache.org/job/streams-examples/ws/flink/flink-twitter-collection/src/main/scala/org/apache/streams/examples/flink/twitter/collection/FlinkTwitterFollowingPipeline.scala>
message=Field name does not match the regular expression '^[a-z][A-Za-z]*$' line=54 column=6
warning file=<https://builds.apache.org/job/streams-examples/ws/flink/flink-twitter-collection/src/main/scala/org/apache/streams/examples/flink/twitter/collection/FlinkTwitterFollowingPipeline.scala>
message=Field name does not match the regular expression '^[a-z][A-Za-z]*$' line=56 column=14
warning file=<https://builds.apache.org/job/streams-examples/ws/flink/flink-twitter-collection/src/main/scala/org/apache/streams/examples/flink/twitter/collection/FlinkTwitterFollowingPipeline.scala>
message=Field name does not match the regular expression '^[a-z][A-Za-z]*$' line=57 column=14
warning file=<https://builds.apache.org/job/streams-examples/ws/flink/flink-twitter-collection/src/main/scala/org/apache/streams/examples/flink/twitter/collection/FlinkTwitterFollowingPipeline.scala>
message=Field name does not match the regular expression '^[a-z][A-Za-z]*$' line=128 column=8
warning file=<https://builds.apache.org/job/streams-examples/ws/flink/flink-twitter-collection/src/main/scala/org/apache/streams/examples/flink/twitter/collection/FlinkTwitterFollowingPipeline.scala>
message=Field name does not match the regular expression '^[a-z][A-Za-z]*$' line=139 column=12
warning file=<https://builds.apache.org/job/streams-examples/ws/flink/flink-twitter-collection/src/main/scala/org/apache/streams/examples/flink/twitter/collection/FlinkTwitterSpritzerPipeline.scala>
message=Header does not match expected text line=1
warning file=<https://builds.apache.org/job/streams-examples/ws/flink/flink-twitter-collection/src/main/scala/org/apache/streams/examples/flink/twitter/collection/FlinkTwitterSpritzerPipeline.scala>
message=File line length exceeds 160 characters line=109
warning file=<https://builds.apache.org/job/streams-examples/ws/flink/flink-twitter-collection/src/main/scala/org/apache/streams/examples/flink/twitter/collection/FlinkTwitterSpritzerPipeline.scala>
message=Avoid using return line=78 column=6
warning file=<https://builds.apache.org/job/streams-examples/ws/flink/flink-twitter-collection/src/main/scala/org/apache/streams/examples/flink/twitter/collection/FlinkTwitterSpritzerPipeline.scala>
message=Avoid using return line=84 column=6
warning file=<https://builds.apache.org/job/streams-examples/ws/flink/flink-twitter-collection/src/main/scala/org/apache/streams/examples/flink/twitter/collection/FlinkTwitterSpritzerPipeline.scala>
message=Avoid using return line=90 column=6
warning file=<https://builds.apache.org/job/streams-examples/ws/flink/flink-twitter-collection/src/main/scala/org/apache/streams/examples/flink/twitter/collection/FlinkTwitterSpritzerPipeline.scala>
message=Avoid using null line=75 column=21
warning file=<https://builds.apache.org/job/streams-examples/ws/flink/flink-twitter-collection/src/main/scala/org/apache/streams/examples/flink/twitter/collection/FlinkTwitterSpritzerPipeline.scala>
message=Avoid using null line=81 column=36
warning file=<https://builds.apache.org/job/streams-examples/ws/flink/flink-twitter-collection/src/main/scala/org/apache/streams/examples/flink/twitter/collection/FlinkTwitterSpritzerPipeline.scala>
message=Avoid using null line=87 column=32
warning file=<https://builds.apache.org/job/streams-examples/ws/flink/flink-twitter-collection/src/main/scala/org/apache/streams/examples/flink/twitter/collection/FlinkTwitterSpritzerPipeline.scala>
message=Avoid using null line=157 column=45
warning file=<https://builds.apache.org/job/streams-examples/ws/flink/flink-twitter-collection/src/main/scala/org/apache/streams/examples/flink/twitter/collection/FlinkTwitterSpritzerPipeline.scala>
message=Regular expression matched 'println' line=77 column=17
warning file=<https://builds.apache.org/job/streams-examples/ws/flink/flink-twitter-collection/src/main/scala/org/apache/streams/examples/flink/twitter/collection/FlinkTwitterSpritzerPipeline.scala>
message=Regular expression matched 'println' line=83 column=17
warning file=<https://builds.apache.org/job/streams-examples/ws/flink/flink-twitter-collection/src/main/scala/org/apache/streams/examples/flink/twitter/collection/FlinkTwitterSpritzerPipeline.scala>
message=Regular expression matched 'println' line=89 column=17
warning file=<https://builds.apache.org/job/streams-examples/ws/flink/flink-twitter-collection/src/main/scala/org/apache/streams/examples/flink/twitter/collection/FlinkTwitterSpritzerPipeline.scala>
message=Boolean expression can be simplified line=126 column=8
warning file=<https://builds.apache.org/job/streams-examples/ws/flink/flink-twitter-collection/src/main/scala/org/apache/streams/examples/flink/twitter/collection/FlinkTwitterSpritzerPipeline.scala>
message=If block needs braces line=126 column=4
warning file=<https://builds.apache.org/job/streams-examples/ws/flink/flink-twitter-collection/src/main/scala/org/apache/streams/examples/flink/twitter/collection/FlinkTwitterSpritzerPipeline.scala>
message=Public method must have explicit type line=61 column=15
warning file=<https://builds.apache.org/job/streams-examples/ws/flink/flink-twitter-collection/src/main/scala/org/apache/streams/examples/flink/twitter/collection/FlinkTwitterSpritzerPipeline.scala>
message=Field name does not match the regular expression '^[a-z][A-Za-z]*$' line=56 column=6
warning file=<https://builds.apache.org/job/streams-examples/ws/flink/flink-twitter-collection/src/main/scala/org/apache/streams/examples/flink/twitter/collection/FlinkTwitterSpritzerPipeline.scala>
message=Field name does not match the regular expression '^[a-z][A-Za-z]*$' line=58 column=14
warning file=<https://builds.apache.org/job/streams-examples/ws/flink/flink-twitter-collection/src/main/scala/org/apache/streams/examples/flink/twitter/collection/FlinkTwitterSpritzerPipeline.scala>
message=Field name does not match the regular expression '^[a-z][A-Za-z]*$' line=59 column=14
warning file=<https://builds.apache.org/job/streams-examples/ws/flink/flink-twitter-collection/src/main/scala/org/apache/streams/examples/flink/FlinkBase.scala>
message=Header does not match expected text line=1
warning file=<https://builds.apache.org/job/streams-examples/ws/flink/flink-twitter-collection/src/main/scala/org/apache/streams/examples/flink/FlinkBase.scala>
message=There should be a space after the plus (+) sign line=217 column=44
warning file=<https://builds.apache.org/job/streams-examples/ws/flink/flink-twitter-collection/src/main/scala/org/apache/streams/examples/flink/FlinkBase.scala>
message=There should be a space before the plus (+) sign line=217 column=44
warning file=<https://builds.apache.org/job/streams-examples/ws/flink/flink-twitter-collection/src/main/scala/org/apache/streams/examples/flink/FlinkBase.scala>
message=File line length exceeds 160 characters line=187
warning file=<https://builds.apache.org/job/streams-examples/ws/flink/flink-twitter-collection/src/main/scala/org/apache/streams/examples/flink/FlinkBase.scala>
message=File line length exceeds 160 characters line=203
warning file=<https://builds.apache.org/job/streams-examples/ws/flink/flink-twitter-collection/src/main/scala/org/apache/streams/examples/flink/FlinkBase.scala>
message=Avoid using return line=73 column=10
warning file=<https://builds.apache.org/job/streams-examples/ws/flink/flink-twitter-collection/src/main/scala/org/apache/streams/examples/flink/FlinkBase.scala>
message=Avoid using return line=77 column=10
warning file=<https://builds.apache.org/job/streams-examples/ws/flink/flink-twitter-collection/src/main/scala/org/apache/streams/examples/flink/FlinkBase.scala>
message=Avoid using return line=124 column=43
warning file=<https://builds.apache.org/job/streams-examples/ws/flink/flink-twitter-collection/src/main/scala/org/apache/streams/examples/flink/FlinkBase.scala>
message=Avoid using return line=139 column=43
warning file=<https://builds.apache.org/job/streams-examples/ws/flink/flink-twitter-collection/src/main/scala/org/apache/streams/examples/flink/FlinkBase.scala>
message=Avoid using return line=215 column=6
warning file=<https://builds.apache.org/job/streams-examples/ws/flink/flink-twitter-collection/src/main/scala/org/apache/streams/examples/flink/FlinkBase.scala>
message=Avoid using null line=124 column=37
warning file=<https://builds.apache.org/job/streams-examples/ws/flink/flink-twitter-collection/src/main/scala/org/apache/streams/examples/flink/FlinkBase.scala>
message=Avoid using null line=126 column=38
warning file=<https://builds.apache.org/job/streams-examples/ws/flink/flink-twitter-collection/src/main/scala/org/apache/streams/examples/flink/FlinkBase.scala>
message=Avoid using null line=139 column=37
warning file=<https://builds.apache.org/job/streams-examples/ws/flink/flink-twitter-collection/src/main/scala/org/apache/streams/examples/flink/FlinkBase.scala>
message=Avoid using null line=141 column=32
warning file=<https://builds.apache.org/job/streams-examples/ws/flink/flink-twitter-collection/src/main/scala/org/apache/streams/examples/flink/FlinkBase.scala>
message=If block needs braces line=126 column=4
warning file=<https://builds.apache.org/job/streams-examples/ws/flink/flink-twitter-collection/src/main/scala/org/apache/streams/examples/flink/FlinkBase.scala>
message=If block needs braces line=141 column=4
warning file=<https://builds.apache.org/job/streams-examples/ws/flink/flink-twitter-collection/src/main/scala/org/apache/streams/examples/flink/FlinkBase.scala>
message=If block needs braces line=159 column=4
warning file=<https://builds.apache.org/job/streams-examples/ws/flink/flink-twitter-collection/src/main/scala/org/apache/streams/examples/flink/FlinkBase.scala>
message=If block needs braces line=214 column=4
warning file=<https://builds.apache.org/job/streams-examples/ws/flink/flink-twitter-collection/src/main/scala/org/apache/streams/examples/flink/FlinkBase.scala>
message=If block needs braces line=216 column=4
warning file=<https://builds.apache.org/job/streams-examples/ws/flink/flink-twitter-collection/src/main/scala/org/apache/streams/examples/flink/FlinkBase.scala>
message=File must end with newline character
warning file=<https://builds.apache.org/job/streams-examples/ws/flink/flink-twitter-collection/src/main/scala/org/apache/streams/examples/flink/FlinkBase.scala>
message=Field name does not match the regular expression '^[a-z][A-Za-z]*$' line=40 column=14
warning file=<https://builds.apache.org/job/streams-examples/ws/flink/flink-twitter-collection/src/main/scala/org/apache/streams/examples/flink/FlinkBase.scala>
message=Field name does not match the regular expression '^[a-z][A-Za-z]*$' line=41 column=14
warning file=<https://builds.apache.org/job/streams-examples/ws/flink/flink-twitter-collection/src/test/scala/org/apache/streams/examples/flink/twitter/test/FlinkTwitterPostsPipelineIT.scala>
message=Header does not match expected text line=1
warning file=<https://builds.apache.org/job/streams-examples/ws/flink/flink-twitter-collection/src/test/scala/org/apache/streams/examples/flink/twitter/test/FlinkTwitterPostsPipelineIT.scala>
message=Public method must have explicit type line=46 column=6
warning file=<https://builds.apache.org/job/streams-examples/ws/flink/flink-twitter-collection/src/test/scala/org/apache/streams/examples/flink/twitter/test/FlinkTwitterPostsPipelineIT.scala>
message=Field name does not match the regular expression '^[a-z][A-Za-z]*$' line=41 column=14
warning file=<https://builds.apache.org/job/streams-examples/ws/flink/flink-twitter-collection/src/test/scala/org/apache/streams/examples/flink/twitter/test/FlinkTwitterPostsPipelineIT.scala>
message=Field name does not match the regular expression '^[a-z][A-Za-z]*$' line=49 column=8
warning file=<https://builds.apache.org/job/streams-examples/ws/flink/flink-twitter-collection/src/test/scala/org/apache/streams/examples/flink/twitter/test/FlinkTwitterUserInformationPipelineIT.scala>
message=Header does not match expected text line=1
warning file=<https://builds.apache.org/job/streams-examples/ws/flink/flink-twitter-collection/src/test/scala/org/apache/streams/examples/flink/twitter/test/FlinkTwitterUserInformationPipelineIT.scala>
message=Public method must have explicit type line=46 column=6
warning file=<https://builds.apache.org/job/streams-examples/ws/flink/flink-twitter-collection/src/test/scala/org/apache/streams/examples/flink/twitter/test/FlinkTwitterUserInformationPipelineIT.scala>
message=Field name does not match the regular expression '^[a-z][A-Za-z]*$' line=41 column=14
warning file=<https://builds.apache.org/job/streams-examples/ws/flink/flink-twitter-collection/src/test/scala/org/apache/streams/examples/flink/twitter/test/FlinkTwitterUserInformationPipelineIT.scala>
message=Field name does not match the regular expression '^[a-z][A-Za-z]*$' line=49 column=8
warning file=<https://builds.apache.org/job/streams-examples/ws/flink/flink-twitter-collection/src/test/scala/org/apache/streams/examples/flink/twitter/test/FlinkTwitterSpritzerPipelineIT.scala>
message=Header does not match expected text line=1
warning file=<https://builds.apache.org/job/streams-examples/ws/flink/flink-twitter-collection/src/test/scala/org/apache/streams/examples/flink/twitter/test/FlinkTwitterSpritzerPipelineIT.scala>
message=Magic Number line=62 column=19
warning file=<https://builds.apache.org/job/streams-examples/ws/flink/flink-twitter-collection/src/test/scala/org/apache/streams/examples/flink/twitter/test/FlinkTwitterSpritzerPipelineIT.scala>
message=Public method must have explicit type line=46 column=6
warning file=<https://builds.apache.org/job/streams-examples/ws/flink/flink-twitter-collection/src/test/scala/org/apache/streams/examples/flink/twitter/test/FlinkTwitterSpritzerPipelineIT.scala>
message=Field name does not match the regular expression '^[a-z][A-Za-z]*$' line=41 column=14
warning file=<https://builds.apache.org/job/streams-examples/ws/flink/flink-twitter-collection/src/test/scala/org/apache/streams/examples/flink/twitter/test/FlinkTwitterSpritzerPipelineIT.scala>
message=Field name does not match the regular expression '^[a-z][A-Za-z]*$' line=49 column=8
warning file=<https://builds.apache.org/job/streams-examples/ws/flink/flink-twitter-collection/src/test/scala/org/apache/streams/examples/flink/twitter/test/FlinkTwitterFollowingPipelineFriendsIT.scala>
message=Header does not match expected text line=1
warning file=<https://builds.apache.org/job/streams-examples/ws/flink/flink-twitter-collection/src/test/scala/org/apache/streams/examples/flink/twitter/test/FlinkTwitterFollowingPipelineFriendsIT.scala>
message=Public method must have explicit type line=46 column=6
warning file=<https://builds.apache.org/job/streams-examples/ws/flink/flink-twitter-collection/src/test/scala/org/apache/streams/examples/flink/twitter/test/FlinkTwitterFollowingPipelineFriendsIT.scala>
message=Field name does not match the regular expression '^[a-z][A-Za-z]*$' line=41 column=14
warning file=<https://builds.apache.org/job/streams-examples/ws/flink/flink-twitter-collection/src/test/scala/org/apache/streams/examples/flink/twitter/test/FlinkTwitterFollowingPipelineFriendsIT.scala>
message=Field name does not match the regular expression '^[a-z][A-Za-z]*$' line=49 column=8
warning file=<https://builds.apache.org/job/streams-examples/ws/flink/flink-twitter-collection/src/test/scala/org/apache/streams/examples/flink/twitter/test/FlinkTwitterFollowingPipelineFollowersIT.scala>
message=Header does not match expected text line=1
warning file=<https://builds.apache.org/job/streams-examples/ws/flink/flink-twitter-collection/src/test/scala/org/apache/streams/examples/flink/twitter/test/FlinkTwitterFollowingPipelineFollowersIT.scala>
message=Public method must have explicit type line=46 column=6
warning file=<https://builds.apache.org/job/streams-examples/ws/flink/flink-twitter-collection/src/test/scala/org/apache/streams/examples/flink/twitter/test/FlinkTwitterFollowingPipelineFollowersIT.scala>
message=Field name does not match the regular expression '^[a-z][A-Za-z]*$' line=41 column=14
warning file=<https://builds.apache.org/job/streams-examples/ws/flink/flink-twitter-collection/src/test/scala/org/apache/streams/examples/flink/twitter/test/FlinkTwitterFollowingPipelineFollowersIT.scala>
message=Field name does not match the regular expression '^[a-z][A-Za-z]*$' line=49 column=8
Saving to outputFile=<https://builds.apache.org/job/streams-examples/ws/flink/flink-twitter-collection/target/scalastyle-output.xml>
Processed 10 file(s)
Found 0 errors
Found 147 warnings
Found 0 infos
Finished in 360 ms
[INFO] 
[INFO] --- apache-rat-plugin:0.12:check (default) @ streams-flink-twitter-collection ---
[INFO] Enabled default license matchers.
[INFO] Will parse SCM ignores for exclusions...
[INFO] Finished adding exclusions from SCM ignore files.
[INFO] 61 implicit excludes (use -debug for more details).
[INFO] Exclude: .git
[INFO] Exclude: .gitignore
[INFO] Exclude: .git/**
[INFO] Exclude: .idea/**
[INFO] Exclude: .java-version
[INFO] Exclude: *.conf
[INFO] Exclude: **/DEPENDENCIES
[INFO] Exclude: **/LICENSE
[INFO] Exclude: **/MANIFEST.MF
[INFO] Exclude: **/NOTICE
[INFO] Exclude: **/README.*
[INFO] Exclude: **/target/**
[INFO] Exclude: **/overlays/**
[INFO] Exclude: **/src/test/resources/**/*.csv
[INFO] Exclude: **/src/test/resources/**/*.tsv
[INFO] Exclude: **/src/site/resources/**/*
[INFO] Exclude: **/.gitignore
[INFO] Exclude: **/*.properties
[INFO] Exclude: **/*.iml
[INFO] Exclude: **/*.ini
[INFO] Exclude: **/*.jar
[INFO] Exclude: **/*.svg
[INFO] Exclude: dependency-reduced-pom.xml
[INFO] Exclude: rat.txt
[INFO] Exclude: apache-maven-*/**/*
[INFO] Exclude: src/test/resources/1000twitterids.txt
[INFO] Exclude: src/test/resources/asf.txt
[INFO] 33 resources included (use -debug for more details)
[INFO] Rat check: Summary over all files. Unapproved: 0, unknown: 0, generated: 0, approved:
33 licenses.
[INFO] 
[INFO] --- build-helper-maven-plugin:1.8:add-source (add-source) @ streams-flink-twitter-collection
---
[INFO] Source directory: <https://builds.apache.org/job/streams-examples/ws/flink/flink-twitter-collection/target/generated-sources/pojo>
added.
[WARNING] Failed to getClass for org.apache.streams.plugins.StreamsPojoSourceGeneratorMojo
[INFO] 
[INFO] <<< streams-plugin-pojo:0.5.1-SNAPSHOT:generate-sources (default) < generate-sources
@ streams-flink-twitter-collection <<<
[INFO] 
[INFO] --- streams-plugin-pojo:0.5.1-SNAPSHOT:generate-sources (default) @ streams-flink-twitter-collection
---
[INFO] 
[INFO] --- build-helper-maven-plugin:1.8:add-source (add-source) @ streams-flink-twitter-collection
---
[INFO] Source directory: <https://builds.apache.org/job/streams-examples/ws/flink/flink-twitter-collection/target/generated-sources/pojo>
added.
[INFO] 
[INFO] --- maven-remote-resources-plugin:1.4:process (default) @ streams-flink-twitter-collection
---
[INFO] 
[INFO] --- maven-remote-resources-plugin:1.4:process (process-resource-bundles) @ streams-flink-twitter-collection
---
[INFO] 
[INFO] --- maven-resources-plugin:2.7:resources (default-resources) @ streams-flink-twitter-collection
---
[INFO] Using 'UTF-8' encoding to copy filtered resources.
[INFO] Copying 8 resources
[INFO] Copying 4 resources
[INFO] Copying 4 resources
[INFO] 
[INFO] --- scala-maven-plugin:3.2.2:add-source (scala-compile-first) @ streams-flink-twitter-collection
---
[INFO] 
[INFO] --- scala-maven-plugin:3.2.2:compile (scala-compile-first) @ streams-flink-twitter-collection
---
[WARNING]  Expected all dependencies to require Scala version: 2.10.6
[WARNING]  org.apache.streams:streams-flink-twitter-collection:0.5.1-SNAPSHOT requires scala
version: 2.10.6
[WARNING]  org.scala-lang:scala-compiler:2.10.6 requires scala version: 2.10.6
[WARNING]  org.apache.streams:streams-flink-twitter-collection:0.5.1-SNAPSHOT requires scala
version: 2.10.6
[WARNING]  org.scala-lang:scala-reflect:2.10.6 requires scala version: 2.10.6
[WARNING]  org.scalatest:scalatest_2.10:2.2.5 requires scala version: 2.10.5
[WARNING] Multiple versions of scala libraries detected!
[INFO] <https://builds.apache.org/job/streams-examples/ws/flink/flink-twitter-collection/src/main/scala>:-1:
info: compiling
[INFO] <https://builds.apache.org/job/streams-examples/ws/flink/flink-twitter-collection/target/generated-sources/pojo>:-1:
info: compiling
[INFO] Compiling 12 source files to <https://builds.apache.org/job/streams-examples/ws/flink/flink-twitter-collection/target/classes>
at 1509140334267
[ERROR] <https://builds.apache.org/job/streams-examples/ws/flink/flink-twitter-collection/src/main/scala/org/apache/streams/examples/flink/FlinkBase.scala>:65:
error: value config is not a member of object org.apache.streams.config.StreamsConfigurator
[ERROR]     BASELOGGER.info("StreamsConfigurator.config: {}", StreamsConfigurator.config)
[ERROR]                                                                           ^
[ERROR] <https://builds.apache.org/job/streams-examples/ws/flink/flink-twitter-collection/src/main/scala/org/apache/streams/examples/flink/FlinkBase.scala>:69:
error: value config is not a member of object org.apache.streams.config.StreamsConfigurator
[ERROR]         typesafe = StreamsConfigurator.resolveConfig(configUrl).withFallback(StreamsConfigurator.config).resolve()
[ERROR]                                                                                  
               ^
[ERROR] two errors found
[INFO] ------------------------------------------------------------------------
[INFO] Reactor Summary:
[INFO] 
[INFO] apache-streams-examples ............................ SUCCESS [ 14.953 s]
[INFO] streams-examples-flink ............................. SUCCESS [  6.334 s]
[INFO] flink-twitter-collection ........................... FAILURE [ 20.938 s]
[INFO] streams-examples-local ............................. SKIPPED
[INFO] elasticsearch-hdfs ................................. SKIPPED
[INFO] elasticsearch-reindex .............................. SKIPPED
[INFO] mongo-elasticsearch-sync ........................... SKIPPED
[INFO] twitter-follow-neo4j ............................... SKIPPED
[INFO] twitter-history-elasticsearch ...................... SKIPPED
[INFO] twitter-userstream-elasticsearch ................... SKIPPED
[INFO] ------------------------------------------------------------------------
[INFO] BUILD FAILURE
[INFO] ------------------------------------------------------------------------
[INFO] Total time: 58.467 s
[INFO] Finished at: 2017-10-27T21:39:08+00:00
[INFO] Final Memory: 59M/816M
[INFO] ------------------------------------------------------------------------
[ERROR] Failed to execute goal net.alchim31.maven:scala-maven-plugin:3.2.2:compile (scala-compile-first)
on project streams-flink-twitter-collection: wrap: org.apache.commons.exec.ExecuteException:
Process exited with an error: 1 (Exit value: 1) -> [Help 1]
[ERROR] 
[ERROR] To see the full stack trace of the errors, re-run Maven with the -e switch.
[ERROR] Re-run Maven using the -X switch to enable full debug logging.
[ERROR] 
[ERROR] For more information about the errors and possible solutions, please read the following
articles:
[ERROR] [Help 1] http://cwiki.apache.org/confluence/display/MAVEN/MojoExecutionException
[ERROR] 
[ERROR] After correcting the problems, you can resume the build with the command
[ERROR]   mvn <goals> -rf :streams-flink-twitter-collection
[JENKINS] Archiving <https://builds.apache.org/job/streams-examples/ws/local/pom.xml>
to org.apache.streams/streams-examples-local/0.5.1-SNAPSHOT/streams-examples-local-0.5.1-SNAPSHOT.pom
[JENKINS] Archiving <https://builds.apache.org/job/streams-examples/ws/local/mongo-elasticsearch-sync/pom.xml>
to org.apache.streams/streams-mongo-elasticsearch-sync/0.5.1-SNAPSHOT/streams-mongo-elasticsearch-sync-0.5.1-SNAPSHOT.pom
[Fast Archiver] No prior successful build to compare, so performing full copy of artifacts
[JENKINS] Archiving <https://builds.apache.org/job/streams-examples/ws/local/elasticsearch-hdfs/pom.xml>
to org.apache.streams/streams-elasticsearch-hdfs/0.5.1-SNAPSHOT/streams-elasticsearch-hdfs-0.5.1-SNAPSHOT.pom
[Fast Archiver] No prior successful build to compare, so performing full copy of artifacts
[JENKINS] Archiving <https://builds.apache.org/job/streams-examples/ws/local/twitter-userstream-elasticsearch/pom.xml>
to org.apache.streams/twitter-userstream-elasticsearch/0.5.1-SNAPSHOT/twitter-userstream-elasticsearch-0.5.1-SNAPSHOT.pom
[JENKINS] Archiving <https://builds.apache.org/job/streams-examples/ws/flink/pom.xml>
to org.apache.streams/streams-examples-flink/0.5.1-SNAPSHOT/streams-examples-flink-0.5.1-SNAPSHOT.pom
[JENKINS] Archiving <https://builds.apache.org/job/streams-examples/ws/flink/target/streams-examples-flink-0.5.1-SNAPSHOT-site.xml>
to org.apache.streams/streams-examples-flink/0.5.1-SNAPSHOT/streams-examples-flink-0.5.1-SNAPSHOT-site.xml
[JENKINS] Archiving <https://builds.apache.org/job/streams-examples/ws/local/twitter-history-elasticsearch/pom.xml>
to org.apache.streams/streams-twitter-history-elasticsearch/0.5.1-SNAPSHOT/streams-twitter-history-elasticsearch-0.5.1-SNAPSHOT.pom
[Fast Archiver] No prior successful build to compare, so performing full copy of artifacts
[JENKINS] Archiving <https://builds.apache.org/job/streams-examples/ws/flink/flink-twitter-collection/pom.xml>
to org.apache.streams/streams-flink-twitter-collection/0.5.1-SNAPSHOT/streams-flink-twitter-collection-0.5.1-SNAPSHOT.pom
[Fast Archiver] No prior successful build to compare, so performing full copy of artifacts
[JENKINS] Archiving <https://builds.apache.org/job/streams-examples/ws/local/twitter-follow-neo4j/pom.xml>
to org.apache.streams/streams-twitter-follow-neo4j/0.5.1-SNAPSHOT/streams-twitter-follow-neo4j-0.5.1-SNAPSHOT.pom
[Fast Archiver] No prior successful build to compare, so performing full copy of artifacts
[JENKINS] Archiving <https://builds.apache.org/job/streams-examples/ws/local/elasticsearch-reindex/pom.xml>
to org.apache.streams/streams-elasticsearch-reindex/0.5.1-SNAPSHOT/streams-elasticsearch-reindex-0.5.1-SNAPSHOT.pom
[Fast Archiver] No prior successful build to compare, so performing full copy of artifacts
[JENKINS] Archiving <https://builds.apache.org/job/streams-examples/ws/pom.xml> to org.apache.streams/apache-streams-examples/0.5.1-SNAPSHOT/apache-streams-examples-0.5.1-SNAPSHOT.pom
[JENKINS] Archiving <https://builds.apache.org/job/streams-examples/ws/target/apache-streams-examples-0.5.1-SNAPSHOT-site.xml>
to org.apache.streams/apache-streams-examples/0.5.1-SNAPSHOT/apache-streams-examples-0.5.1-SNAPSHOT-site.xml
channel stopped


Mime
View raw message