streams-commits mailing list archives

Site index · List index
Message view « Date » · « Thread »
Top « Date » · « Thread »
From Apache Jenkins Server <jenk...@builds.apache.org>
Subject Build failed in Jenkins: streams-examples #228
Date Fri, 27 Oct 2017 17:08:52 GMT
See <https://builds.apache.org/job/streams-examples/228/display/redirect>

------------------------------------------
[...truncated 115.18 KB...]
warning file=<https://builds.apache.org/job/streams-examples/ws/flink/flink-twitter-collection/src/main/scala/org/apache/streams/examples/flink/twitter/collection/FlinkTwitterUserInformationPipeline.scala>
message=If block needs braces line=160 column=6
warning file=<https://builds.apache.org/job/streams-examples/ws/flink/flink-twitter-collection/src/main/scala/org/apache/streams/examples/flink/twitter/collection/FlinkTwitterUserInformationPipeline.scala>
message=Public method must have explicit type line=60 column=15
warning file=<https://builds.apache.org/job/streams-examples/ws/flink/flink-twitter-collection/src/main/scala/org/apache/streams/examples/flink/twitter/collection/FlinkTwitterUserInformationPipeline.scala>
message=Public method must have explicit type line=169 column=8
warning file=<https://builds.apache.org/job/streams-examples/ws/flink/flink-twitter-collection/src/main/scala/org/apache/streams/examples/flink/twitter/collection/FlinkTwitterUserInformationPipeline.scala>
message=Field name does not match the regular expression '^[a-z][A-Za-z]*$' line=55 column=6
warning file=<https://builds.apache.org/job/streams-examples/ws/flink/flink-twitter-collection/src/main/scala/org/apache/streams/examples/flink/twitter/collection/FlinkTwitterUserInformationPipeline.scala>
message=Field name does not match the regular expression '^[a-z][A-Za-z]*$' line=57 column=14
warning file=<https://builds.apache.org/job/streams-examples/ws/flink/flink-twitter-collection/src/main/scala/org/apache/streams/examples/flink/twitter/collection/FlinkTwitterUserInformationPipeline.scala>
message=Field name does not match the regular expression '^[a-z][A-Za-z]*$' line=58 column=14
warning file=<https://builds.apache.org/job/streams-examples/ws/flink/flink-twitter-collection/src/main/scala/org/apache/streams/examples/flink/twitter/collection/FlinkTwitterUserInformationPipeline.scala>
message=Field name does not match the regular expression '^[a-z][A-Za-z]*$' line=131 column=8
warning file=<https://builds.apache.org/job/streams-examples/ws/flink/flink-twitter-collection/src/main/scala/org/apache/streams/examples/flink/twitter/collection/FlinkTwitterUserInformationPipeline.scala>
message=Field name does not match the regular expression '^[a-z][A-Za-z]*$' line=143 column=12
warning file=<https://builds.apache.org/job/streams-examples/ws/flink/flink-twitter-collection/src/main/scala/org/apache/streams/examples/flink/twitter/collection/FlinkTwitterFollowingPipeline.scala>
message=Header does not match expected text line=1
warning file=<https://builds.apache.org/job/streams-examples/ws/flink/flink-twitter-collection/src/main/scala/org/apache/streams/examples/flink/twitter/collection/FlinkTwitterFollowingPipeline.scala>
message=File line length exceeds 160 characters line=61
warning file=<https://builds.apache.org/job/streams-examples/ws/flink/flink-twitter-collection/src/main/scala/org/apache/streams/examples/flink/twitter/collection/FlinkTwitterFollowingPipeline.scala>
message=File line length exceeds 160 characters line=113
warning file=<https://builds.apache.org/job/streams-examples/ws/flink/flink-twitter-collection/src/main/scala/org/apache/streams/examples/flink/twitter/collection/FlinkTwitterFollowingPipeline.scala>
message=File line length exceeds 160 characters line=155
warning file=<https://builds.apache.org/job/streams-examples/ws/flink/flink-twitter-collection/src/main/scala/org/apache/streams/examples/flink/twitter/collection/FlinkTwitterFollowingPipeline.scala>
message=File line length exceeds 160 characters line=156
warning file=<https://builds.apache.org/job/streams-examples/ws/flink/flink-twitter-collection/src/main/scala/org/apache/streams/examples/flink/twitter/collection/FlinkTwitterFollowingPipeline.scala>
message=Magic Number line=128 column=86
warning file=<https://builds.apache.org/job/streams-examples/ws/flink/flink-twitter-collection/src/main/scala/org/apache/streams/examples/flink/twitter/collection/FlinkTwitterFollowingPipeline.scala>
message=Magic Number line=132 column=97
warning file=<https://builds.apache.org/job/streams-examples/ws/flink/flink-twitter-collection/src/main/scala/org/apache/streams/examples/flink/twitter/collection/FlinkTwitterFollowingPipeline.scala>
message=Avoid using return line=76 column=6
warning file=<https://builds.apache.org/job/streams-examples/ws/flink/flink-twitter-collection/src/main/scala/org/apache/streams/examples/flink/twitter/collection/FlinkTwitterFollowingPipeline.scala>
message=Avoid using return line=82 column=6
warning file=<https://builds.apache.org/job/streams-examples/ws/flink/flink-twitter-collection/src/main/scala/org/apache/streams/examples/flink/twitter/collection/FlinkTwitterFollowingPipeline.scala>
message=Avoid using return line=88 column=6
warning file=<https://builds.apache.org/job/streams-examples/ws/flink/flink-twitter-collection/src/main/scala/org/apache/streams/examples/flink/twitter/collection/FlinkTwitterFollowingPipeline.scala>
message=Avoid using return line=94 column=6
warning file=<https://builds.apache.org/job/streams-examples/ws/flink/flink-twitter-collection/src/main/scala/org/apache/streams/examples/flink/twitter/collection/FlinkTwitterFollowingPipeline.scala>
message=Avoid using null line=73 column=21
warning file=<https://builds.apache.org/job/streams-examples/ws/flink/flink-twitter-collection/src/main/scala/org/apache/streams/examples/flink/twitter/collection/FlinkTwitterFollowingPipeline.scala>
message=Avoid using null line=79 column=31
warning file=<https://builds.apache.org/job/streams-examples/ws/flink/flink-twitter-collection/src/main/scala/org/apache/streams/examples/flink/twitter/collection/FlinkTwitterFollowingPipeline.scala>
message=Avoid using null line=85 column=36
warning file=<https://builds.apache.org/job/streams-examples/ws/flink/flink-twitter-collection/src/main/scala/org/apache/streams/examples/flink/twitter/collection/FlinkTwitterFollowingPipeline.scala>
message=Avoid using null line=91 column=32
warning file=<https://builds.apache.org/job/streams-examples/ws/flink/flink-twitter-collection/src/main/scala/org/apache/streams/examples/flink/twitter/collection/FlinkTwitterFollowingPipeline.scala>
message=Avoid using null line=170 column=45
warning file=<https://builds.apache.org/job/streams-examples/ws/flink/flink-twitter-collection/src/main/scala/org/apache/streams/examples/flink/twitter/collection/FlinkTwitterFollowingPipeline.scala>
message=Regular expression matched 'println' line=75 column=17
warning file=<https://builds.apache.org/job/streams-examples/ws/flink/flink-twitter-collection/src/main/scala/org/apache/streams/examples/flink/twitter/collection/FlinkTwitterFollowingPipeline.scala>
message=Regular expression matched 'println' line=81 column=17
warning file=<https://builds.apache.org/job/streams-examples/ws/flink/flink-twitter-collection/src/main/scala/org/apache/streams/examples/flink/twitter/collection/FlinkTwitterFollowingPipeline.scala>
message=Regular expression matched 'println' line=87 column=17
warning file=<https://builds.apache.org/job/streams-examples/ws/flink/flink-twitter-collection/src/main/scala/org/apache/streams/examples/flink/twitter/collection/FlinkTwitterFollowingPipeline.scala>
message=Regular expression matched 'println' line=93 column=17
warning file=<https://builds.apache.org/job/streams-examples/ws/flink/flink-twitter-collection/src/main/scala/org/apache/streams/examples/flink/twitter/collection/FlinkTwitterFollowingPipeline.scala>
message=Boolean expression can be simplified line=143 column=8
warning file=<https://builds.apache.org/job/streams-examples/ws/flink/flink-twitter-collection/src/main/scala/org/apache/streams/examples/flink/twitter/collection/FlinkTwitterFollowingPipeline.scala>
message=If block needs braces line=143 column=4
warning file=<https://builds.apache.org/job/streams-examples/ws/flink/flink-twitter-collection/src/main/scala/org/apache/streams/examples/flink/twitter/collection/FlinkTwitterFollowingPipeline.scala>
message=Public method must have explicit type line=59 column=15
warning file=<https://builds.apache.org/job/streams-examples/ws/flink/flink-twitter-collection/src/main/scala/org/apache/streams/examples/flink/twitter/collection/FlinkTwitterFollowingPipeline.scala>
message=Public method must have explicit type line=163 column=8
warning file=<https://builds.apache.org/job/streams-examples/ws/flink/flink-twitter-collection/src/main/scala/org/apache/streams/examples/flink/twitter/collection/FlinkTwitterFollowingPipeline.scala>
message=File must end with newline character
warning file=<https://builds.apache.org/job/streams-examples/ws/flink/flink-twitter-collection/src/main/scala/org/apache/streams/examples/flink/twitter/collection/FlinkTwitterFollowingPipeline.scala>
message=Field name does not match the regular expression '^[a-z][A-Za-z]*$' line=54 column=6
warning file=<https://builds.apache.org/job/streams-examples/ws/flink/flink-twitter-collection/src/main/scala/org/apache/streams/examples/flink/twitter/collection/FlinkTwitterFollowingPipeline.scala>
message=Field name does not match the regular expression '^[a-z][A-Za-z]*$' line=56 column=14
warning file=<https://builds.apache.org/job/streams-examples/ws/flink/flink-twitter-collection/src/main/scala/org/apache/streams/examples/flink/twitter/collection/FlinkTwitterFollowingPipeline.scala>
message=Field name does not match the regular expression '^[a-z][A-Za-z]*$' line=57 column=14
warning file=<https://builds.apache.org/job/streams-examples/ws/flink/flink-twitter-collection/src/main/scala/org/apache/streams/examples/flink/twitter/collection/FlinkTwitterFollowingPipeline.scala>
message=Field name does not match the regular expression '^[a-z][A-Za-z]*$' line=128 column=8
warning file=<https://builds.apache.org/job/streams-examples/ws/flink/flink-twitter-collection/src/main/scala/org/apache/streams/examples/flink/twitter/collection/FlinkTwitterFollowingPipeline.scala>
message=Field name does not match the regular expression '^[a-z][A-Za-z]*$' line=139 column=12
warning file=<https://builds.apache.org/job/streams-examples/ws/flink/flink-twitter-collection/src/main/scala/org/apache/streams/examples/flink/twitter/collection/FlinkTwitterSpritzerPipeline.scala>
message=Header does not match expected text line=1
warning file=<https://builds.apache.org/job/streams-examples/ws/flink/flink-twitter-collection/src/main/scala/org/apache/streams/examples/flink/twitter/collection/FlinkTwitterSpritzerPipeline.scala>
message=File line length exceeds 160 characters line=109
warning file=<https://builds.apache.org/job/streams-examples/ws/flink/flink-twitter-collection/src/main/scala/org/apache/streams/examples/flink/twitter/collection/FlinkTwitterSpritzerPipeline.scala>
message=Avoid using return line=78 column=6
warning file=<https://builds.apache.org/job/streams-examples/ws/flink/flink-twitter-collection/src/main/scala/org/apache/streams/examples/flink/twitter/collection/FlinkTwitterSpritzerPipeline.scala>
message=Avoid using return line=84 column=6
warning file=<https://builds.apache.org/job/streams-examples/ws/flink/flink-twitter-collection/src/main/scala/org/apache/streams/examples/flink/twitter/collection/FlinkTwitterSpritzerPipeline.scala>
message=Avoid using return line=90 column=6
warning file=<https://builds.apache.org/job/streams-examples/ws/flink/flink-twitter-collection/src/main/scala/org/apache/streams/examples/flink/twitter/collection/FlinkTwitterSpritzerPipeline.scala>
message=Avoid using null line=75 column=21
warning file=<https://builds.apache.org/job/streams-examples/ws/flink/flink-twitter-collection/src/main/scala/org/apache/streams/examples/flink/twitter/collection/FlinkTwitterSpritzerPipeline.scala>
message=Avoid using null line=81 column=36
warning file=<https://builds.apache.org/job/streams-examples/ws/flink/flink-twitter-collection/src/main/scala/org/apache/streams/examples/flink/twitter/collection/FlinkTwitterSpritzerPipeline.scala>
message=Avoid using null line=87 column=32
warning file=<https://builds.apache.org/job/streams-examples/ws/flink/flink-twitter-collection/src/main/scala/org/apache/streams/examples/flink/twitter/collection/FlinkTwitterSpritzerPipeline.scala>
message=Avoid using null line=157 column=45
warning file=<https://builds.apache.org/job/streams-examples/ws/flink/flink-twitter-collection/src/main/scala/org/apache/streams/examples/flink/twitter/collection/FlinkTwitterSpritzerPipeline.scala>
message=Regular expression matched 'println' line=77 column=17
warning file=<https://builds.apache.org/job/streams-examples/ws/flink/flink-twitter-collection/src/main/scala/org/apache/streams/examples/flink/twitter/collection/FlinkTwitterSpritzerPipeline.scala>
message=Regular expression matched 'println' line=83 column=17
warning file=<https://builds.apache.org/job/streams-examples/ws/flink/flink-twitter-collection/src/main/scala/org/apache/streams/examples/flink/twitter/collection/FlinkTwitterSpritzerPipeline.scala>
message=Regular expression matched 'println' line=89 column=17
warning file=<https://builds.apache.org/job/streams-examples/ws/flink/flink-twitter-collection/src/main/scala/org/apache/streams/examples/flink/twitter/collection/FlinkTwitterSpritzerPipeline.scala>
message=Boolean expression can be simplified line=126 column=8
warning file=<https://builds.apache.org/job/streams-examples/ws/flink/flink-twitter-collection/src/main/scala/org/apache/streams/examples/flink/twitter/collection/FlinkTwitterSpritzerPipeline.scala>
message=If block needs braces line=126 column=4
warning file=<https://builds.apache.org/job/streams-examples/ws/flink/flink-twitter-collection/src/main/scala/org/apache/streams/examples/flink/twitter/collection/FlinkTwitterSpritzerPipeline.scala>
message=Public method must have explicit type line=61 column=15
warning file=<https://builds.apache.org/job/streams-examples/ws/flink/flink-twitter-collection/src/main/scala/org/apache/streams/examples/flink/twitter/collection/FlinkTwitterSpritzerPipeline.scala>
message=Field name does not match the regular expression '^[a-z][A-Za-z]*$' line=56 column=6
warning file=<https://builds.apache.org/job/streams-examples/ws/flink/flink-twitter-collection/src/main/scala/org/apache/streams/examples/flink/twitter/collection/FlinkTwitterSpritzerPipeline.scala>
message=Field name does not match the regular expression '^[a-z][A-Za-z]*$' line=58 column=14
warning file=<https://builds.apache.org/job/streams-examples/ws/flink/flink-twitter-collection/src/main/scala/org/apache/streams/examples/flink/twitter/collection/FlinkTwitterSpritzerPipeline.scala>
message=Field name does not match the regular expression '^[a-z][A-Za-z]*$' line=59 column=14
warning file=<https://builds.apache.org/job/streams-examples/ws/flink/flink-twitter-collection/src/test/scala/org/apache/streams/examples/flink/twitter/test/FlinkTwitterUserInformationPipelineIT.scala>
message=Header does not match expected text line=1
warning file=<https://builds.apache.org/job/streams-examples/ws/flink/flink-twitter-collection/src/test/scala/org/apache/streams/examples/flink/twitter/test/FlinkTwitterUserInformationPipelineIT.scala>
message=Public method must have explicit type line=46 column=6
warning file=<https://builds.apache.org/job/streams-examples/ws/flink/flink-twitter-collection/src/test/scala/org/apache/streams/examples/flink/twitter/test/FlinkTwitterUserInformationPipelineIT.scala>
message=Field name does not match the regular expression '^[a-z][A-Za-z]*$' line=41 column=14
warning file=<https://builds.apache.org/job/streams-examples/ws/flink/flink-twitter-collection/src/test/scala/org/apache/streams/examples/flink/twitter/test/FlinkTwitterUserInformationPipelineIT.scala>
message=Field name does not match the regular expression '^[a-z][A-Za-z]*$' line=49 column=8
warning file=<https://builds.apache.org/job/streams-examples/ws/flink/flink-twitter-collection/src/test/scala/org/apache/streams/examples/flink/twitter/test/FlinkTwitterSpritzerPipelineIT.scala>
message=Header does not match expected text line=1
warning file=<https://builds.apache.org/job/streams-examples/ws/flink/flink-twitter-collection/src/test/scala/org/apache/streams/examples/flink/twitter/test/FlinkTwitterSpritzerPipelineIT.scala>
message=Magic Number line=62 column=19
warning file=<https://builds.apache.org/job/streams-examples/ws/flink/flink-twitter-collection/src/test/scala/org/apache/streams/examples/flink/twitter/test/FlinkTwitterSpritzerPipelineIT.scala>
message=Public method must have explicit type line=46 column=6
warning file=<https://builds.apache.org/job/streams-examples/ws/flink/flink-twitter-collection/src/test/scala/org/apache/streams/examples/flink/twitter/test/FlinkTwitterSpritzerPipelineIT.scala>
message=Field name does not match the regular expression '^[a-z][A-Za-z]*$' line=41 column=14
warning file=<https://builds.apache.org/job/streams-examples/ws/flink/flink-twitter-collection/src/test/scala/org/apache/streams/examples/flink/twitter/test/FlinkTwitterSpritzerPipelineIT.scala>
message=Field name does not match the regular expression '^[a-z][A-Za-z]*$' line=49 column=8
warning file=<https://builds.apache.org/job/streams-examples/ws/flink/flink-twitter-collection/src/test/scala/org/apache/streams/examples/flink/twitter/test/FlinkTwitterPostsPipelineIT.scala>
message=Header does not match expected text line=1
warning file=<https://builds.apache.org/job/streams-examples/ws/flink/flink-twitter-collection/src/test/scala/org/apache/streams/examples/flink/twitter/test/FlinkTwitterPostsPipelineIT.scala>
message=Public method must have explicit type line=46 column=6
warning file=<https://builds.apache.org/job/streams-examples/ws/flink/flink-twitter-collection/src/test/scala/org/apache/streams/examples/flink/twitter/test/FlinkTwitterPostsPipelineIT.scala>
message=Field name does not match the regular expression '^[a-z][A-Za-z]*$' line=41 column=14
warning file=<https://builds.apache.org/job/streams-examples/ws/flink/flink-twitter-collection/src/test/scala/org/apache/streams/examples/flink/twitter/test/FlinkTwitterPostsPipelineIT.scala>
message=Field name does not match the regular expression '^[a-z][A-Za-z]*$' line=49 column=8
warning file=<https://builds.apache.org/job/streams-examples/ws/flink/flink-twitter-collection/src/test/scala/org/apache/streams/examples/flink/twitter/test/FlinkTwitterFollowingPipelineFollowersIT.scala>
message=Header does not match expected text line=1
warning file=<https://builds.apache.org/job/streams-examples/ws/flink/flink-twitter-collection/src/test/scala/org/apache/streams/examples/flink/twitter/test/FlinkTwitterFollowingPipelineFollowersIT.scala>
message=Public method must have explicit type line=46 column=6
warning file=<https://builds.apache.org/job/streams-examples/ws/flink/flink-twitter-collection/src/test/scala/org/apache/streams/examples/flink/twitter/test/FlinkTwitterFollowingPipelineFollowersIT.scala>
message=Field name does not match the regular expression '^[a-z][A-Za-z]*$' line=41 column=14
warning file=<https://builds.apache.org/job/streams-examples/ws/flink/flink-twitter-collection/src/test/scala/org/apache/streams/examples/flink/twitter/test/FlinkTwitterFollowingPipelineFollowersIT.scala>
message=Field name does not match the regular expression '^[a-z][A-Za-z]*$' line=49 column=8
warning file=<https://builds.apache.org/job/streams-examples/ws/flink/flink-twitter-collection/src/test/scala/org/apache/streams/examples/flink/twitter/test/FlinkTwitterFollowingPipelineFriendsIT.scala>
message=Header does not match expected text line=1
warning file=<https://builds.apache.org/job/streams-examples/ws/flink/flink-twitter-collection/src/test/scala/org/apache/streams/examples/flink/twitter/test/FlinkTwitterFollowingPipelineFriendsIT.scala>
message=Public method must have explicit type line=46 column=6
warning file=<https://builds.apache.org/job/streams-examples/ws/flink/flink-twitter-collection/src/test/scala/org/apache/streams/examples/flink/twitter/test/FlinkTwitterFollowingPipelineFriendsIT.scala>
message=Field name does not match the regular expression '^[a-z][A-Za-z]*$' line=41 column=14
warning file=<https://builds.apache.org/job/streams-examples/ws/flink/flink-twitter-collection/src/test/scala/org/apache/streams/examples/flink/twitter/test/FlinkTwitterFollowingPipelineFriendsIT.scala>
message=Field name does not match the regular expression '^[a-z][A-Za-z]*$' line=49 column=8
Saving to outputFile=<https://builds.apache.org/job/streams-examples/ws/flink/flink-twitter-collection/target/scalastyle-output.xml>
Processed 10 file(s)
Found 0 errors
Found 147 warnings
Found 0 infos
Finished in 351 ms
[INFO] 
[INFO] --- apache-rat-plugin:0.12:check (default) @ streams-flink-twitter-collection ---
[INFO] Enabled default license matchers.
[INFO] Will parse SCM ignores for exclusions...
[INFO] Finished adding exclusions from SCM ignore files.
[INFO] 61 implicit excludes (use -debug for more details).
[INFO] Exclude: .git
[INFO] Exclude: .gitignore
[INFO] Exclude: .git/**
[INFO] Exclude: .idea/**
[INFO] Exclude: .java-version
[INFO] Exclude: *.conf
[INFO] Exclude: **/DEPENDENCIES
[INFO] Exclude: **/LICENSE
[INFO] Exclude: **/MANIFEST.MF
[INFO] Exclude: **/NOTICE
[INFO] Exclude: **/README.*
[INFO] Exclude: **/target/**
[INFO] Exclude: **/overlays/**
[INFO] Exclude: **/src/test/resources/**/*.csv
[INFO] Exclude: **/src/test/resources/**/*.tsv
[INFO] Exclude: **/src/site/resources/**/*
[INFO] Exclude: **/.gitignore
[INFO] Exclude: **/*.properties
[INFO] Exclude: **/*.iml
[INFO] Exclude: **/*.ini
[INFO] Exclude: **/*.jar
[INFO] Exclude: **/*.svg
[INFO] Exclude: dependency-reduced-pom.xml
[INFO] Exclude: rat.txt
[INFO] Exclude: apache-maven-*/**/*
[INFO] Exclude: src/test/resources/1000twitterids.txt
[INFO] Exclude: src/test/resources/asf.txt
[INFO] 33 resources included (use -debug for more details)
[INFO] Rat check: Summary over all files. Unapproved: 0, unknown: 0, generated: 0, approved:
33 licenses.
[INFO] 
[INFO] --- build-helper-maven-plugin:1.8:add-source (add-source) @ streams-flink-twitter-collection
---
[INFO] Source directory: <https://builds.apache.org/job/streams-examples/ws/flink/flink-twitter-collection/target/generated-sources/pojo>
added.
[WARNING] Failed to getClass for org.apache.streams.plugins.StreamsPojoSourceGeneratorMojo
[INFO] 
[INFO] <<< streams-plugin-pojo:0.5.1-SNAPSHOT:generate-sources (default) < generate-sources
@ streams-flink-twitter-collection <<<
[INFO] 
[INFO] --- streams-plugin-pojo:0.5.1-SNAPSHOT:generate-sources (default) @ streams-flink-twitter-collection
---
[INFO] Downloading: https://repository.apache.org/content/repositories/snapshots/org/apache/streams/streams-persist-hdfs/0.5.1-SNAPSHOT/maven-metadata.xml
[INFO] Downloaded: https://repository.apache.org/content/repositories/snapshots/org/apache/streams/streams-persist-hdfs/0.5.1-SNAPSHOT/maven-metadata.xml
(791 B at 1.3 KB/sec)
[INFO] Downloading: https://repository.apache.org/content/repositories/snapshots/org/apache/streams/streams-config/0.5.1-SNAPSHOT/maven-metadata.xml
[INFO] Downloaded: https://repository.apache.org/content/repositories/snapshots/org/apache/streams/streams-config/0.5.1-SNAPSHOT/maven-metadata.xml
(785 B at 1.4 KB/sec)
[INFO] Downloading: https://repository.apache.org/content/repositories/snapshots/org/apache/streams/streams-core/0.5.1-SNAPSHOT/maven-metadata.xml
[INFO] Downloaded: https://repository.apache.org/content/repositories/snapshots/org/apache/streams/streams-core/0.5.1-SNAPSHOT/maven-metadata.xml
(783 B at 1.4 KB/sec)
[INFO] Downloading: https://repository.apache.org/content/repositories/snapshots/org/apache/streams/streams-pojo/0.5.1-SNAPSHOT/maven-metadata.xml
[INFO] Downloaded: https://repository.apache.org/content/repositories/snapshots/org/apache/streams/streams-pojo/0.5.1-SNAPSHOT/maven-metadata.xml
(996 B at 1.8 KB/sec)
[INFO] Downloading: https://repository.apache.org/content/repositories/snapshots/org/apache/streams/streams-schema-activitystreams/0.5.1-SNAPSHOT/maven-metadata.xml
[INFO] Downloaded: https://repository.apache.org/content/repositories/snapshots/org/apache/streams/streams-schema-activitystreams/0.5.1-SNAPSHOT/maven-metadata.xml
(1014 B at 1.8 KB/sec)
[INFO] Downloading: https://repository.apache.org/content/repositories/snapshots/org/apache/streams/streams-util/0.5.1-SNAPSHOT/maven-metadata.xml
[INFO] Downloaded: https://repository.apache.org/content/repositories/snapshots/org/apache/streams/streams-util/0.5.1-SNAPSHOT/maven-metadata.xml
(996 B at 1.8 KB/sec)
[INFO] Downloading: https://repository.apache.org/content/repositories/snapshots/org/apache/streams/streams-converters/0.5.1-SNAPSHOT/maven-metadata.xml
[INFO] Downloaded: https://repository.apache.org/content/repositories/snapshots/org/apache/streams/streams-converters/0.5.1-SNAPSHOT/maven-metadata.xml
(789 B at 1.4 KB/sec)
[INFO] Downloading: https://repository.apache.org/content/repositories/snapshots/org/apache/streams/streams-pojo-extensions/0.5.1-SNAPSHOT/maven-metadata.xml
[INFO] Downloaded: https://repository.apache.org/content/repositories/snapshots/org/apache/streams/streams-pojo-extensions/0.5.1-SNAPSHOT/maven-metadata.xml
(794 B at 1.4 KB/sec)
[INFO] Downloading: https://repository.apache.org/content/repositories/snapshots/org/apache/streams/streams-provider-twitter/0.5.1-SNAPSHOT/maven-metadata.xml
[INFO] Downloaded: https://repository.apache.org/content/repositories/snapshots/org/apache/streams/streams-provider-twitter/0.5.1-SNAPSHOT/maven-metadata.xml
(795 B at 1.4 KB/sec)
[INFO] Downloading: https://repository.apache.org/content/repositories/snapshots/org/apache/streams/streams-http/0.5.1-SNAPSHOT/maven-metadata.xml
[INFO] Downloaded: https://repository.apache.org/content/repositories/snapshots/org/apache/streams/streams-http/0.5.1-SNAPSHOT/maven-metadata.xml
(783 B at 1.3 KB/sec)
[INFO] Downloading: https://repository.apache.org/content/repositories/snapshots/org/apache/streams/streams-persist-hdfs/0.5.1-SNAPSHOT/streams-persist-hdfs-0.5.1-20171027.170041-18.jar
[INFO] Downloading: https://repository.apache.org/content/repositories/snapshots/org/apache/streams/streams-core/0.5.1-SNAPSHOT/streams-core-0.5.1-20171027.165937-18.jar
[INFO] Downloading: https://repository.apache.org/content/repositories/snapshots/org/apache/streams/streams-pojo/0.5.1-SNAPSHOT/streams-pojo-0.5.1-20171027.170125-18.jar
[INFO] Downloading: https://repository.apache.org/content/repositories/snapshots/org/apache/streams/streams-schema-activitystreams/0.5.1-SNAPSHOT/streams-schema-activitystreams-0.5.1-20171027.170340-16.jar
[INFO] Downloading: https://repository.apache.org/content/repositories/snapshots/org/apache/streams/streams-config/0.5.1-SNAPSHOT/streams-config-0.5.1-20171027.165921-18.jar
[INFO] Downloaded: https://repository.apache.org/content/repositories/snapshots/org/apache/streams/streams-persist-hdfs/0.5.1-SNAPSHOT/streams-persist-hdfs-0.5.1-20171027.170041-18.jar
(0 B at 0.0 KB/sec)
[INFO] Downloading: https://repository.apache.org/content/repositories/snapshots/org/apache/streams/streams-util/0.5.1-SNAPSHOT/streams-util-0.5.1-20171027.170406-16.jar
[INFO] Downloaded: https://repository.apache.org/content/repositories/snapshots/org/apache/streams/streams-core/0.5.1-SNAPSHOT/streams-core-0.5.1-20171027.165937-18.jar
(0 B at 0.0 KB/sec)
[INFO] Downloading: https://repository.apache.org/content/repositories/snapshots/org/apache/streams/streams-converters/0.5.1-SNAPSHOT/streams-converters-0.5.1-20171027.165931-18.jar
[INFO] Downloaded: https://repository.apache.org/content/repositories/snapshots/org/apache/streams/streams-config/0.5.1-SNAPSHOT/streams-config-0.5.1-20171027.165921-18.jar
(0 B at 0.0 KB/sec)
[INFO] Downloading: https://repository.apache.org/content/repositories/snapshots/org/apache/streams/streams-pojo-extensions/0.5.1-SNAPSHOT/streams-pojo-extensions-0.5.1-20171027.170134-18.jar
[INFO] Downloaded: https://repository.apache.org/content/repositories/snapshots/org/apache/streams/streams-pojo/0.5.1-SNAPSHOT/streams-pojo-0.5.1-20171027.170125-18.jar
(0 B at 0.0 KB/sec)
[INFO] Downloading: https://repository.apache.org/content/repositories/snapshots/org/apache/streams/streams-provider-twitter/0.5.1-SNAPSHOT/streams-provider-twitter-0.5.1-20171027.170255-17.jar
[INFO] Downloaded: https://repository.apache.org/content/repositories/snapshots/org/apache/streams/streams-schema-activitystreams/0.5.1-SNAPSHOT/streams-schema-activitystreams-0.5.1-20171027.170340-16.jar
(0 B at 0.0 KB/sec)
[INFO] Downloading: https://repository.apache.org/content/repositories/snapshots/org/apache/streams/streams-http/0.5.1-SNAPSHOT/streams-http-0.5.1-20171027.165949-18.jar
[INFO] Downloaded: https://repository.apache.org/content/repositories/snapshots/org/apache/streams/streams-util/0.5.1-SNAPSHOT/streams-util-0.5.1-20171027.170406-16.jar
(0 B at 0.0 KB/sec)
[INFO] Downloaded: https://repository.apache.org/content/repositories/snapshots/org/apache/streams/streams-converters/0.5.1-SNAPSHOT/streams-converters-0.5.1-20171027.165931-18.jar
(0 B at 0.0 KB/sec)
[INFO] Downloaded: https://repository.apache.org/content/repositories/snapshots/org/apache/streams/streams-http/0.5.1-SNAPSHOT/streams-http-0.5.1-20171027.165949-18.jar
(0 B at 0.0 KB/sec)
[INFO] Downloaded: https://repository.apache.org/content/repositories/snapshots/org/apache/streams/streams-pojo-extensions/0.5.1-SNAPSHOT/streams-pojo-extensions-0.5.1-20171027.170134-18.jar
(0 B at 0.0 KB/sec)
[INFO] Downloaded: https://repository.apache.org/content/repositories/snapshots/org/apache/streams/streams-provider-twitter/0.5.1-SNAPSHOT/streams-provider-twitter-0.5.1-20171027.170255-17.jar
(0 B at 0.0 KB/sec)
[INFO] 
[INFO] --- build-helper-maven-plugin:1.8:add-source (add-source) @ streams-flink-twitter-collection
---
[INFO] Source directory: <https://builds.apache.org/job/streams-examples/ws/flink/flink-twitter-collection/target/generated-sources/pojo>
added.
[INFO] 
[INFO] --- maven-remote-resources-plugin:1.4:process (default) @ streams-flink-twitter-collection
---
[INFO] 
[INFO] --- maven-remote-resources-plugin:1.4:process (process-resource-bundles) @ streams-flink-twitter-collection
---
[INFO] 
[INFO] --- maven-resources-plugin:2.7:resources (default-resources) @ streams-flink-twitter-collection
---
[INFO] Using 'UTF-8' encoding to copy filtered resources.
[INFO] Copying 8 resources
[INFO] Copying 4 resources
[INFO] Copying 4 resources
[INFO] 
[INFO] --- scala-maven-plugin:3.2.2:add-source (scala-compile-first) @ streams-flink-twitter-collection
---
[INFO] 
[INFO] --- scala-maven-plugin:3.2.2:compile (scala-compile-first) @ streams-flink-twitter-collection
---
[WARNING]  Expected all dependencies to require Scala version: 2.10.6
[WARNING]  org.apache.streams:streams-flink-twitter-collection:0.5.1-SNAPSHOT requires scala
version: 2.10.6
[WARNING]  org.scala-lang:scala-compiler:2.10.6 requires scala version: 2.10.6
[WARNING]  org.apache.streams:streams-flink-twitter-collection:0.5.1-SNAPSHOT requires scala
version: 2.10.6
[WARNING]  org.scala-lang:scala-reflect:2.10.6 requires scala version: 2.10.6
[WARNING]  org.scalatest:scalatest_2.10:2.2.5 requires scala version: 2.10.5
[WARNING] Multiple versions of scala libraries detected!
[INFO] <https://builds.apache.org/job/streams-examples/ws/flink/flink-twitter-collection/src/main/scala>:-1:
info: compiling
[INFO] <https://builds.apache.org/job/streams-examples/ws/flink/flink-twitter-collection/target/generated-sources/pojo>:-1:
info: compiling
[INFO] Compiling 12 source files to <https://builds.apache.org/job/streams-examples/ws/flink/flink-twitter-collection/target/classes>
at 1509124108833
[ERROR] <https://builds.apache.org/job/streams-examples/ws/flink/flink-twitter-collection/src/main/scala/org/apache/streams/examples/flink/FlinkBase.scala>:65:
error: value config is not a member of object org.apache.streams.config.StreamsConfigurator
[ERROR]     BASELOGGER.info("StreamsConfigurator.config: {}", StreamsConfigurator.config)
[ERROR]                                                                           ^
[ERROR] <https://builds.apache.org/job/streams-examples/ws/flink/flink-twitter-collection/src/main/scala/org/apache/streams/examples/flink/FlinkBase.scala>:69:
error: value config is not a member of object org.apache.streams.config.StreamsConfigurator
[ERROR]         typesafe = StreamsConfigurator.resolveConfig(configUrl).withFallback(StreamsConfigurator.config).resolve()
[ERROR]                                                                                  
               ^
[ERROR] two errors found
[INFO] ------------------------------------------------------------------------
[INFO] Reactor Summary:
[INFO] 
[INFO] apache-streams-examples ............................ SUCCESS [ 27.192 s]
[INFO] streams-examples-flink ............................. SUCCESS [  5.849 s]
[INFO] flink-twitter-collection ........................... FAILURE [01:01 min]
[INFO] streams-examples-local ............................. SKIPPED
[INFO] elasticsearch-hdfs ................................. SKIPPED
[INFO] elasticsearch-reindex .............................. SKIPPED
[INFO] mongo-elasticsearch-sync ........................... SKIPPED
[INFO] twitter-follow-neo4j ............................... SKIPPED
[INFO] twitter-history-elasticsearch ...................... SKIPPED
[INFO] twitter-userstream-elasticsearch ................... SKIPPED
[INFO] ------------------------------------------------------------------------
[INFO] BUILD FAILURE
[INFO] ------------------------------------------------------------------------
[INFO] Total time: 01:50 min
[INFO] Finished at: 2017-10-27T17:08:43+00:00
[INFO] Final Memory: 61M/817M
[INFO] ------------------------------------------------------------------------
[ERROR] Failed to execute goal net.alchim31.maven:scala-maven-plugin:3.2.2:compile (scala-compile-first)
on project streams-flink-twitter-collection: wrap: org.apache.commons.exec.ExecuteException:
Process exited with an error: 1 (Exit value: 1) -> [Help 1]
[ERROR] 
[ERROR] To see the full stack trace of the errors, re-run Maven with the -e switch.
[ERROR] Re-run Maven using the -X switch to enable full debug logging.
[ERROR] 
[ERROR] For more information about the errors and possible solutions, please read the following
articles:
[ERROR] [Help 1] http://cwiki.apache.org/confluence/display/MAVEN/MojoExecutionException
[ERROR] 
[ERROR] After correcting the problems, you can resume the build with the command
[ERROR]   mvn <goals> -rf :streams-flink-twitter-collection
[JENKINS] Archiving <https://builds.apache.org/job/streams-examples/ws/local/pom.xml>
to org.apache.streams/streams-examples-local/0.5.1-SNAPSHOT/streams-examples-local-0.5.1-SNAPSHOT.pom
[JENKINS] Archiving <https://builds.apache.org/job/streams-examples/ws/local/mongo-elasticsearch-sync/pom.xml>
to org.apache.streams/streams-mongo-elasticsearch-sync/0.5.1-SNAPSHOT/streams-mongo-elasticsearch-sync-0.5.1-SNAPSHOT.pom
[Fast Archiver] No prior successful build to compare, so performing full copy of artifacts
[JENKINS] Archiving <https://builds.apache.org/job/streams-examples/ws/local/elasticsearch-hdfs/pom.xml>
to org.apache.streams/streams-elasticsearch-hdfs/0.5.1-SNAPSHOT/streams-elasticsearch-hdfs-0.5.1-SNAPSHOT.pom
[Fast Archiver] No prior successful build to compare, so performing full copy of artifacts
[JENKINS] Archiving <https://builds.apache.org/job/streams-examples/ws/local/twitter-userstream-elasticsearch/pom.xml>
to org.apache.streams/twitter-userstream-elasticsearch/0.5.1-SNAPSHOT/twitter-userstream-elasticsearch-0.5.1-SNAPSHOT.pom
[JENKINS] Archiving <https://builds.apache.org/job/streams-examples/ws/flink/pom.xml>
to org.apache.streams/streams-examples-flink/0.5.1-SNAPSHOT/streams-examples-flink-0.5.1-SNAPSHOT.pom
[JENKINS] Archiving <https://builds.apache.org/job/streams-examples/ws/flink/target/streams-examples-flink-0.5.1-SNAPSHOT-site.xml>
to org.apache.streams/streams-examples-flink/0.5.1-SNAPSHOT/streams-examples-flink-0.5.1-SNAPSHOT-site.xml
[JENKINS] Archiving <https://builds.apache.org/job/streams-examples/ws/local/twitter-history-elasticsearch/pom.xml>
to org.apache.streams/streams-twitter-history-elasticsearch/0.5.1-SNAPSHOT/streams-twitter-history-elasticsearch-0.5.1-SNAPSHOT.pom
[Fast Archiver] No prior successful build to compare, so performing full copy of artifacts
[JENKINS] Archiving <https://builds.apache.org/job/streams-examples/ws/flink/flink-twitter-collection/pom.xml>
to org.apache.streams/streams-flink-twitter-collection/0.5.1-SNAPSHOT/streams-flink-twitter-collection-0.5.1-SNAPSHOT.pom
[Fast Archiver] No prior successful build to compare, so performing full copy of artifacts
[JENKINS] Archiving <https://builds.apache.org/job/streams-examples/ws/local/twitter-follow-neo4j/pom.xml>
to org.apache.streams/streams-twitter-follow-neo4j/0.5.1-SNAPSHOT/streams-twitter-follow-neo4j-0.5.1-SNAPSHOT.pom
[Fast Archiver] No prior successful build to compare, so performing full copy of artifacts
[JENKINS] Archiving <https://builds.apache.org/job/streams-examples/ws/local/elasticsearch-reindex/pom.xml>
to org.apache.streams/streams-elasticsearch-reindex/0.5.1-SNAPSHOT/streams-elasticsearch-reindex-0.5.1-SNAPSHOT.pom
[Fast Archiver] No prior successful build to compare, so performing full copy of artifacts
[JENKINS] Archiving <https://builds.apache.org/job/streams-examples/ws/pom.xml> to org.apache.streams/apache-streams-examples/0.5.1-SNAPSHOT/apache-streams-examples-0.5.1-SNAPSHOT.pom
[JENKINS] Archiving <https://builds.apache.org/job/streams-examples/ws/target/apache-streams-examples-0.5.1-SNAPSHOT-site.xml>
to org.apache.streams/apache-streams-examples/0.5.1-SNAPSHOT/apache-streams-examples-0.5.1-SNAPSHOT-site.xml
channel stopped


Mime
View raw message