streams-commits mailing list archives

Site index · List index
Message view « Date » · « Thread »
Top « Date » · « Thread »
From Apache Jenkins Server <jenk...@builds.apache.org>
Subject Build failed in Jenkins: streams-project #379
Date Wed, 21 Jun 2017 19:38:13 GMT
See <https://builds.apache.org/job/streams-project/379/display/redirect?page=changes>

Changes:

[sblackmon] upgrade instagram to work with latest juneau

------------------------------------------
[...truncated 266.26 KB...]
	at org.junit.runners.ParentRunner.runChildren(ParentRunner.java:288)
	at org.junit.runners.ParentRunner.access$000(ParentRunner.java:58)
	at org.junit.runners.ParentRunner$2.evaluate(ParentRunner.java:268)
	at org.junit.runners.ParentRunner.run(ParentRunner.java:363)
	at org.apache.maven.surefire.junitcore.JUnitCore.run(JUnitCore.java:55)
	at org.apache.maven.surefire.junitcore.JUnitCoreWrapper.createRequestAndRun(JUnitCoreWrapper.java:137)
	at org.apache.maven.surefire.junitcore.JUnitCoreWrapper.executeEager(JUnitCoreWrapper.java:107)
	at org.apache.maven.surefire.junitcore.JUnitCoreWrapper.execute(JUnitCoreWrapper.java:83)
	at org.apache.maven.surefire.junitcore.JUnitCoreWrapper.execute(JUnitCoreWrapper.java:75)
	at org.apache.maven.surefire.junitcore.JUnitCoreProvider.invoke(JUnitCoreProvider.java:161)
	at org.apache.maven.surefire.booter.ForkedBooter.invokeProviderInSameClassLoader(ForkedBooter.java:290)
	at org.apache.maven.surefire.booter.ForkedBooter.runSuitesInProcess(ForkedBooter.java:242)
	at org.apache.maven.surefire.booter.ForkedBooter.main(ForkedBooter.java:121)
Caused by: org.apache.http.ProtocolException: Target host is not specified
	at org.apache.http.impl.conn.DefaultRoutePlanner.determineRoute(DefaultRoutePlanner.java:71)
	at org.apache.http.impl.client.InternalHttpClient.determineRoute(InternalHttpClient.java:125)
	at org.apache.http.impl.client.InternalHttpClient.doExecute(InternalHttpClient.java:184)
	... 39 common frames omitted
Tests run: 2, Failures: 0, Errors: 0, Skipped: 0, Time elapsed: 1.439 sec - in org.apache.streams.monitoring.persist.impl.BroadcastMessagePersisterTest
testFailedPersist(org.apache.streams.monitoring.persist.impl.BroadcastMessagePersisterTest)
 Time elapsed: 1.415 sec
testInvalidUrl(org.apache.streams.monitoring.persist.impl.BroadcastMessagePersisterTest) 
Time elapsed: 0.024 sec
Running org.apache.streams.monitoring.tasks.BroadcastMonitorThreadTest
Tests run: 2, Failures: 0, Errors: 0, Skipped: 0, Time elapsed: 60.796 sec - in org.apache.streams.monitoring.tasks.BroadcastMonitorThreadTest
testThreadStreamsConfig(org.apache.streams.monitoring.tasks.BroadcastMonitorThreadTest)  Time
elapsed: 30.653 sec
testThreadEmptyBeanConfig(org.apache.streams.monitoring.tasks.BroadcastMonitorThreadTest)
 Time elapsed: 30.137 sec
Running org.apache.streams.jackson.MemoryUsageDeserializerTest
Tests run: 1, Failures: 0, Errors: 0, Skipped: 0, Time elapsed: 0.37 sec - in org.apache.streams.jackson.MemoryUsageDeserializerTest
serDeTest(org.apache.streams.jackson.MemoryUsageDeserializerTest)  Time elapsed: 0.37 sec

Results :

Tests run: 6, Failures: 0, Errors: 0, Skipped: 0

[JENKINS] Recording test results
[JENKINS] Recording test results
[INFO] Installing <https://builds.apache.org/job/streams-project/ws/streams-monitoring/target/streams-monitoring-0.5.1-incubating-SNAPSHOT.jar>
to /home/jenkins/jenkins-slave/maven-repositories/0/org/apache/streams/streams-monitoring/0.5.1-incubating-SNAPSHOT/streams-monitoring-0.5.1-incubating-SNAPSHOT.jar
[INFO] Installing <https://builds.apache.org/job/streams-project/ws/streams-monitoring/pom.xml>
to /home/jenkins/jenkins-slave/maven-repositories/0/org/apache/streams/streams-monitoring/0.5.1-incubating-SNAPSHOT/streams-monitoring-0.5.1-incubating-SNAPSHOT.pom
Saving to outputFile=<https://builds.apache.org/job/streams-project/ws/streams-runtimes/target/scalastyle-output.xml>
Processed 0 file(s)
Found 0 errors
Found 0 warnings
Found 0 infos
Finished in 0 ms
[JENKINS] Recording test results
[INFO] Installing <https://builds.apache.org/job/streams-project/ws/streams-runtimes/pom.xml>
to /home/jenkins/jenkins-slave/maven-repositories/0/org/apache/streams/streams-runtimes/0.5.1-incubating-SNAPSHOT/streams-runtimes-0.5.1-incubating-SNAPSHOT.pom
Saving to outputFile=<https://builds.apache.org/job/streams-project/ws/streams-runtimes/streams-runtime-local/target/scalastyle-output.xml>
Processed 0 file(s)
Found 0 errors
Found 0 warnings
Found 0 infos
Finished in 0 ms
Saving to outputFile=<https://builds.apache.org/job/streams-project/ws/streams-runtimes/streams-runtime-local/target/scalastyle-output.xml>
Processed 0 file(s)
Found 0 errors
Found 0 warnings
Found 0 infos
Finished in 2 ms
[WARNING] Failed to getClass for org.apache.streams.plugins.StreamsPojoSourceGeneratorMojo

-------------------------------------------------------
 T E S T S
-------------------------------------------------------
Running org.apache.streams.local.counters.DatumStatusCounterTest
Tests run: 10, Failures: 0, Errors: 0, Skipped: 0, Time elapsed: 0.689 sec - in org.apache.streams.local.counters.DatumStatusCounterTest
testConstructor(org.apache.streams.local.counters.DatumStatusCounterTest)  Time elapsed: 0.485
sec
testFailureRate {#0 seed=[DE529F7C24DBA1AE:798A1A4B5BD2C933]}(org.apache.streams.local.counters.DatumStatusCounterTest)
 Time elapsed: 0.006 sec
testFailureRate {#1 seed=[DE529F7C24DBA1AE:CDDCA6B76F10021F]}(org.apache.streams.local.counters.DatumStatusCounterTest)
 Time elapsed: 0.003 sec
testFailureRate {#2 seed=[DE529F7C24DBA1AE:4335306B3ED44AD4]}(org.apache.streams.local.counters.DatumStatusCounterTest)
 Time elapsed: 0.006 sec
testPassed {#0 seed=[DE529F7C24DBA1AE:A53E4FAB9CF51753]}(org.apache.streams.local.counters.DatumStatusCounterTest)
 Time elapsed: 0.033 sec
testPassed {#1 seed=[DE529F7C24DBA1AE:1168F357A837DC7F]}(org.apache.streams.local.counters.DatumStatusCounterTest)
 Time elapsed: 0.038 sec
testPassed {#2 seed=[DE529F7C24DBA1AE:9F81658BF9F394B4]}(org.apache.streams.local.counters.DatumStatusCounterTest)
 Time elapsed: 0.025 sec
testFailed {#0 seed=[DE529F7C24DBA1AE:3AB4152912273949]}(org.apache.streams.local.counters.DatumStatusCounterTest)
 Time elapsed: 0.021 sec
testFailed {#1 seed=[DE529F7C24DBA1AE:8EE2A9D526E5F265]}(org.apache.streams.local.counters.DatumStatusCounterTest)
 Time elapsed: 0.046 sec
testFailed {#2 seed=[DE529F7C24DBA1AE:B3F097721BAAE]}(org.apache.streams.local.counters.DatumStatusCounterTest)
 Time elapsed: 0.015 sec
Running org.apache.streams.local.counters.StreamsTaskCounterTest
Tests run: 13, Failures: 0, Errors: 0, Skipped: 0, Time elapsed: 0.517 sec - in org.apache.streams.local.counters.StreamsTaskCounterTest
testErrorRate {#0 seed=[55586B0DCFAB26D1:37616871B21C4B4D]}(org.apache.streams.local.counters.StreamsTaskCounterTest)
 Time elapsed: 0.243 sec
testErrorRate {#1 seed=[55586B0DCFAB26D1:8337D48D86DE8061]}(org.apache.streams.local.counters.StreamsTaskCounterTest)
 Time elapsed: 0.004 sec
testErrorRate {#2 seed=[55586B0DCFAB26D1:DDE4251D71AC8AA]}(org.apache.streams.local.counters.StreamsTaskCounterTest)
 Time elapsed: 0.008 sec
testConstructor(org.apache.streams.local.counters.StreamsTaskCounterTest)  Time elapsed: 0.004
sec
testReceived {#0 seed=[55586B0DCFAB26D1:788B3C49EA9E6BCE]}(org.apache.streams.local.counters.StreamsTaskCounterTest)
 Time elapsed: 0.076 sec
testReceived {#1 seed=[55586B0DCFAB26D1:CCDD80B5DE5CA0E2]}(org.apache.streams.local.counters.StreamsTaskCounterTest)
 Time elapsed: 0.036 sec
testReceived {#2 seed=[55586B0DCFAB26D1:423416698F98E829]}(org.apache.streams.local.counters.StreamsTaskCounterTest)
 Time elapsed: 0.032 sec
testError {#0 seed=[55586B0DCFAB26D1:E618EDFA3F4103A9]}(org.apache.streams.local.counters.StreamsTaskCounterTest)
 Time elapsed: 0.009 sec
testError {#1 seed=[55586B0DCFAB26D1:524E51060B83C885]}(org.apache.streams.local.counters.StreamsTaskCounterTest)
 Time elapsed: 0.015 sec
testError {#2 seed=[55586B0DCFAB26D1:DCA7C7DA5A47804E]}(org.apache.streams.local.counters.StreamsTaskCounterTest)
 Time elapsed: 0.02 sec
testEmitted {#0 seed=[55586B0DCFAB26D1:BBC8BA93BCF52268]}(org.apache.streams.local.counters.StreamsTaskCounterTest)
 Time elapsed: 0.016 sec
testEmitted {#1 seed=[55586B0DCFAB26D1:F9E066F8837E944]}(org.apache.streams.local.counters.StreamsTaskCounterTest)
 Time elapsed: 0.034 sec
testEmitted {#2 seed=[55586B0DCFAB26D1:817790B3D9F3A18F]}(org.apache.streams.local.counters.StreamsTaskCounterTest)
 Time elapsed: 0.015 sec
Running org.apache.streams.local.executors.ShutdownStreamOnUnhandledThrowableThreadPoolExecutorTest
336  [pool-1-thread-1] ERROR o.a.s.l.e.ShutdownStreamOnUnhandleThrowableThreadPoolExecutor
- Runnable, class org.apache.streams.local.executors.ShutdownStreamOnUnhandledThrowableThreadPoolExecutorTest$$Lambda$2/1259769769,
exited with an unhandled throwable! : {} 
java.lang.RuntimeException: Testing Throwable Handling!
	at org.apache.streams.local.executors.ShutdownStreamOnUnhandledThrowableThreadPoolExecutorTest.lambda$testShutDownOnException$1(ShutdownStreamOnUnhandledThrowableThreadPoolExecutorTest.java:65)
	at java.util.concurrent.ThreadPoolExecutor.runWorker(ThreadPoolExecutor.java:1142)
	at java.util.concurrent.ThreadPoolExecutor$Worker.run(ThreadPoolExecutor.java:617)
	at java.lang.Thread.run(Thread.java:748)
341  [pool-1-thread-1] ERROR o.a.s.l.e.ShutdownStreamOnUnhandleThrowableThreadPoolExecutor
- Attempting to shut down stream. 
Exception in thread "pool-1-thread-1" java.lang.RuntimeException: Testing Throwable Handling!
	at org.apache.streams.local.executors.ShutdownStreamOnUnhandledThrowableThreadPoolExecutorTest.lambda$testShutDownOnException$1(ShutdownStreamOnUnhandledThrowableThreadPoolExecutorTest.java:65)
	at java.util.concurrent.ThreadPoolExecutor.runWorker(ThreadPoolExecutor.java:1142)
	at java.util.concurrent.ThreadPoolExecutor$Worker.run(ThreadPoolExecutor.java:617)
	at java.lang.Thread.run(Thread.java:748)
Tests run: 2, Failures: 0, Errors: 0, Skipped: 0, Time elapsed: 0.72 sec - in org.apache.streams.local.executors.ShutdownStreamOnUnhandledThrowableThreadPoolExecutorTest
testShutDownOnException(org.apache.streams.local.executors.ShutdownStreamOnUnhandledThrowableThreadPoolExecutorTest)
 Time elapsed: 0.716 sec
testNormalExecution(org.apache.streams.local.executors.ShutdownStreamOnUnhandledThrowableThreadPoolExecutorTest)
 Time elapsed: 0.002 sec
Running org.apache.streams.local.tasks.BasicTasksTest
Tests run: 6, Failures: 0, Errors: 0, Skipped: 0, Time elapsed: 36.866 sec - in org.apache.streams.local.tasks.BasicTasksTest
testMergeTask(org.apache.streams.local.tasks.BasicTasksTest)  Time elapsed: 1.367 sec
testWriterTask(org.apache.streams.local.tasks.BasicTasksTest)  Time elapsed: 15.016 sec
testProcessorTask(org.apache.streams.local.tasks.BasicTasksTest)  Time elapsed: 5.028 sec
testBranching(org.apache.streams.local.tasks.BasicTasksTest)  Time elapsed: 5.42 sec
testProviderTask(org.apache.streams.local.tasks.BasicTasksTest)  Time elapsed: 5.018 sec
testBranchingSerialization(org.apache.streams.local.tasks.BasicTasksTest)  Time elapsed: 5.004
sec
Running org.apache.streams.local.tasks.StreamsProviderTaskTest
2110 [pool-2-thread-1] ERROR o.a.s.l.tasks.StreamsProviderTask - Caught Throwable in Provider
StreamsProvider$$EnhancerByMockitoWithCGLIB$$fc74ac26 
java.lang.RuntimeException: null
	at org.apache.streams.local.tasks.StreamsProviderTask.run(StreamsProviderTask.java:159)
	at java.util.concurrent.Executors$RunnableAdapter.call(Executors.java:511)
	at java.util.concurrent.FutureTask.run(FutureTask.java:266)
	at java.util.concurrent.ThreadPoolExecutor.runWorker(ThreadPoolExecutor.java:1142)
	at java.util.concurrent.ThreadPoolExecutor$Worker.run(ThreadPoolExecutor.java:617)
	at java.lang.Thread.run(Thread.java:748)
Tests run: 5, Failures: 0, Errors: 0, Skipped: 0, Time elapsed: 3.807 sec - in org.apache.streams.local.tasks.StreamsProviderTaskTest
flushes(org.apache.streams.local.tasks.StreamsProviderTaskTest)  Time elapsed: 2.405 sec
earlyException(org.apache.streams.local.tasks.StreamsProviderTaskTest)  Time elapsed: 0.114
sec
runPerpetual(org.apache.streams.local.tasks.StreamsProviderTaskTest)  Time elapsed: 1.07 sec
runNonPerpetual(org.apache.streams.local.tasks.StreamsProviderTaskTest)  Time elapsed: 0.014
sec
stoppable(org.apache.streams.local.tasks.StreamsProviderTaskTest)  Time elapsed: 0.203 sec
Running org.apache.streams.local.builders.LocalStreamBuilderTest
Running org.apache.streams.local.queues.ThroughputQueueSingleThreadTest
Tests run: 13, Failures: 0, Errors: 0, Skipped: 0, Time elapsed: 7.475 sec - in org.apache.streams.local.queues.ThroughputQueueSingleThreadTest
testMBeanRegistration(org.apache.streams.local.queues.ThroughputQueueSingleThreadTest)  Time
elapsed: 1.324 sec
testMultipleMBeanRegistrations(org.apache.streams.local.queues.ThroughputQueueSingleThreadTest)
 Time elapsed: 0.037 sec
testAddAndRemove {#0 seed=[89D4DA30C9F34084:EA28DB738B2F77B0]}(org.apache.streams.local.queues.ThroughputQueueSingleThreadTest)
 Time elapsed: 0.133 sec
testAddAndRemove {#1 seed=[89D4DA30C9F34084:5E7E678FBFEDBC9C]}(org.apache.streams.local.queues.ThroughputQueueSingleThreadTest)
 Time elapsed: 0.121 sec
testAddAndRemove {#2 seed=[89D4DA30C9F34084:D097F153EE29F457]}(org.apache.streams.local.queues.ThroughputQueueSingleThreadTest)
 Time elapsed: 0.104 sec
testTakeAndPut {#0 seed=[89D4DA30C9F34084:26BCA22EA1A7D005]}(org.apache.streams.local.queues.ThroughputQueueSingleThreadTest)
 Time elapsed: 0.108 sec
testTakeAndPut {#1 seed=[89D4DA30C9F34084:92EA1ED295651B29]}(org.apache.streams.local.queues.ThroughputQueueSingleThreadTest)
 Time elapsed: 0.11 sec
testTakeAndPut {#2 seed=[89D4DA30C9F34084:1C03880EC4A153E2]}(org.apache.streams.local.queues.ThroughputQueueSingleThreadTest)
 Time elapsed: 0.106 sec
testThroughput(org.apache.streams.local.queues.ThroughputQueueSingleThreadTest)  Time elapsed:
2.005 sec
testWait(org.apache.streams.local.queues.ThroughputQueueSingleThreadTest)  Time elapsed: 3.008
sec
testOfferAndPoll {#0 seed=[89D4DA30C9F34084:6D02A1235C15A13C]}(org.apache.streams.local.queues.ThroughputQueueSingleThreadTest)
 Time elapsed: 0.106 sec
testOfferAndPoll {#1 seed=[89D4DA30C9F34084:D9541DDF68D76A10]}(org.apache.streams.local.queues.ThroughputQueueSingleThreadTest)
 Time elapsed: 0.104 sec
testOfferAndPoll {#2 seed=[89D4DA30C9F34084:57BD8B03391322DB]}(org.apache.streams.local.queues.ThroughputQueueSingleThreadTest)
 Time elapsed: 0.105 sec
Running org.apache.streams.local.queues.ThroughputQueueMultiThreadTest
3260 [pool-2-thread-6] ERROR o.a.s.l.q.ThroughputQueueMultiThreadTest - PUT DATA interupted
! 
3261 [pool-2-thread-4] ERROR o.a.s.l.q.ThroughputQueueMultiThreadTest - PUT DATA interupted
! 
3261 [pool-2-thread-8] ERROR o.a.s.l.q.ThroughputQueueMultiThreadTest - PUT DATA interupted
! 
3260 [pool-2-thread-2] ERROR o.a.s.l.q.ThroughputQueueMultiThreadTest - PUT DATA interupted
! 
16155 [pool-3-thread-4] ERROR o.a.s.l.q.ThroughputQueueMultiThreadTest - PUT DATA interupted
! 
16155 [pool-3-thread-6] ERROR o.a.s.l.q.ThroughputQueueMultiThreadTest - PUT DATA interupted
! 
16155 [pool-3-thread-8] ERROR o.a.s.l.q.ThroughputQueueMultiThreadTest - PUT DATA interupted
! 
16155 [pool-3-thread-12] ERROR o.a.s.l.q.ThroughputQueueMultiThreadTest - PUT DATA interupted
! 
16155 [pool-3-thread-10] ERROR o.a.s.l.q.ThroughputQueueMultiThreadTest - PUT DATA interupted
! 
16155 [pool-3-thread-2] ERROR o.a.s.l.q.ThroughputQueueMultiThreadTest - PUT DATA interupted
! 
16156 [pool-3-thread-14] ERROR o.a.s.l.q.ThroughputQueueMultiThreadTest - PUT DATA interupted
! 

Results :

Tests run: 49, Failures: 0, Errors: 0, Skipped: 0

[JENKINS] Recording test results
Waiting for Jenkins to finish collecting data
[ERROR] Failed to execute goal org.apache.maven.plugins:maven-surefire-plugin:2.19.1:test
(default-test) on project streams-runtime-local: ExecutionException The forked VM terminated
without properly saying goodbye. VM crash or System.exit called?
[ERROR] Command was /bin/sh -c cd <https://builds.apache.org/job/streams-project/ws/streams-runtimes/streams-runtime-local>
&& /usr/local/asfpackages/java/jdk1.8.0_131/jre/bin/java -jar <https://builds.apache.org/job/streams-project/ws/streams-runtimes/streams-runtime-local/target/surefire/surefirebooter4594730820038513879.jar>
<https://builds.apache.org/job/streams-project/ws/streams-runtimes/streams-runtime-local/target/surefire/surefire1292025810081669246tmp>
<https://builds.apache.org/job/streams-project/ws/streams-runtimes/streams-runtime-local/target/surefire/surefire_24832122847199891984tmp>
[ERROR] -> [Help 1]
[ERROR] 
[ERROR] To see the full stack trace of the errors, re-run Maven with the -e switch.
[ERROR] Re-run Maven using the -X switch to enable full debug logging.
[ERROR] 
[ERROR] For more information about the errors and possible solutions, please read the following
articles:
[ERROR] [Help 1] http://cwiki.apache.org/confluence/display/MAVEN/MojoFailureException
[ERROR] 
[ERROR] After correcting the problems, you can resume the build with the command
[ERROR]   mvn <goals> -rf :streams-runtime-local
[JENKINS] Archiving <https://builds.apache.org/job/streams-project/ws/streams-components/streams-filters/pom.xml>
to org.apache.streams/streams-filters/0.5.1-incubating-SNAPSHOT/streams-filters-0.5.1-incubating-SNAPSHOT.pom
[JENKINS] Archiving <https://builds.apache.org/job/streams-project/ws/streams-schemas/streams-schema-activitystreams2/pom.xml>
to org.apache.streams/streams-schema-activitystreams2/0.5.1-incubating-SNAPSHOT/streams-schema-activitystreams2-0.5.1-incubating-SNAPSHOT.pom
[JENKINS] Archiving <https://builds.apache.org/job/streams-project/ws/streams-core/pom.xml>
to org.apache.streams/streams-core/0.5.1-incubating-SNAPSHOT/streams-core-0.5.1-incubating-SNAPSHOT.pom
[JENKINS] Archiving <https://builds.apache.org/job/streams-project/ws/streams-core/target/streams-core-0.5.1-incubating-SNAPSHOT.jar>
to org.apache.streams/streams-core/0.5.1-incubating-SNAPSHOT/streams-core-0.5.1-incubating-SNAPSHOT.jar
[JENKINS] Archiving <https://builds.apache.org/job/streams-project/ws/streams-contrib/streams-processor-regex/pom.xml>
to org.apache.streams/streams-processor-regex/0.5.1-incubating-SNAPSHOT/streams-processor-regex-0.5.1-incubating-SNAPSHOT.pom
[JENKINS] Archiving <https://builds.apache.org/job/streams-project/ws/streams-runtimes/pom.xml>
to org.apache.streams/streams-runtimes/0.5.1-incubating-SNAPSHOT/streams-runtimes-0.5.1-incubating-SNAPSHOT.pom
[JENKINS] Archiving <https://builds.apache.org/job/streams-project/ws/streams-contrib/streams-persist-filebuffer/pom.xml>
to org.apache.streams/streams-persist-filebuffer/0.5.1-incubating-SNAPSHOT/streams-persist-filebuffer-0.5.1-incubating-SNAPSHOT.pom
[JENKINS] Archiving <https://builds.apache.org/job/streams-project/ws/streams-plugins/streams-plugin-hive/pom.xml>
to org.apache.streams.plugins/streams-plugin-hive/0.5.1-incubating-SNAPSHOT/streams-plugin-hive-0.5.1-incubating-SNAPSHOT.pom
[JENKINS] Archiving <https://builds.apache.org/job/streams-project/ws/streams-components/streams-converters/pom.xml>
to org.apache.streams/streams-converters/0.5.1-incubating-SNAPSHOT/streams-converters-0.5.1-incubating-SNAPSHOT.pom
[JENKINS] Archiving <https://builds.apache.org/job/streams-project/ws/streams-contrib/streams-persist-console/pom.xml>
to org.apache.streams/streams-persist-console/0.5.1-incubating-SNAPSHOT/streams-persist-console-0.5.1-incubating-SNAPSHOT.pom
[JENKINS] Archiving <https://builds.apache.org/job/streams-project/ws/streams-contrib/pom.xml>
to org.apache.streams/streams-contrib/0.5.1-incubating-SNAPSHOT/streams-contrib-0.5.1-incubating-SNAPSHOT.pom
[JENKINS] Archiving <https://builds.apache.org/job/streams-project/ws/streams-contrib/streams-amazon-aws/pom.xml>
to org.apache.streams/streams-amazon-aws/0.5.1-incubating-SNAPSHOT/streams-amazon-aws-0.5.1-incubating-SNAPSHOT.pom
[JENKINS] Archiving <https://builds.apache.org/job/streams-project/ws/streams-contrib/streams-processor-json/pom.xml>
to org.apache.streams/streams-processor-json/0.5.1-incubating-SNAPSHOT/streams-processor-json-0.5.1-incubating-SNAPSHOT.pom
[JENKINS] Archiving <https://builds.apache.org/job/streams-project/ws/streams-plugins/streams-plugin-pig/pom.xml>
to org.apache.streams.plugins/streams-plugin-pig/0.5.1-incubating-SNAPSHOT/streams-plugin-pig-0.5.1-incubating-SNAPSHOT.pom
[JENKINS] Archiving <https://builds.apache.org/job/streams-project/ws/streams-contrib/streams-persist-neo4j/pom.xml>
to org.apache.streams/streams-persist-neo4j/0.5.1-incubating-SNAPSHOT/streams-persist-neo4j-0.5.1-incubating-SNAPSHOT.pom
[JENKINS] Archiving <https://builds.apache.org/job/streams-project/ws/streams-contrib/streams-processor-peoplepattern/pom.xml>
to org.apache.streams/streams-processor-peoplepattern/0.5.1-incubating-SNAPSHOT/streams-processor-peoplepattern-0.5.1-incubating-SNAPSHOT.pom
[JENKINS] Archiving <https://builds.apache.org/job/streams-project/ws/streams-contrib/streams-provider-rss/pom.xml>
to org.apache.streams/streams-provider-rss/0.5.1-incubating-SNAPSHOT/streams-provider-rss-0.5.1-incubating-SNAPSHOT.pom
[JENKINS] Archiving <https://builds.apache.org/job/streams-project/ws/streams-plugins/streams-plugin-hbase/pom.xml>
to org.apache.streams.plugins/streams-plugin-hbase/0.5.1-incubating-SNAPSHOT/streams-plugin-hbase-0.5.1-incubating-SNAPSHOT.pom
[JENKINS] Archiving <https://builds.apache.org/job/streams-project/ws/streams-components/streams-http/pom.xml>
to org.apache.streams/streams-http/0.5.1-incubating-SNAPSHOT/streams-http-0.5.1-incubating-SNAPSHOT.pom
[JENKINS] Archiving <https://builds.apache.org/job/streams-project/ws/streams-plugins/streams-plugin-pojo/pom.xml>
to org.apache.streams.plugins/streams-plugin-pojo/0.5.1-incubating-SNAPSHOT/streams-plugin-pojo-0.5.1-incubating-SNAPSHOT.pom
[JENKINS] Archiving <https://builds.apache.org/job/streams-project/ws/streams-plugins/streams-plugin-pojo/target/streams-plugin-pojo-0.5.1-incubating-SNAPSHOT.jar>
to org.apache.streams.plugins/streams-plugin-pojo/0.5.1-incubating-SNAPSHOT/streams-plugin-pojo-0.5.1-incubating-SNAPSHOT.jar
[JENKINS] Archiving <https://builds.apache.org/job/streams-project/ws/streams-pojo/pom.xml>
to org.apache.streams/streams-pojo/0.5.1-incubating-SNAPSHOT/streams-pojo-0.5.1-incubating-SNAPSHOT.pom
[JENKINS] Archiving <https://builds.apache.org/job/streams-project/ws/streams-pojo/target/streams-pojo-0.5.1-incubating-SNAPSHOT.jar>
to org.apache.streams/streams-pojo/0.5.1-incubating-SNAPSHOT/streams-pojo-0.5.1-incubating-SNAPSHOT.jar
[JENKINS] Archiving <https://builds.apache.org/job/streams-project/ws/streams-pojo/target/streams-pojo-0.5.1-incubating-SNAPSHOT-tests.jar>
to org.apache.streams/streams-pojo/0.5.1-incubating-SNAPSHOT/streams-pojo-0.5.1-incubating-SNAPSHOT-tests.jar
[JENKINS] Archiving <https://builds.apache.org/job/streams-project/ws/streams-contrib/streams-amazon-aws/streams-persist-kinesis/pom.xml>
to org.apache.streams/streams-persist-kinesis/0.5.1-incubating-SNAPSHOT/streams-persist-kinesis-0.5.1-incubating-SNAPSHOT.pom
[JENKINS] Archiving <https://builds.apache.org/job/streams-project/ws/streams-plugins/streams-plugin-scala/pom.xml>
to org.apache.streams.plugins/streams-plugin-scala/0.5.1-incubating-SNAPSHOT/streams-plugin-scala-0.5.1-incubating-SNAPSHOT.pom
[JENKINS] Archiving <https://builds.apache.org/job/streams-project/ws/streams-contrib/streams-processor-urls/pom.xml>
to org.apache.streams/streams-processor-urls/0.5.1-incubating-SNAPSHOT/streams-processor-urls-0.5.1-incubating-SNAPSHOT.pom
[JENKINS] Archiving <https://builds.apache.org/job/streams-project/ws/streams-contrib/streams-provider-google/google-gmail/pom.xml>
to org.apache.streams/streams-provider-google-gmail/0.5.1-incubating-SNAPSHOT/streams-provider-google-gmail-0.5.1-incubating-SNAPSHOT.pom
[JENKINS] Archiving <https://builds.apache.org/job/streams-project/ws/streams-plugins/streams-plugin-elasticsearch/pom.xml>
to org.apache.streams.plugins/streams-plugin-elasticsearch/0.5.1-incubating-SNAPSHOT/streams-plugin-elasticsearch-0.5.1-incubating-SNAPSHOT.pom
[JENKINS] Archiving <https://builds.apache.org/job/streams-project/ws/streams-runtimes/streams-runtime-dropwizard/pom.xml>
to org.apache.streams/streams-runtime-dropwizard/0.5.1-incubating-SNAPSHOT/streams-runtime-dropwizard-0.5.1-incubating-SNAPSHOT.pom
[JENKINS] Archiving <https://builds.apache.org/job/streams-project/ws/streams-contrib/streams-provider-google/pom.xml>
to org.apache.streams/streams-provider-google/0.5.1-incubating-SNAPSHOT/streams-provider-google-0.5.1-incubating-SNAPSHOT.pom
[JENKINS] Archiving <https://builds.apache.org/job/streams-project/ws/streams-pojo-extensions/pom.xml>
to org.apache.streams/streams-pojo-extensions/0.5.1-incubating-SNAPSHOT/streams-pojo-extensions-0.5.1-incubating-SNAPSHOT.pom
[JENKINS] Archiving <https://builds.apache.org/job/streams-project/ws/streams-contrib/streams-processor-jackson/pom.xml>
to org.apache.streams/streams-processor-jackson/0.5.1-incubating-SNAPSHOT/streams-processor-jackson-0.5.1-incubating-SNAPSHOT.pom
[JENKINS] Archiving <https://builds.apache.org/job/streams-project/ws/streams-components/pom.xml>
to org.apache.streams/streams-components/0.5.1-incubating-SNAPSHOT/streams-components-0.5.1-incubating-SNAPSHOT.pom
[JENKINS] Archiving <https://builds.apache.org/job/streams-project/ws/streams-schemas/streams-schema-activitystreams/pom.xml>
to org.apache.streams/streams-schema-activitystreams/0.5.1-incubating-SNAPSHOT/streams-schema-activitystreams-0.5.1-incubating-SNAPSHOT.pom
[JENKINS] Archiving <https://builds.apache.org/job/streams-project/ws/streams-schemas/streams-schema-activitystreams/target/streams-schema-activitystreams-0.5.1-incubating-SNAPSHOT.jar>
to org.apache.streams/streams-schema-activitystreams/0.5.1-incubating-SNAPSHOT/streams-schema-activitystreams-0.5.1-incubating-SNAPSHOT.jar
[JENKINS] Archiving <https://builds.apache.org/job/streams-project/ws/streams-schemas/streams-schema-activitystreams/target/streams-schema-activitystreams-0.5.1-incubating-SNAPSHOT-tests.jar>
to org.apache.streams/streams-schema-activitystreams/0.5.1-incubating-SNAPSHOT/streams-schema-activitystreams-0.5.1-incubating-SNAPSHOT-tests.jar
[JENKINS] Archiving <https://builds.apache.org/job/streams-project/ws/streams-contrib/streams-provider-sysomos/pom.xml>
to org.apache.streams/streams-provider-sysomos/0.5.1-incubating-SNAPSHOT/streams-provider-sysomos-0.5.1-incubating-SNAPSHOT.pom
[JENKINS] Archiving <https://builds.apache.org/job/streams-project/ws/streams-contrib/streams-provider-youtube/pom.xml>
to org.apache.streams/streams-provider-youtube/0.5.1-incubating-SNAPSHOT/streams-provider-youtube-0.5.1-incubating-SNAPSHOT.pom
[JENKINS] Archiving <https://builds.apache.org/job/streams-project/ws/streams-schemas/pom.xml>
to org.apache.streams/streams-schemas/0.5.1-incubating-SNAPSHOT/streams-schemas-0.5.1-incubating-SNAPSHOT.pom
[JENKINS] Archiving <https://builds.apache.org/job/streams-project/ws/streams-contrib/streams-provider-facebook/pom.xml>
to org.apache.streams/streams-provider-facebook/0.5.1-incubating-SNAPSHOT/streams-provider-facebook-0.5.1-incubating-SNAPSHOT.pom
[JENKINS] Archiving <https://builds.apache.org/job/streams-project/ws/streams-contrib/streams-persist-cassandra/pom.xml>
to org.apache.streams/streams-persist-cassandra/0.5.1-incubating-SNAPSHOT/streams-persist-cassandra-0.5.1-incubating-SNAPSHOT.pom
[JENKINS] Archiving <https://builds.apache.org/job/streams-project/ws/streams-contrib/streams-persist-cassandra/target/streams-persist-cassandra-0.5.1-incubating-SNAPSHOT.jar>
to org.apache.streams/streams-persist-cassandra/0.5.1-incubating-SNAPSHOT/streams-persist-cassandra-0.5.1-incubating-SNAPSHOT.jar
[JENKINS] Archiving <https://builds.apache.org/job/streams-project/ws/streams-contrib/streams-persist-cassandra/target/streams-persist-cassandra-0.5.1-incubating-SNAPSHOT-tests.jar>
to org.apache.streams/streams-persist-cassandra/0.5.1-incubating-SNAPSHOT/streams-persist-cassandra-0.5.1-incubating-SNAPSHOT-tests.jar
[JENKINS] Archiving <https://builds.apache.org/job/streams-project/ws/streams-contrib/streams-persist-elasticsearch/pom.xml>
to org.apache.streams/streams-persist-elasticsearch/0.5.1-incubating-SNAPSHOT/streams-persist-elasticsearch-0.5.1-incubating-SNAPSHOT.pom
[JENKINS] Archiving <https://builds.apache.org/job/streams-project/ws/streams-contrib/streams-provider-google/google-gplus/pom.xml>
to org.apache.streams/streams-provider-google-gplus/0.5.1-incubating-SNAPSHOT/streams-provider-google-gplus-0.5.1-incubating-SNAPSHOT.pom
[JENKINS] Archiving <https://builds.apache.org/job/streams-project/ws/streams-config/pom.xml>
to org.apache.streams/streams-config/0.5.1-incubating-SNAPSHOT/streams-config-0.5.1-incubating-SNAPSHOT.pom
[JENKINS] Archiving <https://builds.apache.org/job/streams-project/ws/streams-config/target/streams-config-0.5.1-incubating-SNAPSHOT.jar>
to org.apache.streams/streams-config/0.5.1-incubating-SNAPSHOT/streams-config-0.5.1-incubating-SNAPSHOT.jar
[JENKINS] Archiving <https://builds.apache.org/job/streams-project/ws/streams-util/pom.xml>
to org.apache.streams/streams-util/0.5.1-incubating-SNAPSHOT/streams-util-0.5.1-incubating-SNAPSHOT.pom
[JENKINS] Archiving <https://builds.apache.org/job/streams-project/ws/streams-util/target/streams-util-0.5.1-incubating-SNAPSHOT.jar>
to org.apache.streams/streams-util/0.5.1-incubating-SNAPSHOT/streams-util-0.5.1-incubating-SNAPSHOT.jar
[JENKINS] Archiving <https://builds.apache.org/job/streams-project/ws/streams-util/target/streams-util-0.5.1-incubating-SNAPSHOT-tests.jar>
to org.apache.streams/streams-util/0.5.1-incubating-SNAPSHOT/streams-util-0.5.1-incubating-SNAPSHOT-tests.jar
[JENKINS] Archiving <https://builds.apache.org/job/streams-project/ws/streams-contrib/streams-persist-hdfs/pom.xml>
to org.apache.streams/streams-persist-hdfs/0.5.1-incubating-SNAPSHOT/streams-persist-hdfs-0.5.1-incubating-SNAPSHOT.pom
[JENKINS] Archiving <https://builds.apache.org/job/streams-project/ws/streams-plugins/pom.xml>
to org.apache.streams.plugins/streams-plugins/0.5.1-incubating-SNAPSHOT/streams-plugins-0.5.1-incubating-SNAPSHOT.pom
[JENKINS] Archiving <https://builds.apache.org/job/streams-project/ws/pom.xml> to org.apache.streams/streams-project/0.5.1-incubating-SNAPSHOT/streams-project-0.5.1-incubating-SNAPSHOT.pom
[JENKINS] Archiving <https://builds.apache.org/job/streams-project/ws/target/streams-project-0.5.1-incubating-SNAPSHOT-site.xml>
to org.apache.streams/streams-project/0.5.1-incubating-SNAPSHOT/streams-project-0.5.1-incubating-SNAPSHOT-site.xml
Compressed 67.87 KB of artifacts by 94.3% relative to #378
[JENKINS] Archiving <https://builds.apache.org/job/streams-project/ws/streams-contrib/streams-provider-twitter/pom.xml>
to org.apache.streams/streams-provider-twitter/0.5.1-incubating-SNAPSHOT/streams-provider-twitter-0.5.1-incubating-SNAPSHOT.pom
[JENKINS] Archiving <https://builds.apache.org/job/streams-project/ws/streams-contrib/streams-amazon-aws/streams-persist-s3/pom.xml>
to org.apache.streams/streams-persist-s3/0.5.1-incubating-SNAPSHOT/streams-persist-s3-0.5.1-incubating-SNAPSHOT.pom
[JENKINS] Archiving <https://builds.apache.org/job/streams-project/ws/streams-verbs/pom.xml>
to org.apache.streams/streams-verbs/0.5.1-incubating-SNAPSHOT/streams-verbs-0.5.1-incubating-SNAPSHOT.pom
[JENKINS] Archiving <https://builds.apache.org/job/streams-project/ws/streams-contrib/streams-provider-instagram/pom.xml>
to org.apache.streams/streams-provider-instagram/0.5.1-incubating-SNAPSHOT/streams-provider-instagram-0.5.1-incubating-SNAPSHOT.pom
[JENKINS] Archiving <https://builds.apache.org/job/streams-project/ws/streams-contrib/streams-persist-kafka/pom.xml>
to org.apache.streams/streams-persist-kafka/0.5.1-incubating-SNAPSHOT/streams-persist-kafka-0.5.1-incubating-SNAPSHOT.pom
[JENKINS] Archiving <https://builds.apache.org/job/streams-project/ws/streams-contrib/streams-provider-moreover/pom.xml>
to org.apache.streams/streams-provider-moreover/0.5.1-incubating-SNAPSHOT/streams-provider-moreover-0.5.1-incubating-SNAPSHOT.pom
[JENKINS] Archiving <https://builds.apache.org/job/streams-project/ws/streams-monitoring/pom.xml>
to org.apache.streams/streams-monitoring/0.5.1-incubating-SNAPSHOT/streams-monitoring-0.5.1-incubating-SNAPSHOT.pom
[JENKINS] Archiving <https://builds.apache.org/job/streams-project/ws/streams-monitoring/target/streams-monitoring-0.5.1-incubating-SNAPSHOT.jar>
to org.apache.streams/streams-monitoring/0.5.1-incubating-SNAPSHOT/streams-monitoring-0.5.1-incubating-SNAPSHOT.jar
[JENKINS] Archiving <https://builds.apache.org/job/streams-project/ws/streams-contrib/streams-persist-graph/pom.xml>
to org.apache.streams/streams-persist-graph/0.5.1-incubating-SNAPSHOT/streams-persist-graph-0.5.1-incubating-SNAPSHOT.pom
[JENKINS] Archiving <https://builds.apache.org/job/streams-project/ws/streams-contrib/streams-persist-riak/pom.xml>
to org.apache.streams/streams-persist-riak/0.5.1-incubating-SNAPSHOT/streams-persist-riak-0.5.1-incubating-SNAPSHOT.pom
[JENKINS] Archiving <https://builds.apache.org/job/streams-project/ws/streams-testing/pom.xml>
to org.apache.streams/streams-testing/0.5.1-incubating-SNAPSHOT/streams-testing-0.5.1-incubating-SNAPSHOT.pom
[JENKINS] Archiving <https://builds.apache.org/job/streams-project/ws/streams-testing/target/streams-testing-0.5.1-incubating-SNAPSHOT.jar>
to org.apache.streams/streams-testing/0.5.1-incubating-SNAPSHOT/streams-testing-0.5.1-incubating-SNAPSHOT.jar
[JENKINS] Archiving <https://builds.apache.org/job/streams-project/ws/streams-testing/target/streams-testing-0.5.1-incubating-SNAPSHOT-tests.jar>
to org.apache.streams/streams-testing/0.5.1-incubating-SNAPSHOT/streams-testing-0.5.1-incubating-SNAPSHOT-tests.jar
[JENKINS] Archiving <https://builds.apache.org/job/streams-project/ws/streams-contrib/streams-persist-hbase/pom.xml>
to org.apache.streams/streams-persist-hbase/0.5.1-incubating-SNAPSHOT/streams-persist-hbase-0.5.1-incubating-SNAPSHOT.pom
[JENKINS] Archiving <https://builds.apache.org/job/streams-project/ws/streams-contrib/streams-persist-mongo/pom.xml>
to org.apache.streams/streams-persist-mongo/0.5.1-incubating-SNAPSHOT/streams-persist-mongo-0.5.1-incubating-SNAPSHOT.pom
[JENKINS] Archiving <https://builds.apache.org/job/streams-project/ws/streams-plugins/streams-plugin-cassandra/pom.xml>
to org.apache.streams.plugins/streams-plugin-cassandra/0.5.1-incubating-SNAPSHOT/streams-plugin-cassandra-0.5.1-incubating-SNAPSHOT.pom
[JENKINS] Archiving <https://builds.apache.org/job/streams-project/ws/streams-runtimes/streams-runtime-local/pom.xml>
to org.apache.streams/streams-runtime-local/0.5.1-incubating-SNAPSHOT/streams-runtime-local-0.5.1-incubating-SNAPSHOT.pom
channel stopped

Mime
View raw message