streams-commits mailing list archives

Site index · List index
Message view « Date » · « Thread »
Top « Date » · « Thread »
From Apache Jenkins Server <jenk...@builds.apache.org>
Subject Build failed in Jenkins: streams-master #113
Date Thu, 15 Jun 2017 11:04:14 GMT
See <https://builds.apache.org/job/streams-master/113/display/redirect>

------------------------------------------
Started by an SCM change
[EnvInject] - Loading node environment variables.
Building remotely on H24 (ubuntu xenial) in workspace <https://builds.apache.org/job/streams-master/ws/>
Wiping out workspace first.
Cloning the remote Git repository
Cloning repository https://git-wip-us.apache.org/repos/asf/incubator-streams-master.git
 > git init <https://builds.apache.org/job/streams-master/ws/> # timeout=10
Fetching upstream changes from https://git-wip-us.apache.org/repos/asf/incubator-streams-master.git
 > git --version # timeout=10
 > git fetch --tags --progress https://git-wip-us.apache.org/repos/asf/incubator-streams-master.git
+refs/heads/*:refs/remotes/origin/*
 > git config remote.origin.url https://git-wip-us.apache.org/repos/asf/incubator-streams-master.git
# timeout=10
 > git config --add remote.origin.fetch +refs/heads/*:refs/remotes/origin/* # timeout=10
 > git config remote.origin.url https://git-wip-us.apache.org/repos/asf/incubator-streams-master.git
# timeout=10
Cleaning workspace
 > git rev-parse --verify HEAD # timeout=10
No valid HEAD. Skipping the resetting
 > git clean -fdx # timeout=10
Fetching upstream changes from https://git-wip-us.apache.org/repos/asf/incubator-streams-master.git
 > git fetch --tags --progress https://git-wip-us.apache.org/repos/asf/incubator-streams-master.git
+refs/heads/*:refs/remotes/origin/*
Seen branch in repository origin/master
Seen 1 remote branch
 > git tag -l # timeout=10
 > git rev-parse refs/tags/streams-master-0.4.1-incubating^{commit} # timeout=10
 > git rev-parse refs/tags/streams-master-0.3-incubating^{commit} # timeout=10
 > git rev-parse refs/tags/streams-master-0.4-incubating^{commit} # timeout=10
 > git rev-parse refs/tags/streams-master-0.3-incubating-rc1^{commit} # timeout=10
Multiple candidate revisions
Scheduling another build to catch up with streams-master
Checking out Revision 2ff58c4a3fcf4c6193ab434cdb85a1299f3d08ab (refs/tags/streams-master-0.3-incubating-rc1)
 > git config core.sparsecheckout # timeout=10
 > git checkout -f 2ff58c4a3fcf4c6193ab434cdb85a1299f3d08ab
First time build. Skipping changelog.
Parsing POMs
using settings config with name simple-deploy-settings-no-mirror
Replacing all maven server entries not found in credentials list is true
Established TCP socket on 44782
maven33-agent.jar already up to date
maven33-interceptor.jar already up to date
maven3-interceptor-commons.jar already up to date
[streams-master] $ /home/jenkins/tools/java/latest1.8/bin/java -Xmx2g -Xms256m -XX:MaxPermSize=512m
-Dfile.encoding=UTF-8 -cp /home/jenkins/jenkins-slave/maven33-agent.jar:/home/jenkins/tools/maven/apache-maven-3.3.9/boot/plexus-classworlds-2.5.2.jar:/home/jenkins/tools/maven/apache-maven-3.3.9/conf/logging
jenkins.maven3.agent.Maven33Main /home/jenkins/tools/maven/apache-maven-3.3.9 /home/jenkins/jenkins-slave/slave.jar
/home/jenkins/jenkins-slave/maven33-interceptor.jar /home/jenkins/jenkins-slave/maven3-interceptor-commons.jar
44782
Java HotSpot(TM) 64-Bit Server VM warning: ignoring option MaxPermSize=512m; support was removed
in 8.0
<===[JENKINS REMOTING CAPACITY]===>   channel started
using settings config with name simple-deploy-settings-no-mirror
Replacing all maven server entries not found in credentials list is true
Executing Maven:  -B -f <https://builds.apache.org/job/streams-master/ws/pom.xml> -Dmaven.repo.local=/home/jenkins/jenkins-slave/maven-repositories/0
-s /tmp/settings3346566574089908392.xml -U site:attach-descriptor clean install verify
[INFO] Scanning for projects...
[INFO]                                                                         
[INFO] ------------------------------------------------------------------------
[INFO] Building Apache Streams :: streams-master 0.3-incubating
[INFO] ------------------------------------------------------------------------
[INFO] 
[INFO] --- maven-site-plugin:3.5:attach-descriptor (default-cli) @ streams-master ---
[INFO] 
[INFO] --- maven-clean-plugin:2.6:clean (default-clean) @ streams-master ---
[INFO] Deleting <https://builds.apache.org/job/streams-master/ws/target>
[INFO] 
[INFO] --- maven-remote-resources-plugin:1.4:process (default) @ streams-master ---
[INFO] Downloading: https://repository.apache.org/content/repositories/releases/org/apache/apache-incubator-disclaimer-resource-bundle/1.1/apache-incubator-disclaimer-resource-bundle-1.1.jar
[INFO] Downloading: https://repo.maven.apache.org/maven2/org/apache/apache-incubator-disclaimer-resource-bundle/1.1/apache-incubator-disclaimer-resource-bundle-1.1.jar
[INFO] Downloaded: https://repo.maven.apache.org/maven2/org/apache/apache-incubator-disclaimer-resource-bundle/1.1/apache-incubator-disclaimer-resource-bundle-1.1.jar
(0 B at 0.0 KB/sec)
[INFO] 
[INFO] --- maven-site-plugin:3.5:attach-descriptor (attach-descriptor) @ streams-master ---
[INFO] 
[INFO] --- maven-install-plugin:2.5.2:install (default-install) @ streams-master ---
[INFO] Installing <https://builds.apache.org/job/streams-master/ws/pom.xml> to /home/jenkins/jenkins-slave/maven-repositories/0/org/apache/streams/streams-master/0.3-incubating/streams-master-0.3-incubating.pom
[INFO] Installing <https://builds.apache.org/job/streams-master/ws/target/streams-master-0.3-incubating-site_en.xml>
to /home/jenkins/jenkins-slave/maven-repositories/0/org/apache/streams/streams-master/0.3-incubating/streams-master-0.3-incubating-site_en.xml
[INFO] Installing <https://builds.apache.org/job/streams-master/ws/target/streams-master-0.3-incubating-site_en.xml>
to /home/jenkins/jenkins-slave/maven-repositories/0/org/apache/streams/streams-master/0.3-incubating/streams-master-0.3-incubating-site_en.xml
[INFO] 
[INFO] --- maven-remote-resources-plugin:1.4:process (default) @ streams-master ---
[INFO] 
[INFO] --- maven-site-plugin:3.5:attach-descriptor (attach-descriptor) @ streams-master ---
[INFO] ------------------------------------------------------------------------
[INFO] BUILD SUCCESS
[INFO] ------------------------------------------------------------------------
[INFO] Total time: 11.037 s
[INFO] Finished at: 2017-06-15T11:04:08+00:00
[INFO] Final Memory: 22M/284M
[INFO] ------------------------------------------------------------------------
Waiting for Jenkins to finish collecting data
[JENKINS] Archiving <https://builds.apache.org/job/streams-master/ws/pom.xml> to org.apache.streams/streams-master/0.3-incubating/streams-master-0.3-incubating.pom
[JENKINS] Archiving <https://builds.apache.org/job/streams-master/ws/target/streams-master-0.3-incubating-site_en.xml>
to org.apache.streams/streams-master/0.3-incubating/streams-master-0.3-incubating-site_en.xml
Compressed 57.45 KB of artifacts by 55.7% relative to #112
channel stopped
using settings config with name simple-deploy-settings-no-mirror
Replacing all maven server entries not found in credentials list is true
Maven RedeployPublisher use remote H24 maven settings from : /tmp/settings1017532487052854543.xml
[INFO] Deployment in https://repository.apache.org/content/repositories/snapshots (id=apache.snapshots.https,uniqueVersion=true)
Deploying the main artifact streams-master-0.3-incubating.pom
Uploading: https://repository.apache.org/content/repositories/snapshots/org/apache/streams/streams-master/0.3-incubating/streams-master-0.3-incubating.pom
ERROR: Failed to deploy artifacts: Could not transfer artifact org.apache.streams:streams-master:pom:0.3-incubating
from/to apache.snapshots.https (https://repository.apache.org/content/repositories/snapshots):
Failed to transfer file: https://repository.apache.org/content/repositories/snapshots/org/apache/streams/streams-master/0.3-incubating/streams-master-0.3-incubating.pom.
Return code is: 400, ReasonPhrase: Bad Request.
org.apache.maven.artifact.deployer.ArtifactDeploymentException: Failed to deploy artifacts:
Could not transfer artifact org.apache.streams:streams-master:pom:0.3-incubating from/to apache.snapshots.https
(https://repository.apache.org/content/repositories/snapshots): Failed to transfer file: https://repository.apache.org/content/repositories/snapshots/org/apache/streams/streams-master/0.3-incubating/streams-master-0.3-incubating.pom.
Return code is: 400, ReasonPhrase: Bad Request.
	at org.apache.maven.artifact.deployer.DefaultArtifactDeployer.deploy(DefaultArtifactDeployer.java:143)
	at hudson.maven.reporters.MavenArtifactRecord.deploy(MavenArtifactRecord.java:193)
	at hudson.maven.RedeployPublisher.perform(RedeployPublisher.java:176)
	at hudson.tasks.BuildStepMonitor$1.perform(BuildStepMonitor.java:20)
	at hudson.model.AbstractBuild$AbstractBuildExecution.perform(AbstractBuild.java:779)
	at hudson.model.AbstractBuild$AbstractBuildExecution.performAllBuildSteps(AbstractBuild.java:720)
	at hudson.maven.MavenModuleSetBuild$MavenModuleSetBuildExecution.post2(MavenModuleSetBuild.java:1072)
	at hudson.model.AbstractBuild$AbstractBuildExecution.post(AbstractBuild.java:665)
	at hudson.model.Run.execute(Run.java:1753)
	at hudson.maven.MavenModuleSetBuild.run(MavenModuleSetBuild.java:542)
	at hudson.model.ResourceController.execute(ResourceController.java:98)
	at hudson.model.Executor.run(Executor.java:405)
Caused by: org.eclipse.aether.deployment.DeploymentException: Failed to deploy artifacts:
Could not transfer artifact org.apache.streams:streams-master:pom:0.3-incubating from/to apache.snapshots.https
(https://repository.apache.org/content/repositories/snapshots): Failed to transfer file: https://repository.apache.org/content/repositories/snapshots/org/apache/streams/streams-master/0.3-incubating/streams-master-0.3-incubating.pom.
Return code is: 400, ReasonPhrase: Bad Request.
	at org.eclipse.aether.internal.impl.DefaultDeployer.deploy(DefaultDeployer.java:317)
	at org.eclipse.aether.internal.impl.DefaultDeployer.deploy(DefaultDeployer.java:245)
	at org.eclipse.aether.internal.impl.DefaultRepositorySystem.deploy(DefaultRepositorySystem.java:420)
	at org.apache.maven.artifact.deployer.DefaultArtifactDeployer.deploy(DefaultArtifactDeployer.java:139)
	... 11 more
Caused by: org.eclipse.aether.transfer.ArtifactTransferException: Could not transfer artifact
org.apache.streams:streams-master:pom:0.3-incubating from/to apache.snapshots.https (https://repository.apache.org/content/repositories/snapshots):
Failed to transfer file: https://repository.apache.org/content/repositories/snapshots/org/apache/streams/streams-master/0.3-incubating/streams-master-0.3-incubating.pom.
Return code is: 400, ReasonPhrase: Bad Request.
	at org.eclipse.aether.connector.basic.ArtifactTransportListener.transferFailed(ArtifactTransportListener.java:43)
	at org.eclipse.aether.connector.basic.BasicRepositoryConnector$TaskRunner.run(BasicRepositoryConnector.java:355)
	at org.eclipse.aether.connector.basic.BasicRepositoryConnector.put(BasicRepositoryConnector.java:274)
	at org.eclipse.aether.internal.impl.DefaultDeployer.deploy(DefaultDeployer.java:311)
	... 14 more
Caused by: org.apache.maven.wagon.TransferFailedException: Failed to transfer file: https://repository.apache.org/content/repositories/snapshots/org/apache/streams/streams-master/0.3-incubating/streams-master-0.3-incubating.pom.
Return code is: 400, ReasonPhrase: Bad Request.
	at org.apache.maven.wagon.providers.http.AbstractHttpClientWagon.put(AbstractHttpClientWagon.java:631)
	at org.apache.maven.wagon.providers.http.AbstractHttpClientWagon.put(AbstractHttpClientWagon.java:553)
	at org.apache.maven.wagon.providers.http.AbstractHttpClientWagon.put(AbstractHttpClientWagon.java:535)
	at org.apache.maven.wagon.providers.http.AbstractHttpClientWagon.put(AbstractHttpClientWagon.java:529)
	at org.apache.maven.wagon.providers.http.AbstractHttpClientWagon.put(AbstractHttpClientWagon.java:509)
	at org.eclipse.aether.transport.wagon.WagonTransporter$PutTaskRunner.run(WagonTransporter.java:644)
	at org.eclipse.aether.transport.wagon.WagonTransporter.execute(WagonTransporter.java:427)
	at org.eclipse.aether.transport.wagon.WagonTransporter.put(WagonTransporter.java:410)
	at org.eclipse.aether.connector.basic.BasicRepositoryConnector$PutTaskRunner.runTask(BasicRepositoryConnector.java:510)
	at org.eclipse.aether.connector.basic.BasicRepositoryConnector$TaskRunner.run(BasicRepositoryConnector.java:350)
	... 16 more
[INFO] Deployment failed after 0.75 sec
Build step 'Deploy artifacts to Maven repository' changed build result to FAILURE

Mime
View raw message