phoenix-dev mailing list archives

Site index · List index
Message view « Date » · « Thread »
Top « Date » · « Thread »
From "Lars Hofhansl (JIRA)" <j...@apache.org>
Subject [jira] [Updated] (PHOENIX-5323) UpgradeIT.testMapTableToNamespaceDuringUpgrade is flapping
Date Fri, 07 Jun 2019 20:03:01 GMT

     [ https://issues.apache.org/jira/browse/PHOENIX-5323?page=com.atlassian.jira.plugin.system.issuetabpanels:all-tabpanel
]

Lars Hofhansl updated PHOENIX-5323:
-----------------------------------
    Attachment: 5323.txt

> UpgradeIT.testMapTableToNamespaceDuringUpgrade is flapping
> ----------------------------------------------------------
>
>                 Key: PHOENIX-5323
>                 URL: https://issues.apache.org/jira/browse/PHOENIX-5323
>             Project: Phoenix
>          Issue Type: Test
>            Reporter: Lars Hofhansl
>            Priority: Major
>         Attachments: 5323.txt
>
>
> {quote}
> [ERROR] Tests run: 9, Failures: 1, Errors: 0, Skipped: 0, Time elapsed: 94.074 s <<<
FAILURE! - in org.apache.phoenix.end2end.UpgradeIT
> [ERROR] testMapTableToNamespaceDuringUpgrade(org.apache.phoenix.end2end.UpgradeIT)  Time
elapsed: 36.722 s  <<< FAILURE!
> java.lang.AssertionError: expected:<-9223372036854775805> but was:<-9223372036854774707>
> 	at org.apache.phoenix.end2end.UpgradeIT.testMapTableToNamespaceDuringUpgrade(UpgradeIT.java:189)
> {quote}



--
This message was sent by Atlassian JIRA
(v7.6.3#76005)

Mime
View raw message