phoenix-dev mailing list archives

Site index · List index
Message view « Date » · « Thread »
Top « Date » · « Thread »
From "Hudson (JIRA)" <j...@apache.org>
Subject [jira] [Commented] (PHOENIX-2560) PhoenixMetricsIT test failures
Date Mon, 04 Jan 2016 17:34:39 GMT

    [ https://issues.apache.org/jira/browse/PHOENIX-2560?page=com.atlassian.jira.plugin.system.issuetabpanels:comment-tabpanel&focusedCommentId=15081420#comment-15081420
] 

Hudson commented on PHOENIX-2560:
---------------------------------

SUCCESS: Integrated in Phoenix-master #1045 (See [https://builds.apache.org/job/Phoenix-master/1045/])
PHOENIX-2560 PhoenixMetricsIT test failures (jtaylor: rev 5c237dd8b2f9962ff45f10ee66c11a2697eb41f0)
* phoenix-core/src/main/java/org/apache/phoenix/query/ConnectionQueryServicesImpl.java
* phoenix-core/src/main/java/org/apache/phoenix/iterate/BaseResultIterators.java
* phoenix-core/src/main/java/org/apache/phoenix/compile/MutatingParallelIteratorFactory.java
* phoenix-core/src/main/java/org/apache/phoenix/iterate/MergeSortResultIterator.java


> PhoenixMetricsIT test failures
> ------------------------------
>
>                 Key: PHOENIX-2560
>                 URL: https://issues.apache.org/jira/browse/PHOENIX-2560
>             Project: Phoenix
>          Issue Type: Bug
>            Reporter: James Taylor
>             Fix For: 4.7.0
>
>         Attachments: PHOENIX-2560.patch
>
>
> My commit for PHOENIX-2558 seems to have broken a few metrics test. Any ideas, [~samarthjain]?
> {code}
> Running org.apache.phoenix.monitoring.PhoenixMetricsIT
> Tests run: 17, Failures: 2, Errors: 0, Skipped: 0, Time elapsed: 65.968 sec <<<
FAILURE! - in org.apache.phoenix.monitoring.PhoenixMetricsIT
> testMetricsForUpsertSelectWithAutoCommit(org.apache.phoenix.monitoring.PhoenixMetricsIT)
 Time elapsed: 3.772 sec  <<< FAILURE!
> java.lang.AssertionError: Unequal values for metric MUTATION_BYTES expected:<5600>
but was:<16240>
> 	at org.apache.phoenix.monitoring.PhoenixMetricsIT.assertMetricsHaveSameValues(PhoenixMetricsIT.java:654)
> 	at org.apache.phoenix.monitoring.PhoenixMetricsIT.assertMetricsAreSame(PhoenixMetricsIT.java:643)
> 	at org.apache.phoenix.monitoring.PhoenixMetricsIT.testMetricsForUpsertSelectWithAutoCommit(PhoenixMetricsIT.java:462)
> testMetricsForUpsertSelectSameTable(org.apache.phoenix.monitoring.PhoenixMetricsIT) 
Time elapsed: 2.878 sec  <<< FAILURE!
> java.lang.AssertionError: Unequal values for metric MUTATION_BYTES expected:<5600>
but was:<16240>
> 	at org.apache.phoenix.monitoring.PhoenixMetricsIT.assertMetricsHaveSameValues(PhoenixMetricsIT.java:654)
> 	at org.apache.phoenix.monitoring.PhoenixMetricsIT.assertMetricsAreSame(PhoenixMetricsIT.java:643)
> 	at org.apache.phoenix.monitoring.PhoenixMetricsIT.testMetricsForUpsertSelectSameTable(PhoenixMetricsIT.java:615)
> {code}



--
This message was sent by Atlassian JIRA
(v6.3.4#6332)

Mime
View raw message