openoffice-dev mailing list archives

Site index · List index
Message view « Date » · « Thread »
Top « Date » · « Thread »
From Patricia Shanahan <p...@acm.org>
Subject Re: failed to build aoo420 dev on win32
Date Tue, 05 Apr 2016 19:21:05 GMT
How are you specifying debug? Any differences between what you are doing 
and 
https://wiki.openoffice.org/wiki/Documentation/Building_Guide_AOO/Step_by_step#Windows_7.2C_Windows_8.1?

I have been doing Windows 8.1 debug builds without any problems. I 
manually 'make debug=true' the gmake components, and specify 
--enable-symbols and --enable-dbgutil in my configure parameters.

Patricia

On 4/5/2016 10:23 AM, Oliver Brinzing wrote:
> Hi,
>
> i started to build a debug version, but had 4 build breaks till now.
> What surprises me is that i used same build environment to build aoo412
> without trouble.
>
> any hints?
>
> Regards
> Oliver
>
> 1 Building module crashrep
>     *possible* solution: press "Ignore"
>
> 2 Errors in module connectivity:
>      compiling class template member function
> 'std::auto_ptr<_Ty>::~auto_ptr(void)' failed
>     *possible* solution ?
>      changed source file
> "main\connectivity\inc\connectivity\sqlparse.hxx" line 133
>      from: struct OSQLParser_Data;
>      to:     struct OSQLParser_Data { ~OSQLParser_Data() {}; };
>
> 3 [ build CXX ] formula/source/ui/dlg/formula
>     a problem wth precompiled headers
>    *possible* solution ?
>    C:\build_tmp\aoo_src\main\formula\
>    - Library_forui.mk
>       -> remove :$(eval $(call
> gb_Library_add_precompiled_header,forui,$(SRCDIR)/formula/inc/pch/precompiled_formula))
>
>    - Library_for.mk
>      -> remove: $(eval $(call
> gb_Library_add_precompiled_header,for,$(SRCDIR)/formula/inc/pch/precompiled_formula))
>
>
> 4 Entering /cygdrive/c/build_tmp/aoo_src/main/sc/source/filter/excel
>     fatal error C1083: Cannot open include file:
> 'filter/msfilter/mscodec.hxx': No such file or directory
>
>     the missing file is in: main\filter\inc\filter\msfilter
>     but how to add an -I statement to the makefile?
>
> 1-----------------------------------------------------------------
> Building module crashrep
> Entering /cygdrive/c/build_tmp/aoo_src/main/crashrep/source/all
> mkout -- version: 1.8
> Entering /cygdrive/c/build_tmp/aoo_src/main/crashrep/source/win32
> crashrep deliver
> Assertion Failed!
> Error: File C:/build_tmp/aoo_src/main/sal/osl/w32/process.cxx,
> Line 340 :(null)
> ( Yes=Abort / No=Ignore / Cancel=Debugger )
>
>
> 2---------------------------------------------------------------
>
> Errors in module connectivity:
> /cygdrive/c/build_tmp/aoo_src/main/connectivity/source/parse
> Compiling: connectivity/source/parse/sqliterator.cxx
> C:/PROGRA~2/MICROS~1.0/VC/bin/cl.exe  -Zm500 -Zc:wchar_t- -GR -GS -c
> -nologo -Gs  -Ob1 -Zi -Fd../../wntmsci12/misc/sqliterator.pdb  -Od
> -DENABLE_LAYOUT=0 -DENABLE_LAYOUT_EXPERIMENTAL=0 -Gd -I.
> -I../../wntmsci12/misc -I../../wntmsci12/inc/sql -I../inc
> -I../../inc/pch -I../../inc -I../../WIN/inc -I../../wntmsci12/inc -I.
> -IC:/build_tmp/aoo_src/main/solver/420/wntmsci12/inc/stl
> -IC:/build_tmp/aoo_src/main/solver/420/wntmsci12/inc/external
> -IC:/build_tmp/aoo_src/main/solver/420/wntmsci12/inc
> -IC:/build_tmp/aoo_src/main/solenv/wntmsci12/inc
> -IC:/build_tmp/aoo_src/main/solenv/inc -IC:/build_tmp/aoo_src/main/res
> -IC:/build_tmp/aoo_src/main/tools/inc
> -IC:/build_tmp/aoo_src/main/comphelper/inc
> -IC:/PROGRA~2/Java/JDK17~1.0/include/win32
> -IC:/PROGRA~2/Java/JDK17~1.0/include
> -IC:/PROGRA~1/MICROS~1/Windows/v7.0/include
> -IC:/PROGRA~2/MICROS~1.0/VC/include -IC:/PROGRA~2/MICROS~1/include
> -IC:/PROGRA~2/MICROS~1/include
> -IC:/build_tmp/aoo_src/main/solver/420/wntmsci12/inc/offuh -I.
> -I../../res -I. -Z7 -Yd -Wall -wd4061 -wd4127 -wd4191 -wd4217 -wd4250
> -wd4251 -wd4275     -wd4290 -wd4294 -wd4355 -wd4511 -wd4512 -wd4514
> -wd4611 -wd4625 -wd4626     -wd4640 -wd4675 -wd4710 -wd4711 -wd4786
> -wd4800 -wd4820 -wd4503 -wd4619     -wd4365 -wd4668 -wd4738 -wd4826
> -wd4350 -wd4505 -wd4692 -wd4189 -wd4005     -wd4180   -DWNT -DWNT
> -DNT351 -DMSC -DM1500 -DINTEL -D_STLP_DEBUG -D_X86_=1
> -D_CRT_SECURE_NO_DEPRECATE -D_CRT_NONSTDC_NO_DEPRECATE
> -D_CRT_NON_CONFORMING_SWPRINTFS -DFULL_DESK -DBOOST_MEM_FN_ENABLE_CDECL
> -D_MT -DWINVER=0x0500 -D_WIN32_WINNT=0x0500 -D_WIN32_IE=0x0500
> -DCPPU_ENV=msci -DSUPD=420 -DDEBUG -DDBG_UTIL -DOSL_DEBUG_LEVEL=2 -DCUI
> -DSOLAR_JAVA   -DOOO_DLLIMPLEMENTATION_DBTOOLS -DSHAREDLIB -D_DLL_
> -DWIN32 -D_MT -D_DLL -DWIN32 -D_MT -D_DLL  -EHa -DEXCEPTIONS_ON
> -Fo../../wntmsci12/slo/sqliterator.obj
> C:/build_tmp/aoo_src/main/connectivity/source/parse/sqliterator.cxx
> : &&
> PATH=/cygdrive/c/build_tmp/aoo_src/main/solver/420/wntmsci12/bin${PATH:+:${PATH}}
> C:/build_tmp/aoo_src/main/solver/420/wntmsci12/bin/makedepend
> @C:/build/cygwin/tmp/mkPRy3zZ > ../../wntmsci12/misc/s_sqliterator.dpcc
> Compiling: connectivity/source/parse/sqlnode.cxx
> C:/PROGRA~2/MICROS~1.0/VC/bin/cl.exe  -Zm500 -Zc:wchar_t- -GR -GS -c
> -nologo -Gs  -Ob1 -Zi -Fd../../wntmsci12/misc/sqlnode.pdb  -Od
> -DENABLE_LAYOUT=0 -DENABLE_LAYOUT_EXPERIMENTAL=0 -Gd  -I.
> -I../../wntmsci12/misc -I../../wntmsci12/inc/sql -I../inc
> -I../../inc/pch -I../../inc -I../../WIN/inc -I../../wntmsci12/inc -I.
> -IC:/build_tmp/aoo_src/main/solver/420/wntmsci12/inc/stl
> -IC:/build_tmp/aoo_src/main/solver/420/wntmsci12/inc/external
> -IC:/build_tmp/aoo_src/main/solver/420/wntmsci12/inc
> -IC:/build_tmp/aoo_src/main/solenv/wntmsci12/inc
> -IC:/build_tmp/aoo_src/main/solenv/inc -IC:/build_tmp/aoo_src/main/res
> -IC:/build_tmp/aoo_src/main/tools/inc
> -IC:/build_tmp/aoo_src/main/comphelper/inc
> -IC:/PROGRA~2/Java/JDK17~1.0/include/win32
> -IC:/PROGRA~2/Java/JDK17~1.0/include
> -IC:/PROGRA~1/MICROS~1/Windows/v7.0/include
> -IC:/PROGRA~2/MICROS~1.0/VC/include -IC:/PROGRA~2/MICROS~1/include
> -IC:/PROGRA~2/MICROS~1/include
> -IC:/build_tmp/aoo_src/main/solver/420/wntmsci12/inc/offuh -I.
> -I../../res -I. -Z7 -Yd -Wall -wd4061 -wd4127 -wd4191 -wd4217 -wd4250
> -wd4251 -wd4275     -wd4290 -wd4294 -wd4355 -wd4511 -wd4512 -wd4514
> -wd4611 -wd4625 -wd4626     -wd4640 -wd4675 -wd4710 -wd4711 -wd4786
> -wd4800 -wd4820 -wd4503 -wd4619     -wd4365 -wd4668 -wd4738 -wd4826
> -wd4350 -wd4505 -wd4692 -wd4189 -wd4005     -wd4180   -DWNT -DWNT
> -DNT351 -DMSC -DM1500 -DINTEL -D_STLP_DEBUG -D_X86_=1
> -D_CRT_SECURE_NO_DEPRECATE -D_CRT_NONSTDC_NO_DEPRECATE
> -D_CRT_NON_CONFORMING_SWPRINTFS -DFULL_DESK -DBOOST_MEM_FN_ENABLE_CDECL
> -D_MT -DWINVER=0x0500 -D_WIN32_WINNT=0x0500 -D_WIN32_IE=0x0500
> -DCPPU_ENV=msci -DSUPD=420 -DDEBUG -DDBG_UTIL -DOSL_DEBUG_LEVEL=2 -DCUI
> -DSOLAR_JAVA   -DOOO_DLLIMPLEMENTATION_DBTOOLS -DSHAREDLIB -D_DLL_
> -DWIN32 -D_MT -D_DLL -DWIN32 -D_MT -D_DLL  -EHa -DEXCEPTIONS_ON
> -Fo../../wntmsci12/slo/sqlnode.obj
> C:/build_tmp/aoo_src/main/connectivity/source/parse/sqlnode.cxx
> : &&
> PATH=/cygdrive/c/build_tmp/aoo_src/main/solver/420/wntmsci12/bin${PATH:+:${PATH}}
> C:/build_tmp/aoo_src/main/solver/420/wntmsci12/bin/makedepend
> @C:/build/cygwin/tmp/mkPfHHQm > ../../wntmsci12/misc/s_sqlnode.dpcc
> Compiling: connectivity/source/parse/internalnode.cxx
> C:/PROGRA~2/MICROS~1.0/VC/bin/cl.exe  -Zm500 -Zc:wchar_t- -GR -GS -c
> -nologo -Gs  -Ob1 -Zi -Fd../../wntmsci12/misc/internalnode.pdb  -Od
> -DENABLE_LAYOUT=0 -DENABLE_LAYOUT_EXPERIMENTAL=0 -Gd -I.
> -I../../wntmsci12/misc -I../../wntmsci12/inc/sql -I../inc
> -I../../inc/pch -I../../inc -I../../WIN/inc -I../../wntmsci12/inc -I.
> -IC:/build_tmp/aoo_src/main/solver/420/wntmsci12/inc/stl
> -IC:/build_tmp/aoo_src/main/solver/420/wntmsci12/inc/external
> -IC:/build_tmp/aoo_src/main/solver/420/wntmsci12/inc
> -IC:/build_tmp/aoo_src/main/solenv/wntmsci12/inc
> -IC:/build_tmp/aoo_src/main/solenv/inc -IC:/build_tmp/aoo_src/main/res
> -IC:/build_tmp/aoo_src/main/tools/inc
> -IC:/build_tmp/aoo_src/main/comphelper/inc
> -IC:/PROGRA~2/Java/JDK17~1.0/include/win32
> -IC:/PROGRA~2/Java/JDK17~1.0/include
> -IC:/PROGRA~1/MICROS~1/Windows/v7.0/include
> -IC:/PROGRA~2/MICROS~1.0/VC/include -IC:/PROGRA~2/MICROS~1/include
> -IC:/PROGRA~2/MICROS~1/include
> -IC:/build_tmp/aoo_src/main/solver/420/wntmsci12/inc/offuh -I.
> -I../../res -I. -Z7 -Yd -Wall -wd4061 -wd4127 -wd4191 -wd4217 -wd4250
> -wd4251 -wd4275     -wd4290 -wd4294 -wd4355 -wd4511 -wd4512 -wd4514
> -wd4611 -wd4625 -wd4626     -wd4640 -wd4675 -wd4710 -wd4711 -wd4786
> -wd4800 -wd4820 -wd4503 -wd4619     -wd4365 -wd4668 -wd4738 -wd4826
> -wd4350 -wd4505 -wd4692 -wd4189 -wd4005     -wd4180   -DWNT -DWNT
> -DNT351 -DMSC -DM1500 -DINTEL -D_STLP_DEBUG -D_X86_=1
> -D_CRT_SECURE_NO_DEPRECATE -D_CRT_NONSTDC_NO_DEPRECATE
> -D_CRT_NON_CONFORMING_SWPRINTFS -DFULL_DESK -DBOOST_MEM_FN_ENABLE_CDECL
> -D_MT -DWINVER=0x0500 -D_WIN32_WINNT=0x0500 -D_WIN32_IE=0x0500
> -DCPPU_ENV=msci -DSUPD=420 -DDEBUG -DDBG_UTIL -DOSL_DEBUG_LEVEL=2 -DCUI
> -DSOLAR_JAVA   -DOOO_DLLIMPLEMENTATION_DBTOOLS -DSHAREDLIB -D_DLL_
> -DWIN32 -D_MT -D_DLL -DWIN32 -D_MT -D_DLL  -EHa -DEXCEPTIONS_ON
> -Fo../../wntmsci12/slo/internalnode.obj
> C:/build_tmp/aoo_src/main/connectivity/source/parse/internalnode.cxx
> : &&
> PATH=/cygdrive/c/build_tmp/aoo_src/main/solver/420/wntmsci12/bin${PATH:+:${PATH}}
> C:/build_tmp/aoo_src/main/solver/420/wntmsci12/bin/makedepend
> @C:/build/cygwin/tmp/mkGM7Hzg > ../../wntmsci12/misc/s_internalnode.dpcc
> Compiling: connectivity/source/parse/wrap_sqlflex.cxx
> C:/PROGRA~2/MICROS~1.0/VC/bin/cl.exe  -Zm500 -Zc:wchar_t- -GR -GS -c
> -nologo -Gs  -Ob1 -Zi -Fd../../wntmsci12/misc/wrap_sqlflex.pdb  -Od
> -DENABLE_LAYOUT=0 -DENABLE_LAYOUT_EXPERIMENTAL=0 -Gd -I.
> -I../../wntmsci12/misc -I../../wntmsci12/inc/sql -I../inc
> -I../../inc/pch -I../../inc -I../../WIN/inc -I../../wntmsci12/inc -I.
> -IC:/build_tmp/aoo_src/main/solver/420/wntmsci12/inc/stl
> -IC:/build_tmp/aoo_src/main/solver/420/wntmsci12/inc/external
> -IC:/build_tmp/aoo_src/main/solver/420/wntmsci12/inc
> -IC:/build_tmp/aoo_src/main/solenv/wntmsci12/inc
> -IC:/build_tmp/aoo_src/main/solenv/inc -IC:/build_tmp/aoo_src/main/res
> -IC:/build_tmp/aoo_src/main/tools/inc
> -IC:/build_tmp/aoo_src/main/comphelper/inc
> -IC:/PROGRA~2/Java/JDK17~1.0/include/win32
> -IC:/PROGRA~2/Java/JDK17~1.0/include
> -IC:/PROGRA~1/MICROS~1/Windows/v7.0/include
> -IC:/PROGRA~2/MICROS~1.0/VC/include -IC:/PROGRA~2/MICROS~1/include
> -IC:/PROGRA~2/MICROS~1/include
> -IC:/build_tmp/aoo_src/main/solver/420/wntmsci12/inc/offuh -I.
> -I../../res -I. -Z7 -Yd -Wall -wd4061 -wd4127 -wd4191 -wd4217 -wd4250
> -wd4251 -wd4275     -wd4290 -wd4294 -wd4355 -wd4511 -wd4512 -wd4514
> -wd4611 -wd4625 -wd4626     -wd4640 -wd4675 -wd4710 -wd4711 -wd4786
> -wd4800 -wd4820 -wd4503 -wd4619     -wd4365 -wd4668 -wd4738 -wd4826
> -wd4350 -wd4505 -wd4692 -wd4189 -wd4005     -wd4180   -DWNT -DWNT
> -DNT351 -DMSC -DM1500 -DINTEL -D_STLP_DEBUG -D_X86_=1
> -D_CRT_SECURE_NO_DEPRECATE -D_CRT_NONSTDC_NO_DEPRECATE
> -D_CRT_NON_CONFORMING_SWPRINTFS -DFULL_DESK -DBOOST_MEM_FN_ENABLE_CDECL
> -D_MT -DWINVER=0x0500 -D_WIN32_WINNT=0x0500 -D_WIN32_IE=0x0500
> -DCPPU_ENV=msci -DSUPD=420 -DDEBUG -DDBG_UTIL -DOSL_DEBUG_LEVEL=2 -DCUI
> -DSOLAR_JAVA   -DOOO_DLLIMPLEMENTATION_DBTOOLS -DSHAREDLIB -D_DLL_
> -DWIN32 -D_MT -D_DLL -DWIN32 -D_MT -D_DLL   -DEXCEPTIONS_OFF
> -Fo../../wntmsci12/slo/wrap_sqlflex.obj
> C:/build_tmp/aoo_src/main/connectivity/source/parse/wrap_sqlflex.cxx
> : &&
> PATH=/cygdrive/c/build_tmp/aoo_src/main/solver/420/wntmsci12/bin${PATH:+:${PATH}}
> C:/build_tmp/aoo_src/main/solver/420/wntmsci12/bin/makedepend
> @C:/build/cygwin/tmp/mkARcuOR > ../../wntmsci12/misc/s_wrap_sqlflex.dpcc
> cl : Command line warning D9025 : overriding '/Zi' with '/Z7'
> cl : Command line warning D9035 : option 'Yd' has been deprecated and
> will be removed in a future release
> sqliterator.cxx
> cl : Command line warning D9025 : overriding '/Zi' with '/Z7'
> cl : Command line warning D9035 : option 'Yd' has been deprecated and
> will be removed in a future release
> wrap_sqlflex.cxx
> cl : Command line warning D9025 : cl : Command line warning D9025 :
> overriding '/Zi' with '/Z7'overriding '/Zi' with '/Z7'
> cl : Command line warning D9035 : option 'Yd' has been deprecated and
> will be removed in a future release
>
> cl : Command line warning D9035 : option 'Yd' has been deprecated and
> will be removed in a future release
> sqlnode.cxx
> internalnode.cxx
> C:\PROGRA~2\MICROS~1.0\VC\include\memory(721) : error C4150: deletion of
> pointer to incomplete type 'connectivity::OSQLParser_Data'; no
> destructor called
>
> C:\build_tmp\aoo_src\main\connectivity\inc\connectivity/sqlparse.hxx(133) :
> see declaration of 'connectivity::OSQLParser_Data'
>          C:\PROGRA~2\MICROS~1.0\VC\include\memory(720) : while compiling
> class template member function 'std::auto_ptr<_Ty>::~auto_ptr(void)'
>          with
>          [
>              _Ty=connectivity::OSQLParser_Data
>          ]
>
> C:\build_tmp\aoo_src\main\connectivity\inc\connectivity/sqlparse.hxx(157) :
> see reference to class template instantiation 'std::auto_ptr<_Ty>' being
> compiled
>          with
>          [
>              _Ty=connectivity::OSQLParser_Data
>          ]
> dmake:  Error code 2, while making '../../wntmsci12/slo/internalnode.obj'
>
>
> 3-----------------------------------------------------------------
>
> [ build CXX ] formula/source/ui/dlg/formula
> R=c:/build_tmp/aoo_src && O=$R/main/solver/420/wntmsci12 &&
> W=$R/main/solver/420/wntmsci12/workdir && S=$R/main &&
> mkdir -p $W/CxxObject/formula/source/ui/dlg/ && unset INCLUDE &&
> C:/PROGRA~2/MICROS~1.0/VC/bin/cl.exe
> -DBOOST_MEM_FN_ENABLE_CDECL -DCPPU_ENV=msci -DCUI -DDBG_UTIL -DDEBUG
> -DENABLE_GRAPHITE -DENABLE_GTK -DENABLE_LAYOUT=0
> -DENABLE_LAYOUT_EXPERIMENTAL=0 -DFULL_DESK -DINTEL -DM1500 -DMSC -DNT351
> -DOSL_DEBUG_LEVEL=2 -DSOLAR_JAVA -DSUPD=420
> -DVCL -DWIN32 -DWINVER=0x0500 -DWNT -D_CRT_NONSTDC_NO_DEPRECATE
> -D_CRT_NON_CONFORMING_SWPRINTFS -D_CRT_SECURE_NO_DEPRECATE
> -D_MT -D_REENTRANT -D_STLP_DEBUG -D_WIN32_IE=0x0500 -D_X86_=1 -D_DLL
> -DPRECOMPILED_HEADERS -DFORMULA_DLLIMPLEMENTATION
>   -Gd -GR -Gs -GS -Gy -nologo -Wall -wd4005 -wd4061 -wd4127 -wd4180
> -wd4189 -wd4191 -wd4217 -wd4250 -wd4251 -wd4275
>   -wd4290 -wd4294 -wd4350 -wd4355 -wd4365 -wd4503 -wd4505 -wd4511
> -wd4512 -wd4514 -wd4611 -wd4619 -wd4625 -wd4626
>   -wd4640 -wd4668 -wd4675 -wd4692 -wd4710 -wd4711 -wd4738 -wd4786
> -wd4800 -wd4820 -wd4826 -Zc:wchar_t- -Zm500
>   -Zi -Zi  -DEXCEPTIONS_ON -EHa
> -Fd$W/LinkTarget/pdb/Library/iforui.lib.pdb -Yuprecompiled_formula.hxx
>   -Fp$W/PrecompiledHeader/debug/precompiled_formula.hxx.pch
> -I$S/formula/source/ui/dlg/
>   -IC:/build_tmp/aoo_src/main/solver/420/wntmsci12/inc/stl
> -IC:/build_tmp/aoo_src/main/solver/420/wntmsci12/inc/external
>   -IC:/build_tmp/aoo_src/main/solver/420/wntmsci12/inc
> -IC:/build_tmp/aoo_src/main/solenv/wntmsci12/inc
>   -IC:/build_tmp/aoo_src/main/solenv/inc -IC:/build_tmp/aoo_src/main/res
> -IC:/build_tmp/aoo_src/main/tools/inc
>   -IC:/build_tmp/aoo_src/main/comphelper/inc
> -IC:/PROGRA~2/Java/JDK17~1.0/include/win32
> -IC:/PROGRA~2/Java/JDK17~1.0/include
>   -IC:/PROGRA~1/MICROS~1/Windows/v7.0/include
> -IC:/PROGRA~2/MICROS~1.0/VC/include -IC:/PROGRA~2/MICROS~1/include
>   -IC:/PROGRA~2/MICROS~1/include   -I$S/formula/inc -I$S/formula/inc/pch
> -I$S/formula/source/ui/inc -I$O/inc -I$O/inc/offuh
>   -c $S/formula/source/ui/dlg/formula.cxx
> -Fo$W/CxxObject/formula/source/ui/dlg/formula.o
> formula.cxx
> c:/build_tmp/aoo_src/main/formula/source/ui/dlg/formula.cxx(25) :
> error C2858: command-line option 'program database name
> (/Fdc:\build_tmp\aoo_src\main\solver\420\wntmsci12\workdir\linktarget\pdb\library\iforui.lib.pdb)'
>
> inconsistent with precompiled header, which used
> '/Fdc:\build_tmp\aoo_src\main\solver\420\wntmsci12\workdir\linktarget\pdb\library\ifor.lib.pdb'
>
>
> c:/build_tmp/aoo_src/main/formula/source/ui/dlg/formula.cxx(25) : error
> C2859:
> c:\build_tmp\aoo_src\main\solver\420\wntmsci12\workdir\linktarget\pdb\library\iforui.lib.pdb
>
> is not the pdb file that was used when this precompiled header was
> created, recreate the precompiled header.
>
> C:/build_tmp/aoo_src/main/solenv/gbuild/LinkTarget.mk:126: recipe for
> target
> '/cygdrive/c/build_tmp/aoo_src/main/solver/420/wntmsci12/workdir/CxxObject/formula/source/ui/dlg/formula.o'
> failed
> make: ***
> [/cygdrive/c/build_tmp/aoo_src/main/solver/420/wntmsci12/workdir/CxxObject/formula/source/ui/dlg/formula.o]
> Error 2
> dmake:  Error code 2, while making 'all'
> 1 module(s):
>          formula
> need(s) to be rebuilt
> Reason(s):
> ERROR: error 65280 occurred while making
> /cygdrive/c/build_tmp/aoo_src/main/formula/prj
> When you have fixed the errors in that module you can resume the build
> by running:
>          build --from formula
>
> 4----------------------------------------------------------------
>
> Entering /cygdrive/c/build_tmp/aoo_src/main/sc/source/filter/excel
> Making:    all_excel.dpslo
> Compiling: sc/source/filter/excel/colrowst.cxx
> C:/PROGRA~2/MICROS~1.0/VC/bin/cl.exe  -Zm500 -Zc:wchar_t- -GR -GS -c
> -nologo -Gs
> -Ob1 -Zi -Fd../../../wntmsci12/misc/colrowst.pdb  -Od -DENABLE_LAYOUT=0
> -DENABLE_LAYOUT_EXPERIMENTAL=0
> -Gd  -I.
> -IC:/build_tmp/aoo_src/main/solver/420/wntmsci12/inc/offuh
> -I../../../wntmsci12/inc/excel
> -I../inc -I../../../inc/pch
> -I../../../inc
> -I../../../WIN/inc
> -I../../../wntmsci12/inc
> -I.
> -IC:/build_tmp/aoo_src/main/solver/420/wntmsci12/inc/stl
> -IC:/build_tmp/aoo_src/main/solver/420/wntmsci12/inc/external
> -IC:/build_tmp/aoo_src/main/solver/420/wntmsci12/inc
> -IC:/build_tmp/aoo_src/main/solenv/wntmsci12/inc
> -IC:/build_tmp/aoo_src/main/solenv/inc
> -IC:/build_tmp/aoo_src/main/res
> -IC:/build_tmp/aoo_src/main/tools/inc
> -IC:/build_tmp/aoo_src/main/comphelper/inc
> -IC:/PROGRA~2/Java/JDK17~1.0/include/win32
> -IC:/PROGRA~2/Java/JDK17~1.0/include
> -IC:/PROGRA~1/MICROS~1/Windows/v7.0/include
> -IC:/PROGRA~2/MICROS~1.0/VC/include
> -IC:/PROGRA~2/MICROS~1/include
> -IC:/PROGRA~2/MICROS~1/include
> -IC:/build_tmp/aoo_src/main/solver/420/wntmsci12/inc/offuh
> -I.
> -I../../../res -I. -Z7 -Yd -Wall -wd4061 -wd4127 -wd4191 -wd4217 -wd4250
> -wd4251 -wd4275     -wd4290 -wd4294 -wd4355 -wd4511 -wd4512 -wd4514
> -wd4611 -wd4625 -wd4626     -wd4640 -wd4675 -wd4710 -wd4711 -wd4786
> -wd4800 -wd4820 -wd4503 -wd4619     -wd4365 -wd4668 -wd4738 -wd4826
> -wd4350 -wd4505 -wd4692 -wd4189 -wd4005     -wd4180   -DWNT -DWNT
> -DNT351 -DMSC -DM1500 -DINTEL -D_STLP_DEBUG -D_X86_=1
> -D_CRT_SECURE_NO_DEPRECATE -D_CRT_NONSTDC_NO_DEPRECATE
> -D_CRT_NON_CONFORMING_SWPRINTFS -DFULL_DESK -DBOOST_MEM_FN_ENABLE_CDECL
> -D_MT -DWINVER=0x0500 -D_WIN32_WINNT=0x0500 -D_WIN32_IE=0x0500
> -DCPPU_ENV=msci -DSUPD=420 -DDEBUG -DDBG_UTIL -DOSL_DEBUG_LEVEL=2 -DCUI
> -DSOLAR_JAVA   -DSHAREDLIB -D_DLL_ -DWIN32 -D_MT -D_DLL -DWIN32 -D_MT
> -D_DLL  -EHa -DEXCEPTIONS_ON -Fo../../../wntmsci12/slo/colrowst.obj
> C:/build_tmp/aoo_src/main/sc/source/filter/excel/colrowst.cxx
> cl : Command line warning D9025 : overriding '/Zi' with '/Z7'
> cl : Command line warning D9035 : option 'Yd' has been deprecated and
> will be removed in a future release
> colrowst.cxx
> C:\build_tmp\aoo_src\main\sc\source\filter\inc\xistream.hxx(28) : fatal
> error C1083: Cannot open include file: 'filter/msfilter/mscodec.hxx': No
> such file or directory
> dmake:  Error code 2, while making '../../../wntmsci12/slo/colrowst.obj'
> 1 module(s):
>          sc
> need(s) to be rebuilt
> Reason(s):
> ERROR: error 65280 occurred while making
> /cygdrive/c/build_tmp/aoo_src/main/sc/source/filter/excel
> When you have fixed the errors in that module you can resume the build
> by running:
>          build --from sc
>
> ---------------------------------------------------------------------
> To unsubscribe, e-mail: dev-unsubscribe@openoffice.apache.org
> For additional commands, e-mail: dev-help@openoffice.apache.org
>

---------------------------------------------------------------------
To unsubscribe, e-mail: dev-unsubscribe@openoffice.apache.org
For additional commands, e-mail: dev-help@openoffice.apache.org


Mime
View raw message