kafka-dev mailing list archives

Site index · List index
Message view « Date » · « Thread »
Top « Date » · « Thread »
From Apache Jenkins Server <jenk...@builds.apache.org>
Subject Build failed in Jenkins: kafka-trunk-jdk11 #809
Date Thu, 12 Sep 2019 01:29:14 GMT
See <https://builds.apache.org/job/kafka-trunk-jdk11/809/display/redirect?page=changes>

Changes:

[github] KAFKA-8886; Make Authorizer create/delete API asynchronous (#7316)

------------------------------------------
[...truncated 1.90 MB...]
        at app//org.apache.directory.server.core.changelog.ChangeLogInterceptor.add(ChangeLogInterceptor.java:113)
        at app//org.apache.directory.server.core.api.interceptor.BaseInterceptor.next(BaseInterceptor.java:341)
        at app//org.apache.directory.server.core.trigger.TriggerInterceptor.add(TriggerInterceptor.java:297)
        at app//org.apache.directory.server.core.api.interceptor.BaseInterceptor.next(BaseInterceptor.java:341)
        at app//org.apache.directory.server.core.event.EventInterceptor.add(EventInterceptor.java:245)
        at app//org.apache.directory.server.core.api.interceptor.BaseInterceptor.next(BaseInterceptor.java:341)
        at app//org.apache.directory.server.core.subtree.SubentryInterceptor.add(SubentryInterceptor.java:1018)
        at app//org.apache.directory.server.core.api.interceptor.BaseInterceptor.next(BaseInterceptor.java:341)
        at app//org.apache.directory.server.core.collective.CollectiveAttributeInterceptor.add(CollectiveAttributeInterceptor.java:134)
        at app//org.apache.directory.server.core.api.interceptor.BaseInterceptor.next(BaseInterceptor.java:341)
        at app//org.apache.directory.server.core.operational.OperationalAttributeInterceptor.add(OperationalAttributeInterceptor.java:310)
        at app//org.apache.directory.server.core.api.interceptor.BaseInterceptor.next(BaseInterceptor.java:341)
        at app//org.apache.directory.server.core.schema.SchemaInterceptor.add(SchemaInterceptor.java:1109)
        at app//org.apache.directory.server.core.api.interceptor.BaseInterceptor.next(BaseInterceptor.java:341)
        at app//org.apache.directory.server.core.exception.ExceptionInterceptor.add(ExceptionInterceptor.java:134)
        at app//org.apache.directory.server.core.api.interceptor.BaseInterceptor.next(BaseInterceptor.java:341)
        at app//org.apache.directory.server.core.admin.AdministrativePointInterceptor.add(AdministrativePointInterceptor.java:1189)
        at app//org.apache.directory.server.core.api.interceptor.BaseInterceptor.next(BaseInterceptor.java:341)
        at app//org.apache.directory.server.core.authz.AciAuthorizationInterceptor.add(AciAuthorizationInterceptor.java:518)
        at app//org.apache.directory.server.core.api.interceptor.BaseInterceptor.next(BaseInterceptor.java:341)
        at app//org.apache.directory.server.core.referral.ReferralInterceptor.add(ReferralInterceptor.java:247)
        at app//org.apache.directory.server.core.api.interceptor.BaseInterceptor.next(BaseInterceptor.java:341)
        at app//org.apache.directory.server.core.authn.AuthenticationInterceptor.add(AuthenticationInterceptor.java:335)
        at app//org.apache.directory.server.core.api.interceptor.BaseInterceptor.next(BaseInterceptor.java:341)
        at app//org.apache.directory.server.core.normalization.NormalizationInterceptor.add(NormalizationInterceptor.java:131)
        at app//org.apache.directory.server.core.DefaultOperationManager.add(DefaultOperationManager.java:397)
        at app//org.apache.directory.server.core.shared.DefaultCoreSession.add(DefaultCoreSession.java:211)
        at app//org.apache.directory.server.core.shared.DefaultCoreSession.add(DefaultCoreSession.java:188)
        at app//kafka.security.minikdc.MiniKdc.initDirectoryService(MiniKdc.scala:187)
        at app//kafka.security.minikdc.MiniKdc.start(MiniKdc.scala:121)
        at app//kafka.api.SaslSetup.initializeKerberos(SaslSetup.scala:78)
        at app//kafka.api.SaslSetup.initializeKerberos$(SaslSetup.scala:75)
        at app//kafka.api.SaslSslAdminClientIntegrationTest.initializeKerberos(SaslSslAdminClientIntegrationTest.scala:34)
        at app//kafka.api.SaslSetup.startSasl(SaslSetup.scala:64)
        at app//kafka.api.SaslSetup.startSasl$(SaslSetup.scala:56)
        at app//kafka.api.SaslSslAdminClientIntegrationTest.startSasl(SaslSslAdminClientIntegrationTest.scala:34)
        at app//kafka.api.SaslSslAdminClientIntegrationTest.setUpSasl(SaslSslAdminClientIntegrationTest.scala:69)
        at app//kafka.api.SaslSslAdminClientIntegrationTest.setUp(SaslSslAdminClientIntegrationTest.scala:64)

kafka.api.SaslSslAdminClientIntegrationTest > testElectUncleanLeadersWhenNoLiveBrokers
STARTED
kafka.api.SaslSslAdminClientIntegrationTest.testElectUncleanLeadersWhenNoLiveBrokers failed,
log available in <https://builds.apache.org/job/kafka-trunk-jdk11/ws/core/build/reports/testOutput/kafka.api.SaslSslAdminClientIntegrationTest.testElectUncleanLeadersWhenNoLiveBrokers.test.stdout>

kafka.api.SaslSslAdminClientIntegrationTest > testElectUncleanLeadersWhenNoLiveBrokers
FAILED
    org.junit.runners.model.TestTimedOutException: test timed out after 120000 milliseconds
        at java.base@11.0.1/java.io.FileDescriptor.sync(Native Method)
        at app//jdbm.recman.TransactionManager.sync(TransactionManager.java:385)
        at app//jdbm.recman.TransactionManager.close(TransactionManager.java:405)
        at app//jdbm.recman.TransactionManager.synchronizeLogFromMemory(TransactionManager.java:173)
        at app//jdbm.recman.TransactionManager.synchronizeLog(TransactionManager.java:135)
        at app//org.apache.directory.server.core.partition.impl.btree.jdbm.JdbmIndex.sync(JdbmIndex.java:606)
        at app//org.apache.directory.server.core.partition.impl.btree.jdbm.JdbmPartition.sync(JdbmPartition.java:567)
        at app//org.apache.directory.server.core.partition.impl.btree.AbstractBTreePartition.add(AbstractBTreePartition.java:871)
        at app//org.apache.directory.server.core.shared.partition.DefaultPartitionNexus.add(DefaultPartitionNexus.java:361)
        at app//org.apache.directory.server.core.api.interceptor.BaseInterceptor$1.add(BaseInterceptor.java:107)
        at app//org.apache.directory.server.core.api.interceptor.BaseInterceptor.next(BaseInterceptor.java:341)
        at app//org.apache.directory.server.core.kerberos.KeyDerivationInterceptor.add(KeyDerivationInterceptor.java:174)
        at app//org.apache.directory.server.core.api.interceptor.BaseInterceptor.next(BaseInterceptor.java:341)
        at app//org.apache.directory.server.core.journal.JournalInterceptor.add(JournalInterceptor.java:139)
        at app//org.apache.directory.server.core.api.interceptor.BaseInterceptor.next(BaseInterceptor.java:341)
        at app//org.apache.directory.server.core.changelog.ChangeLogInterceptor.add(ChangeLogInterceptor.java:113)
        at app//org.apache.directory.server.core.api.interceptor.BaseInterceptor.next(BaseInterceptor.java:341)
        at app//org.apache.directory.server.core.trigger.TriggerInterceptor.add(TriggerInterceptor.java:297)
        at app//org.apache.directory.server.core.api.interceptor.BaseInterceptor.next(BaseInterceptor.java:341)
        at app//org.apache.directory.server.core.event.EventInterceptor.add(EventInterceptor.java:245)
        at app//org.apache.directory.server.core.api.interceptor.BaseInterceptor.next(BaseInterceptor.java:341)
        at app//org.apache.directory.server.core.subtree.SubentryInterceptor.add(SubentryInterceptor.java:1018)
        at app//org.apache.directory.server.core.api.interceptor.BaseInterceptor.next(BaseInterceptor.java:341)
        at app//org.apache.directory.server.core.collective.CollectiveAttributeInterceptor.add(CollectiveAttributeInterceptor.java:134)
        at app//org.apache.directory.server.core.api.interceptor.BaseInterceptor.next(BaseInterceptor.java:341)
        at app//org.apache.directory.server.core.operational.OperationalAttributeInterceptor.add(OperationalAttributeInterceptor.java:310)
        at app//org.apache.directory.server.core.api.interceptor.BaseInterceptor.next(BaseInterceptor.java:341)
        at app//org.apache.directory.server.core.schema.SchemaInterceptor.add(SchemaInterceptor.java:1109)
        at app//org.apache.directory.server.core.api.interceptor.BaseInterceptor.next(BaseInterceptor.java:341)
        at app//org.apache.directory.server.core.exception.ExceptionInterceptor.add(ExceptionInterceptor.java:134)
        at app//org.apache.directory.server.core.api.interceptor.BaseInterceptor.next(BaseInterceptor.java:341)
        at app//org.apache.directory.server.core.admin.AdministrativePointInterceptor.add(AdministrativePointInterceptor.java:1189)
        at app//org.apache.directory.server.core.api.interceptor.BaseInterceptor.next(BaseInterceptor.java:341)
        at app//org.apache.directory.server.core.authz.AciAuthorizationInterceptor.add(AciAuthorizationInterceptor.java:518)
        at app//org.apache.directory.server.core.api.interceptor.BaseInterceptor.next(BaseInterceptor.java:341)
        at app//org.apache.directory.server.core.referral.ReferralInterceptor.add(ReferralInterceptor.java:247)
        at app//org.apache.directory.server.core.api.interceptor.BaseInterceptor.next(BaseInterceptor.java:341)
        at app//org.apache.directory.server.core.authn.AuthenticationInterceptor.add(AuthenticationInterceptor.java:335)
        at app//org.apache.directory.server.core.api.interceptor.BaseInterceptor.next(BaseInterceptor.java:341)
        at app//org.apache.directory.server.core.normalization.NormalizationInterceptor.add(NormalizationInterceptor.java:131)
        at app//org.apache.directory.server.core.DefaultOperationManager.add(DefaultOperationManager.java:397)
        at app//org.apache.directory.server.core.shared.DefaultCoreSession.add(DefaultCoreSession.java:211)
        at app//org.apache.directory.server.core.shared.DefaultCoreSession.add(DefaultCoreSession.java:188)
        at app//kafka.security.minikdc.MiniKdc.initDirectoryService(MiniKdc.scala:187)
        at app//kafka.security.minikdc.MiniKdc.start(MiniKdc.scala:121)
        at app//kafka.api.SaslSetup.initializeKerberos(SaslSetup.scala:78)
        at app//kafka.api.SaslSetup.initializeKerberos$(SaslSetup.scala:75)
        at app//kafka.api.SaslSslAdminClientIntegrationTest.initializeKerberos(SaslSslAdminClientIntegrationTest.scala:34)
        at app//kafka.api.SaslSetup.startSasl(SaslSetup.scala:64)
        at app//kafka.api.SaslSetup.startSasl$(SaslSetup.scala:56)
        at app//kafka.api.SaslSslAdminClientIntegrationTest.startSasl(SaslSslAdminClientIntegrationTest.scala:34)
        at app//kafka.api.SaslSslAdminClientIntegrationTest.setUpSasl(SaslSslAdminClientIntegrationTest.scala:69)
        at app//kafka.api.SaslSslAdminClientIntegrationTest.setUp(SaslSslAdminClientIntegrationTest.scala:64)

kafka.api.SslProducerSendTest > testSendNonCompressedMessageWithCreateTime STARTED

kafka.api.SslProducerSendTest > testSendNonCompressedMessageWithCreateTime PASSED

kafka.api.SslProducerSendTest > testClose STARTED

kafka.api.SslProducerSendTest > testClose PASSED

kafka.api.SslProducerSendTest > testFlush STARTED

kafka.api.SslProducerSendTest > testFlush PASSED

kafka.api.SslProducerSendTest > testSendToPartition STARTED

kafka.api.SslProducerSendTest > testSendToPartition PASSED

kafka.api.SslProducerSendTest > testSendOffset STARTED

kafka.api.SslProducerSendTest > testSendOffset PASSED

kafka.api.SslProducerSendTest > testSendCompressedMessageWithCreateTime STARTED

kafka.api.SslProducerSendTest > testSendCompressedMessageWithCreateTime PASSED

kafka.api.SslProducerSendTest > testCloseWithZeroTimeoutFromCallerThread STARTED

kafka.api.SslProducerSendTest > testCloseWithZeroTimeoutFromCallerThread PASSED

kafka.api.SslProducerSendTest > testCloseWithZeroTimeoutFromSenderThread STARTED

kafka.api.SslProducerSendTest > testCloseWithZeroTimeoutFromSenderThread PASSED

kafka.api.SslProducerSendTest > testSendBeforeAndAfterPartitionExpansion STARTED

kafka.api.SslProducerSendTest > testSendBeforeAndAfterPartitionExpansion PASSED

kafka.api.DescribeAuthorizedOperationsTest > testClusterAuthorizedOperations STARTED

kafka.api.DescribeAuthorizedOperationsTest > testClusterAuthorizedOperations PASSED

kafka.api.DescribeAuthorizedOperationsTest > testTopicAuthorizedOperations STARTED

kafka.api.DescribeAuthorizedOperationsTest > testTopicAuthorizedOperations PASSED

kafka.api.DescribeAuthorizedOperationsTest > testConsumerGroupAuthorizedOperations STARTED

kafka.api.DescribeAuthorizedOperationsTest > testConsumerGroupAuthorizedOperations PASSED

kafka.api.test.ProducerCompressionTest > testCompression[0 compressionType = none] STARTED

kafka.api.test.ProducerCompressionTest > testCompression[0 compressionType = none] PASSED

kafka.api.test.ProducerCompressionTest > testCompression[1 compressionType = gzip] STARTED

kafka.api.test.ProducerCompressionTest > testCompression[1 compressionType = gzip] PASSED

kafka.api.test.ProducerCompressionTest > testCompression[2 compressionType = snappy] STARTED

kafka.api.test.ProducerCompressionTest > testCompression[2 compressionType = snappy] PASSED

kafka.api.test.ProducerCompressionTest > testCompression[3 compressionType = lz4] STARTED

kafka.api.test.ProducerCompressionTest > testCompression[3 compressionType = lz4] PASSED

kafka.api.test.ProducerCompressionTest > testCompression[4 compressionType = zstd] STARTED

kafka.api.test.ProducerCompressionTest > testCompression[4 compressionType = zstd] PASSED

kafka.api.SaslSslConsumerTest > testCoordinatorFailover STARTED
kafka.api.SaslSslConsumerTest.testCoordinatorFailover failed, log available in <https://builds.apache.org/job/kafka-trunk-jdk11/ws/core/build/reports/testOutput/kafka.api.SaslSslConsumerTest.testCoordinatorFailover.test.stdout>

kafka.api.SaslSslConsumerTest > testCoordinatorFailover FAILED
    java.lang.AssertionError: expected:<None> but was:<Some(org.apache.kafka.clients.consumer.CommitFailedException:
Commit cannot be completed since the group has already rebalanced and assigned the partitions
to another member. This means that the time between subsequent calls to poll() was longer
than the configured max.poll.interval.ms, which typically implies that the poll loop is spending
too much time message processing. You can address this either by increasing max.poll.interval.ms
or by reducing the maximum size of batches returned in poll() with max.poll.records.)>

kafka.api.SaslSslConsumerTest > testSimpleConsumption STARTED
ERROR: No tool found matching GRADLE_4_10_2_HOME
ERROR: Could not install GRADLE_4_10_3_HOME
java.lang.NullPointerException

kafka.api.SaslSslConsumerTest > testSimpleConsumption PASSED

kafka.api.UserClientIdQuotaTest > testProducerConsumerOverrideUnthrottled STARTED

kafka.api.UserClientIdQuotaTest > testProducerConsumerOverrideUnthrottled PASSED

kafka.api.UserClientIdQuotaTest > testThrottledProducerConsumer STARTED

kafka.api.UserClientIdQuotaTest > testThrottledProducerConsumer PASSED

kafka.api.UserClientIdQuotaTest > testQuotaOverrideDelete STARTED
Build timed out (after 480 minutes). Marking the build as failed.
Build was aborted
Recording test results
ERROR: No tool found matching GRADLE_4_10_2_HOME
Setting GRADLE_4_10_3_HOME=/home/jenkins/tools/gradle/4.10.3

kafka.api.UserClientIdQuotaTest > testQuotaOverrideDelete PASSED

kafka.api.UserClientIdQuotaTest > testThrottledRequest STARTED

kafka.api.UserClientIdQuotaTest > testThrottledRequest SKIPPED

1723 tests completed, 55 failed, 17 skipped

> Task :core:test FAILED
> Task :connect:json:processTestResources
> Task :connect:json:testClasses
The message received from the daemon indicates that the daemon has disappeared.
Build request sent: Build{id=da138a33-f5b8-4e47-951d-a0d692008492, currentDir=<https://builds.apache.org/job/kafka-trunk-jdk11/ws/}>
Attempting to read last messages from the daemon log...
Daemon pid: 8663
  log file: /home/jenkins/.gradle/daemon/5.4.1/daemon-8663.out.log
----- Last  20 lines from daemon log file - daemon-8663.out.log -----
kafka.api.SaslSslConsumerTest > testSimpleConsumption PASSED

kafka.api.UserClientIdQuotaTest > testProducerConsumerOverrideUnthrottled STARTED

kafka.api.UserClientIdQuotaTest > testProducerConsumerOverrideUnthrottled PASSED

kafka.api.UserClientIdQuotaTest > testThrottledProducerConsumer STARTED

kafka.api.UserClientIdQuotaTest > testThrottledProducerConsumer PASSED

kafka.api.UserClientIdQuotaTest > testQuotaOverrideDelete STARTED

kafka.api.UserClientIdQuotaTest > testQuotaOverrideDelete PASSED

kafka.api.UserClientIdQuotaTest > testThrottledRequest STARTED

kafka.api.UserClientIdQuotaTest > testThrottledRequest SKIPPED

1723 tests completed, 55 failed, 17 skipped
Daemon vm is shutting down... The daemon has exited normally or was terminated in response
to a user interrupt.
----- End of the daemon log -----


FAILURE: Build failed with an exception.

* What went wrong:
Gradle build daemon disappeared unexpectedly (it may have been killed or may have crashed)

* Try:
Run with --stacktrace option to get the stack trace. Run with --info or --debug option to
get more log output. Run with --scan to get full insights.

* Get more help at https://help.gradle.org
> Task :streams:test
ERROR: No tool found matching GRADLE_4_10_2_HOME
Setting GRADLE_4_10_3_HOME=/home/jenkins/tools/gradle/4.10.3
Not sending mail to unregistered user gwen@confluent.io
Not sending mail to unregistered user noreply@github.com
Not sending mail to unregistered user wangguoz@gmail.com

Mime
View raw message