kafka-dev mailing list archives

Site index · List index
Message view « Date » · « Thread »
Top « Date » · « Thread »
From Apache Jenkins Server <jenk...@builds.apache.org>
Subject Build failed in Jenkins: kafka-trunk-jdk8 #3882
Date Tue, 03 Sep 2019 09:52:47 GMT
See <https://builds.apache.org/job/kafka-trunk-jdk8/3882/display/redirect?page=changes>

Changes:

[manikumar] KAFKA-8860: Let SslPrincipalMapper split SSL principal mapping rules

------------------------------------------
[...truncated 2.57 MB...]
org.apache.kafka.streams.integration.TableTableJoinIntegrationTest > testOuter[caching
enabled = true] FAILED
    java.lang.AssertionError: Condition not met within timeout 15000. Never received expected
final result.
        at org.apache.kafka.test.TestUtils.waitForCondition(TestUtils.java:376)
        at org.apache.kafka.test.TestUtils.waitForCondition(TestUtils.java:336)
        at org.apache.kafka.streams.integration.AbstractJoinIntegrationTest.runTest(AbstractJoinIntegrationTest.java:255)
        at org.apache.kafka.streams.integration.TableTableJoinIntegrationTest.testOuter(TableTableJoinIntegrationTest.java:162)

org.apache.kafka.streams.integration.TableTableJoinIntegrationTest > testLeft[caching enabled
= true] STARTED
org.apache.kafka.streams.integration.TableTableJoinIntegrationTest.testLeft[caching enabled
= true] failed, log available in <https://builds.apache.org/job/kafka-trunk-jdk8/ws/streams/build/reports/testOutput/org.apache.kafka.streams.integration.TableTableJoinIntegrationTest.testLeft[caching>
enabled = true].test.stdout

org.apache.kafka.streams.integration.TableTableJoinIntegrationTest > testLeft[caching enabled
= true] FAILED
    java.lang.AssertionError: Condition not met within timeout 15000. Never received expected
final result.
        at org.apache.kafka.test.TestUtils.waitForCondition(TestUtils.java:376)
        at org.apache.kafka.test.TestUtils.waitForCondition(TestUtils.java:336)
        at org.apache.kafka.streams.integration.AbstractJoinIntegrationTest.runTest(AbstractJoinIntegrationTest.java:255)
        at org.apache.kafka.streams.integration.TableTableJoinIntegrationTest.testLeft(TableTableJoinIntegrationTest.java:131)

org.apache.kafka.streams.integration.TableTableJoinIntegrationTest > testInnerInner[caching
enabled = true] STARTED
org.apache.kafka.streams.integration.TableTableJoinIntegrationTest.testInnerInner[caching
enabled = true] failed, log available in <https://builds.apache.org/job/kafka-trunk-jdk8/ws/streams/build/reports/testOutput/org.apache.kafka.streams.integration.TableTableJoinIntegrationTest.testInnerInner[caching>
enabled = true].test.stdout

org.apache.kafka.streams.integration.TableTableJoinIntegrationTest > testInnerInner[caching
enabled = true] FAILED
    java.lang.AssertionError: Condition not met within timeout 15000. Never received expected
final result.
        at org.apache.kafka.test.TestUtils.waitForCondition(TestUtils.java:376)
        at org.apache.kafka.test.TestUtils.waitForCondition(TestUtils.java:336)
        at org.apache.kafka.streams.integration.AbstractJoinIntegrationTest.runTest(AbstractJoinIntegrationTest.java:255)
        at org.apache.kafka.streams.integration.TableTableJoinIntegrationTest.testInnerInner(TableTableJoinIntegrationTest.java:197)

org.apache.kafka.streams.integration.TableTableJoinIntegrationTest > testInnerOuter[caching
enabled = true] STARTED
org.apache.kafka.streams.integration.TableTableJoinIntegrationTest.testInnerOuter[caching
enabled = true] failed, log available in <https://builds.apache.org/job/kafka-trunk-jdk8/ws/streams/build/reports/testOutput/org.apache.kafka.streams.integration.TableTableJoinIntegrationTest.testInnerOuter[caching>
enabled = true].test.stdout

org.apache.kafka.streams.integration.TableTableJoinIntegrationTest > testInnerOuter[caching
enabled = true] FAILED
    java.lang.AssertionError: Condition not met within timeout 15000. Never received expected
final result.
        at org.apache.kafka.test.TestUtils.waitForCondition(TestUtils.java:376)
        at org.apache.kafka.test.TestUtils.waitForCondition(TestUtils.java:336)
        at org.apache.kafka.streams.integration.AbstractJoinIntegrationTest.runTest(AbstractJoinIntegrationTest.java:255)
        at org.apache.kafka.streams.integration.TableTableJoinIntegrationTest.testInnerOuter(TableTableJoinIntegrationTest.java:289)

org.apache.kafka.streams.integration.TableTableJoinIntegrationTest > testInnerLeft[caching
enabled = true] STARTED
org.apache.kafka.streams.integration.TableTableJoinIntegrationTest.testInnerLeft[caching enabled
= true] failed, log available in <https://builds.apache.org/job/kafka-trunk-jdk8/ws/streams/build/reports/testOutput/org.apache.kafka.streams.integration.TableTableJoinIntegrationTest.testInnerLeft[caching>
enabled = true].test.stdout

org.apache.kafka.streams.integration.TableTableJoinIntegrationTest > testInnerLeft[caching
enabled = true] FAILED
    java.lang.AssertionError: Condition not met within timeout 15000. Never received expected
final result.
        at org.apache.kafka.test.TestUtils.waitForCondition(TestUtils.java:376)
        at org.apache.kafka.test.TestUtils.waitForCondition(TestUtils.java:336)
        at org.apache.kafka.streams.integration.AbstractJoinIntegrationTest.runTest(AbstractJoinIntegrationTest.java:255)
        at org.apache.kafka.streams.integration.TableTableJoinIntegrationTest.testInnerLeft(TableTableJoinIntegrationTest.java:244)

org.apache.kafka.streams.integration.TableTableJoinIntegrationTest > testOuterInner[caching
enabled = true] STARTED
ERROR: Could not install GRADLE_4_10_3_HOME
java.lang.NullPointerException
org.apache.kafka.streams.integration.TableTableJoinIntegrationTest.testOuterInner[caching
enabled = true] failed, log available in <https://builds.apache.org/job/kafka-trunk-jdk8/ws/streams/build/reports/testOutput/org.apache.kafka.streams.integration.TableTableJoinIntegrationTest.testOuterInner[caching>
enabled = true].test.stdout

org.apache.kafka.streams.integration.TableTableJoinIntegrationTest > testOuterInner[caching
enabled = true] FAILED
    java.lang.AssertionError: Condition not met within timeout 15000. Never received expected
final result.
        at org.apache.kafka.test.TestUtils.waitForCondition(TestUtils.java:376)
        at org.apache.kafka.test.TestUtils.waitForCondition(TestUtils.java:336)
        at org.apache.kafka.streams.integration.AbstractJoinIntegrationTest.runTest(AbstractJoinIntegrationTest.java:255)
        at org.apache.kafka.streams.integration.TableTableJoinIntegrationTest.testOuterInner(TableTableJoinIntegrationTest.java:482)

org.apache.kafka.streams.integration.TableTableJoinIntegrationTest > testOuterOuter[caching
enabled = true] STARTED
org.apache.kafka.streams.integration.TableTableJoinIntegrationTest.testOuterOuter[caching
enabled = true] failed, log available in <https://builds.apache.org/job/kafka-trunk-jdk8/ws/streams/build/reports/testOutput/org.apache.kafka.streams.integration.TableTableJoinIntegrationTest.testOuterOuter[caching>
enabled = true].test.stdout

org.apache.kafka.streams.integration.TableTableJoinIntegrationTest > testOuterOuter[caching
enabled = true] FAILED
    java.lang.AssertionError: Condition not met within timeout 15000. Never received expected
final result.
        at org.apache.kafka.test.TestUtils.waitForCondition(TestUtils.java:376)
        at org.apache.kafka.test.TestUtils.waitForCondition(TestUtils.java:336)
        at org.apache.kafka.streams.integration.AbstractJoinIntegrationTest.runTest(AbstractJoinIntegrationTest.java:255)
        at org.apache.kafka.streams.integration.TableTableJoinIntegrationTest.testOuterOuter(TableTableJoinIntegrationTest.java:580)

org.apache.kafka.streams.integration.TableTableJoinIntegrationTest > testLeftInner[caching
enabled = false] STARTED

org.apache.kafka.streams.integration.TableTableJoinIntegrationTest > testLeftInner[caching
enabled = false] PASSED

org.apache.kafka.streams.integration.TableTableJoinIntegrationTest > testLeftOuter[caching
enabled = false] STARTED

org.apache.kafka.streams.integration.TableTableJoinIntegrationTest > testLeftOuter[caching
enabled = false] PASSED

org.apache.kafka.streams.integration.TableTableJoinIntegrationTest > testLeftLeft[caching
enabled = false] STARTED

org.apache.kafka.streams.integration.TableTableJoinIntegrationTest > testLeftLeft[caching
enabled = false] PASSED

org.apache.kafka.streams.integration.TableTableJoinIntegrationTest > testOuterLeft[caching
enabled = false] STARTED

org.apache.kafka.streams.integration.TableTableJoinIntegrationTest > testOuterLeft[caching
enabled = false] PASSED

org.apache.kafka.streams.integration.TableTableJoinIntegrationTest > testInner[caching
enabled = false] STARTED

org.apache.kafka.streams.integration.TableTableJoinIntegrationTest > testInner[caching
enabled = false] PASSED

org.apache.kafka.streams.integration.TableTableJoinIntegrationTest > testOuter[caching
enabled = false] STARTED

org.apache.kafka.streams.integration.TableTableJoinIntegrationTest > testOuter[caching
enabled = false] PASSED

org.apache.kafka.streams.integration.TableTableJoinIntegrationTest > testLeft[caching enabled
= false] STARTED

org.apache.kafka.streams.integration.TableTableJoinIntegrationTest > testLeft[caching enabled
= false] PASSED

org.apache.kafka.streams.integration.TableTableJoinIntegrationTest > testInnerInner[caching
enabled = false] STARTED

org.apache.kafka.streams.integration.TableTableJoinIntegrationTest > testInnerInner[caching
enabled = false] PASSED

org.apache.kafka.streams.integration.TableTableJoinIntegrationTest > testInnerOuter[caching
enabled = false] STARTED

org.apache.kafka.streams.integration.TableTableJoinIntegrationTest > testInnerOuter[caching
enabled = false] PASSED

org.apache.kafka.streams.integration.TableTableJoinIntegrationTest > testInnerLeft[caching
enabled = false] STARTED

org.apache.kafka.streams.integration.TableTableJoinIntegrationTest > testInnerLeft[caching
enabled = false] PASSED

org.apache.kafka.streams.integration.TableTableJoinIntegrationTest > testOuterInner[caching
enabled = false] STARTED

org.apache.kafka.streams.integration.TableTableJoinIntegrationTest > testOuterInner[caching
enabled = false] PASSED

org.apache.kafka.streams.integration.TableTableJoinIntegrationTest > testOuterOuter[caching
enabled = false] STARTED

org.apache.kafka.streams.integration.TableTableJoinIntegrationTest > testOuterOuter[caching
enabled = false] PASSED

org.apache.kafka.streams.integration.RegexSourceIntegrationTest > testShouldReadFromRegexAndNamedTopics
STARTED

org.apache.kafka.streams.integration.RegexSourceIntegrationTest > testShouldReadFromRegexAndNamedTopics
PASSED

org.apache.kafka.streams.integration.RegexSourceIntegrationTest > testRegexMatchesTopicsAWhenCreated
STARTED

org.apache.kafka.streams.integration.RegexSourceIntegrationTest > testRegexMatchesTopicsAWhenCreated
PASSED

org.apache.kafka.streams.integration.RegexSourceIntegrationTest > testMultipleConsumersCanReadFromPartitionedTopic
STARTED

org.apache.kafka.streams.integration.RegexSourceIntegrationTest > testMultipleConsumersCanReadFromPartitionedTopic
PASSED

org.apache.kafka.streams.integration.RegexSourceIntegrationTest > testRegexMatchesTopicsAWhenDeleted
STARTED

org.apache.kafka.streams.integration.RegexSourceIntegrationTest > testRegexMatchesTopicsAWhenDeleted
PASSED

org.apache.kafka.streams.integration.RegexSourceIntegrationTest > testNoMessagesSentExceptionFromOverlappingPatterns
STARTED

org.apache.kafka.streams.integration.RegexSourceIntegrationTest > testNoMessagesSentExceptionFromOverlappingPatterns
PASSED

org.apache.kafka.streams.integration.RegexSourceIntegrationTest > shouldAddStateStoreToRegexDefinedSource
STARTED

org.apache.kafka.streams.integration.RegexSourceIntegrationTest > shouldAddStateStoreToRegexDefinedSource
PASSED

org.apache.kafka.streams.integration.InternalTopicIntegrationTest > shouldCompactTopicsForKeyValueStoreChangelogs
STARTED
org.apache.kafka.streams.integration.InternalTopicIntegrationTest.shouldCompactTopicsForKeyValueStoreChangelogs
failed, log available in <https://builds.apache.org/job/kafka-trunk-jdk8/ws/streams/build/reports/testOutput/org.apache.kafka.streams.integration.InternalTopicIntegrationTest.shouldCompactTopicsForKeyValueStoreChangelogs.test.stdout>

org.apache.kafka.streams.integration.InternalTopicIntegrationTest > shouldCompactTopicsForKeyValueStoreChangelogs
FAILED
    java.lang.RuntimeException: Timed out waiting for completion. lagMetrics=[0/2] totalLag=[0.0]
        at org.apache.kafka.streams.integration.utils.IntegrationTestUtils.waitForCompletion(IntegrationTestUtils.java:410)
        at org.apache.kafka.streams.integration.InternalTopicIntegrationTest.shouldCompactTopicsForKeyValueStoreChangelogs(InternalTopicIntegrationTest.java:165)

org.apache.kafka.streams.integration.InternalTopicIntegrationTest > shouldCompactAndDeleteTopicsForWindowStoreChangelogs
STARTED

org.apache.kafka.streams.integration.InternalTopicIntegrationTest > shouldCompactAndDeleteTopicsForWindowStoreChangelogs
PASSED

org.apache.kafka.streams.integration.RepartitionOptimizingIntegrationTest > shouldSendCorrectRecords_OPTIMIZED
STARTED
org.apache.kafka.streams.integration.RepartitionOptimizingIntegrationTest.shouldSendCorrectRecords_OPTIMIZED
failed, log available in <https://builds.apache.org/job/kafka-trunk-jdk8/ws/streams/build/reports/testOutput/org.apache.kafka.streams.integration.RepartitionOptimizingIntegrationTest.shouldSendCorrectRecords_OPTIMIZED.test.stdout>

org.apache.kafka.streams.integration.RepartitionOptimizingIntegrationTest > shouldSendCorrectRecords_OPTIMIZED
FAILED
    java.lang.AssertionError: Condition not met within timeout 60000. Did not receive all
[KeyValue(A, 3), KeyValue(B, 3), KeyValue(C, 3)] records from topic outputTopic_0
        at org.apache.kafka.test.TestUtils.waitForCondition(TestUtils.java:376)
        at org.apache.kafka.test.TestUtils.waitForCondition(TestUtils.java:353)
        at org.apache.kafka.streams.integration.utils.IntegrationTestUtils.waitUntilFinalKeyValueRecordsReceived(IntegrationTestUtils.java:638)
        at org.apache.kafka.streams.integration.utils.IntegrationTestUtils.waitUntilFinalKeyValueRecordsReceived(IntegrationTestUtils.java:588)
        at org.apache.kafka.streams.integration.utils.IntegrationTestUtils.waitUntilFinalKeyValueRecordsReceived(IntegrationTestUtils.java:553)
        at org.apache.kafka.streams.integration.RepartitionOptimizingIntegrationTest.runIntegrationTest(RepartitionOptimizingIntegrationTest.java:197)
        at org.apache.kafka.streams.integration.RepartitionOptimizingIntegrationTest.shouldSendCorrectRecords_OPTIMIZED(RepartitionOptimizingIntegrationTest.java:118)

    java.lang.AssertionError: Condition not met within timeout 30000. Topics not deleted after
30000 milli seconds.
        at org.apache.kafka.test.TestUtils.waitForCondition(TestUtils.java:376)
        at org.apache.kafka.test.TestUtils.waitForCondition(TestUtils.java:353)
        at org.apache.kafka.streams.integration.utils.EmbeddedKafkaCluster.deleteAllTopicsAndWait(EmbeddedKafkaCluster.java:283)
        at org.apache.kafka.streams.integration.RepartitionOptimizingIntegrationTest.tearDown(RepartitionOptimizingIntegrationTest.java:113)

org.apache.kafka.streams.integration.RepartitionOptimizingIntegrationTest > shouldSendCorrectResults_NO_OPTIMIZATION
STARTED
Build timed out (after 600 minutes). Marking the build as failed.
Build was aborted
[FINDBUGS] Collecting findbugs analysis files...
Setting GRADLE_4_10_3_HOME=/home/jenkins/tools/gradle/4.10.3

org.apache.kafka.streams.integration.RepartitionOptimizingIntegrationTest > shouldSendCorrectResults_NO_OPTIMIZATION
SKIPPED

126 tests completed, 24 failed, 1 skipped

> Task :streams:test FAILED
The message received from the daemon indicates that the daemon has disappeared.
Build request sent: Build{id=8ad04fb9-16bd-4e24-9628-bc1f472d3385, currentDir=<https://builds.apache.org/job/kafka-trunk-jdk8/ws/}>
Attempting to read last messages from the daemon log...
Daemon pid: 17951
  log file: /home/jenkins/.gradle/daemon/5.4.1/daemon-17951.out.log
----- Last  20 lines from daemon log file - daemon-17951.out.log -----
        at org.apache.kafka.test.TestUtils.waitForCondition(TestUtils.java:376)
        at org.apache.kafka.test.TestUtils.waitForCondition(TestUtils.java:353)
        at org.apache.kafka.streams.integration.utils.IntegrationTestUtils.waitUntilFinalKeyValueRecordsReceived(IntegrationTestUtils.java:638)
        at org.apache.kafka.streams.integration.utils.IntegrationTestUtils.waitUntilFinalKeyValueRecordsReceived(IntegrationTestUtils.java:588)
        at org.apache.kafka.streams.integration.utils.IntegrationTestUtils.waitUntilFinalKeyValueRecordsReceived(IntegrationTestUtils.java:553)
        at org.apache.kafka.streams.integration.RepartitionOptimizingIntegrationTest.runIntegrationTest(RepartitionOptimizingIntegrationTest.java:197)
        at org.apache.kafka.streams.integration.RepartitionOptimizingIntegrationTest.shouldSendCorrectRecords_OPTIMIZED(RepartitionOptimizingIntegrationTest.java:118)

    java.lang.AssertionError: Condition not met within timeout 30000. Topics not deleted after
30000 milli seconds.
        at org.apache.kafka.test.TestUtils.waitForCondition(TestUtils.java:376)
        at org.apache.kafka.test.TestUtils.waitForCondition(TestUtils.java:353)
        at org.apache.kafka.streams.integration.utils.EmbeddedKafkaCluster.deleteAllTopicsAndWait(EmbeddedKafkaCluster.java:283)
        at org.apache.kafka.streams.integration.RepartitionOptimizingIntegrationTest.tearDown(RepartitionOptimizingIntegrationTest.java:113)

org.apache.kafka.streams.integration.RepartitionOptimizingIntegrationTest > shouldSendCorrectResults_NO_OPTIMIZATION
STARTED

org.apache.kafka.streams.integration.RepartitionOptimizingIntegrationTest > shouldSendCorrectResults_NO_OPTIMIZATION
SKIPPED

126 tests completed, 24 failed, 1 skipped
Daemon vm is shutting down... The daemon has exited normally or was terminated in response
to a user interrupt.
----- End of the daemon log -----


FAILURE: Build failed with an exception.

* What went wrong:
Gradle build daemon disappeared unexpectedly (it may have been killed or may have crashed)

* Try:
Run with --stacktrace option to get the stack trace. Run with --info or --debug option to
get more log output. Run with --scan to get full insights.

* Get more help at https://help.gradle.org
[FINDBUGS] Searching for all files in <https://builds.apache.org/job/kafka-trunk-jdk8/ws/>
that match the pattern **/build/reports/*bugs/*.xml
[FINDBUGS] Parsing 17 files in <https://builds.apache.org/job/kafka-trunk-jdk8/ws/>
[FINDBUGS] Successfully parsed file <https://builds.apache.org/job/kafka-trunk-jdk8/ws/clients/build/reports/spotbugs/main.xml>
with 0 unique warnings and 0 duplicates.
[FINDBUGS] Successfully parsed file <https://builds.apache.org/job/kafka-trunk-jdk8/ws/connect/api/build/reports/spotbugs/main.xml>
with 0 unique warnings and 0 duplicates.
[FINDBUGS] Successfully parsed file <https://builds.apache.org/job/kafka-trunk-jdk8/ws/connect/basic-auth-extension/build/reports/spotbugs/main.xml>
with 0 unique warnings and 0 duplicates.
[FINDBUGS] Successfully parsed file <https://builds.apache.org/job/kafka-trunk-jdk8/ws/connect/file/build/reports/spotbugs/main.xml>
with 0 unique warnings and 0 duplicates.
[FINDBUGS] Successfully parsed file <https://builds.apache.org/job/kafka-trunk-jdk8/ws/connect/json/build/reports/spotbugs/main.xml>
with 0 unique warnings and 0 duplicates.
[FINDBUGS] Successfully parsed file <https://builds.apache.org/job/kafka-trunk-jdk8/ws/connect/runtime/build/reports/spotbugs/main.xml>
with 0 unique warnings and 0 duplicates.
[FINDBUGS] Successfully parsed file <https://builds.apache.org/job/kafka-trunk-jdk8/ws/connect/transforms/build/reports/spotbugs/main.xml>
with 0 unique warnings and 0 duplicates.
[FINDBUGS] Successfully parsed file <https://builds.apache.org/job/kafka-trunk-jdk8/ws/core/build/reports/spotbugs/main.xml>
with 0 unique warnings and 0 duplicates.
[FINDBUGS] Successfully parsed file <https://builds.apache.org/job/kafka-trunk-jdk8/ws/examples/build/reports/spotbugs/main.xml>
with 0 unique warnings and 0 duplicates.
[FINDBUGS] Successfully parsed file <https://builds.apache.org/job/kafka-trunk-jdk8/ws/generator/build/reports/spotbugs/main.xml>
with 0 unique warnings and 0 duplicates.
[FINDBUGS] Successfully parsed file <https://builds.apache.org/job/kafka-trunk-jdk8/ws/jmh-benchmarks/build/reports/spotbugs/main.xml>
with 0 unique warnings and 0 duplicates.
[FINDBUGS] Successfully parsed file <https://builds.apache.org/job/kafka-trunk-jdk8/ws/log4j-appender/build/reports/spotbugs/main.xml>
with 0 unique warnings and 0 duplicates.
[FINDBUGS] Successfully parsed file <https://builds.apache.org/job/kafka-trunk-jdk8/ws/streams/build/reports/spotbugs/main.xml>
with 0 unique warnings and 0 duplicates.
[FINDBUGS] Successfully parsed file <https://builds.apache.org/job/kafka-trunk-jdk8/ws/streams/examples/build/reports/spotbugs/main.xml>
with 0 unique warnings and 0 duplicates.
[FINDBUGS] Successfully parsed file <https://builds.apache.org/job/kafka-trunk-jdk8/ws/streams/streams-scala/build/reports/spotbugs/main.xml>
with 0 unique warnings and 0 duplicates.
[FINDBUGS] Successfully parsed file <https://builds.apache.org/job/kafka-trunk-jdk8/ws/streams/test-utils/build/reports/spotbugs/main.xml>
with 0 unique warnings and 0 duplicates.
[FINDBUGS] Successfully parsed file <https://builds.apache.org/job/kafka-trunk-jdk8/ws/tools/build/reports/spotbugs/main.xml>
with 0 unique warnings and 0 duplicates.
Setting GRADLE_4_10_3_HOME=/home/jenkins/tools/gradle/4.10.3
No credentials specified
Setting GRADLE_4_10_3_HOME=/home/jenkins/tools/gradle/4.10.3
<Git Blamer> Using GitBlamer to create author and commit information for all warnings.
<Git Blamer> GIT_COMMIT=88d1b6de1f0e5b5228743f4f54ac01a2a153adf9, workspace=<https://builds.apache.org/job/kafka-trunk-jdk8/ws/>
[FINDBUGS] Computing warning deltas based on reference build #3881
Recording test results
Setting GRADLE_4_10_3_HOME=/home/jenkins/tools/gradle/4.10.3
Setting GRADLE_4_10_3_HOME=/home/jenkins/tools/gradle/4.10.3

Mime
View raw message