kafka-dev mailing list archives

Site index · List index
Message view « Date » · « Thread »
Top « Date » · « Thread »
From Apache Jenkins Server <jenk...@builds.apache.org>
Subject Build failed in Jenkins: kafka-2.0-jdk8 #274
Date Sat, 08 Jun 2019 02:38:44 GMT
See <https://builds.apache.org/job/kafka-2.0-jdk8/274/display/redirect?page=changes>

Changes:

[jason] MINOR: Lower producer throughput in flaky upgrade system test

[jason] MINOR: Fix race condition on shutdown of verifiable producer

------------------------------------------
[...truncated 438.98 KB...]
kafka.log.LogCleanerManagerTest > testLogsWithSegmentsToDeleteShouldNotConsiderCleanupPolicyDeleteLogs
STARTED

kafka.log.LogCleanerManagerTest > testLogsWithSegmentsToDeleteShouldNotConsiderCleanupPolicyDeleteLogs
PASSED

kafka.log.LogCleanerManagerTest > testCleanableOffsetsForShortTime STARTED

kafka.log.LogCleanerManagerTest > testCleanableOffsetsForShortTime PASSED

kafka.log.LogCleanerManagerTest > testDoneCleaning STARTED

kafka.log.LogCleanerManagerTest > testDoneCleaning PASSED

kafka.log.LogCleanerManagerTest > testDoneDeleting STARTED

kafka.log.LogCleanerManagerTest > testDoneDeleting PASSED

kafka.log.ProducerStateManagerTest > testProducerSequenceWithWrapAroundBatchRecord STARTED

kafka.log.ProducerStateManagerTest > testProducerSequenceWithWrapAroundBatchRecord PASSED

kafka.log.ProducerStateManagerTest > testCoordinatorFencing STARTED

kafka.log.ProducerStateManagerTest > testCoordinatorFencing PASSED

kafka.log.ProducerStateManagerTest > testTruncate STARTED

kafka.log.ProducerStateManagerTest > testTruncate PASSED

kafka.log.ProducerStateManagerTest > testLoadFromTruncatedSnapshotFile STARTED

kafka.log.ProducerStateManagerTest > testLoadFromTruncatedSnapshotFile PASSED

kafka.log.ProducerStateManagerTest > testRemoveExpiredPidsOnReload STARTED

kafka.log.ProducerStateManagerTest > testRemoveExpiredPidsOnReload PASSED

kafka.log.ProducerStateManagerTest > testOutOfSequenceAfterControlRecordEpochBump STARTED

kafka.log.ProducerStateManagerTest > testOutOfSequenceAfterControlRecordEpochBump PASSED

kafka.log.ProducerStateManagerTest > testFirstUnstableOffsetAfterTruncation STARTED

kafka.log.ProducerStateManagerTest > testFirstUnstableOffsetAfterTruncation PASSED

kafka.log.ProducerStateManagerTest > testTakeSnapshot STARTED

kafka.log.ProducerStateManagerTest > testTakeSnapshot PASSED

kafka.log.ProducerStateManagerTest > testDeleteSnapshotsBefore STARTED

kafka.log.ProducerStateManagerTest > testDeleteSnapshotsBefore PASSED

kafka.log.ProducerStateManagerTest > testNonMatchingTxnFirstOffsetMetadataNotCached STARTED

kafka.log.ProducerStateManagerTest > testNonMatchingTxnFirstOffsetMetadataNotCached PASSED

kafka.log.ProducerStateManagerTest > testAppendEmptyControlBatch STARTED

kafka.log.ProducerStateManagerTest > testAppendEmptyControlBatch PASSED

kafka.log.ProducerStateManagerTest > testFirstUnstableOffsetAfterEviction STARTED

kafka.log.ProducerStateManagerTest > testFirstUnstableOffsetAfterEviction PASSED

kafka.log.ProducerStateManagerTest > testNoValidationOnFirstEntryWhenLoadingLog STARTED

kafka.log.ProducerStateManagerTest > testNoValidationOnFirstEntryWhenLoadingLog PASSED

kafka.log.ProducerStateManagerTest > testLoadFromEmptySnapshotFile STARTED

kafka.log.ProducerStateManagerTest > testLoadFromEmptySnapshotFile PASSED

kafka.log.ProducerStateManagerTest > testProducersWithOngoingTransactionsDontExpire STARTED

kafka.log.ProducerStateManagerTest > testProducersWithOngoingTransactionsDontExpire PASSED

kafka.log.ProducerStateManagerTest > testBasicIdMapping STARTED

kafka.log.ProducerStateManagerTest > testBasicIdMapping PASSED

kafka.log.ProducerStateManagerTest > updateProducerTransactionState STARTED

kafka.log.ProducerStateManagerTest > updateProducerTransactionState PASSED

kafka.log.ProducerStateManagerTest > testRecoverFromSnapshot STARTED

kafka.log.ProducerStateManagerTest > testRecoverFromSnapshot PASSED

kafka.log.ProducerStateManagerTest > testPrepareUpdateDoesNotMutate STARTED

kafka.log.ProducerStateManagerTest > testPrepareUpdateDoesNotMutate PASSED

kafka.log.ProducerStateManagerTest > testSequenceNotValidatedForGroupMetadataTopic STARTED

kafka.log.ProducerStateManagerTest > testSequenceNotValidatedForGroupMetadataTopic PASSED

kafka.log.ProducerStateManagerTest > testLastStableOffsetCompletedTxn STARTED

kafka.log.ProducerStateManagerTest > testLastStableOffsetCompletedTxn PASSED

kafka.log.ProducerStateManagerTest > testLoadFromSnapshotRemovesNonRetainedProducers STARTED

kafka.log.ProducerStateManagerTest > testLoadFromSnapshotRemovesNonRetainedProducers PASSED

kafka.log.ProducerStateManagerTest > testFirstUnstableOffset STARTED

kafka.log.ProducerStateManagerTest > testFirstUnstableOffset PASSED

kafka.log.ProducerStateManagerTest > testTxnFirstOffsetMetadataCached STARTED

kafka.log.ProducerStateManagerTest > testTxnFirstOffsetMetadataCached PASSED

kafka.log.ProducerStateManagerTest > testCoordinatorFencedAfterReload STARTED

kafka.log.ProducerStateManagerTest > testCoordinatorFencedAfterReload PASSED

kafka.log.ProducerStateManagerTest > testControlRecordBumpsEpoch STARTED

kafka.log.ProducerStateManagerTest > testControlRecordBumpsEpoch PASSED

kafka.log.ProducerStateManagerTest > testAcceptAppendWithoutProducerStateOnReplica STARTED

kafka.log.ProducerStateManagerTest > testAcceptAppendWithoutProducerStateOnReplica PASSED

kafka.log.ProducerStateManagerTest > testLoadFromCorruptSnapshotFile STARTED

kafka.log.ProducerStateManagerTest > testLoadFromCorruptSnapshotFile PASSED

kafka.log.ProducerStateManagerTest > testProducerSequenceWrapAround STARTED

kafka.log.ProducerStateManagerTest > testProducerSequenceWrapAround PASSED

kafka.log.ProducerStateManagerTest > testPidExpirationTimeout STARTED

kafka.log.ProducerStateManagerTest > testPidExpirationTimeout PASSED

kafka.log.ProducerStateManagerTest > testAcceptAppendWithSequenceGapsOnReplica STARTED

kafka.log.ProducerStateManagerTest > testAcceptAppendWithSequenceGapsOnReplica PASSED

kafka.log.ProducerStateManagerTest > testAppendTxnMarkerWithNoProducerState STARTED

kafka.log.ProducerStateManagerTest > testAppendTxnMarkerWithNoProducerState PASSED

kafka.log.ProducerStateManagerTest > testOldEpochForControlRecord STARTED

kafka.log.ProducerStateManagerTest > testOldEpochForControlRecord PASSED

kafka.log.ProducerStateManagerTest > testTruncateAndReloadRemovesOutOfRangeSnapshots STARTED

kafka.log.ProducerStateManagerTest > testTruncateAndReloadRemovesOutOfRangeSnapshots PASSED

kafka.log.ProducerStateManagerTest > testStartOffset STARTED

kafka.log.ProducerStateManagerTest > testStartOffset PASSED

kafka.log.ProducerStateManagerTest > testProducerSequenceInvalidWrapAround STARTED

kafka.log.ProducerStateManagerTest > testProducerSequenceInvalidWrapAround PASSED

kafka.log.ProducerStateManagerTest > testTruncateHead STARTED

kafka.log.ProducerStateManagerTest > testTruncateHead PASSED

kafka.log.ProducerStateManagerTest > testNonTransactionalAppendWithOngoingTransaction STARTED

kafka.log.ProducerStateManagerTest > testNonTransactionalAppendWithOngoingTransaction PASSED

kafka.log.ProducerStateManagerTest > testSkipSnapshotIfOffsetUnchanged STARTED

kafka.log.ProducerStateManagerTest > testSkipSnapshotIfOffsetUnchanged PASSED

kafka.log.LogCleanerLagIntegrationTest > cleanerTest[0] STARTED

kafka.log.LogCleanerLagIntegrationTest > cleanerTest[0] PASSED

kafka.log.LogCleanerLagIntegrationTest > cleanerTest[1] STARTED

kafka.log.LogCleanerLagIntegrationTest > cleanerTest[1] PASSED

kafka.log.LogCleanerLagIntegrationTest > cleanerTest[2] STARTED

kafka.log.LogCleanerLagIntegrationTest > cleanerTest[2] PASSED

kafka.log.LogCleanerLagIntegrationTest > cleanerTest[3] STARTED

kafka.log.LogCleanerLagIntegrationTest > cleanerTest[3] PASSED

kafka.log.OffsetMapTest > testClear STARTED

kafka.log.OffsetMapTest > testClear PASSED

kafka.log.OffsetMapTest > testGetWhenFull STARTED

kafka.log.OffsetMapTest > testGetWhenFull PASSED

kafka.log.OffsetMapTest > testBasicValidation STARTED

kafka.log.OffsetMapTest > testBasicValidation PASSED

unit.kafka.server.FetchRequestDownConversionConfigTest > testV1FetchWithDownConversionDisabled
STARTED

unit.kafka.server.FetchRequestDownConversionConfigTest > testV1FetchWithDownConversionDisabled
PASSED

unit.kafka.server.FetchRequestDownConversionConfigTest > testV1FetchFromReplica STARTED

unit.kafka.server.FetchRequestDownConversionConfigTest > testV1FetchFromReplica PASSED

unit.kafka.server.FetchRequestDownConversionConfigTest > testLatestFetchWithDownConversionDisabled
STARTED

unit.kafka.server.FetchRequestDownConversionConfigTest > testLatestFetchWithDownConversionDisabled
PASSED

unit.kafka.server.FetchRequestDownConversionConfigTest > testV1FetchWithTopicLevelOverrides
STARTED

unit.kafka.server.FetchRequestDownConversionConfigTest > testV1FetchWithTopicLevelOverrides
PASSED

2057 tests completed, 2 failed, 4 skipped

> Task :kafka-2.0-jdk8:core:test FAILED
> Task :testScala_2_11 FAILED

FAILURE: Build failed with an exception.

* What went wrong:
Execution failed for task ':kafka-2.0-jdk8:core:test'.
> There were failing tests. See the report at: file://<https://builds.apache.org/job/kafka-2.0-jdk8/ws/core/build/reports/tests/test/index.html>

* Try:
Run with --stacktrace option to get the stack trace. Run with --info or --debug option to
get more log output. Run with --scan to get full insights.

* Get more help at https://help.gradle.org

BUILD FAILED in 1h 57m 52s
25 actionable tasks: 3 executed, 22 up-to-date
Build step 'Execute shell' marked build as failure
[FINDBUGS] Collecting findbugs analysis files...
Setting GRADLE_4_8_1_HOME=/home/jenkins/tools/gradle/4.8.1
[FINDBUGS] Searching for all files in <https://builds.apache.org/job/kafka-2.0-jdk8/ws/>
that match the pattern **/build/reports/findbugs/*.xml
[FINDBUGS] Parsing 1 file in <https://builds.apache.org/job/kafka-2.0-jdk8/ws/>
[FINDBUGS] Successfully parsed file <https://builds.apache.org/job/kafka-2.0-jdk8/ws/core/build/reports/findbugs/main.xml>
with 0 unique warnings and 0 duplicates.
Setting GRADLE_4_8_1_HOME=/home/jenkins/tools/gradle/4.8.1
No credentials specified
Setting GRADLE_4_8_1_HOME=/home/jenkins/tools/gradle/4.8.1
<Git Blamer> Using GitBlamer to create author and commit information for all warnings.
<Git Blamer> GIT_COMMIT=1e7ef95b81579b91fb6e9a4a90680fcd08ec9822, workspace=<https://builds.apache.org/job/kafka-2.0-jdk8/ws/>
[FINDBUGS] Computing warning deltas based on reference build #271
Recording test results
Setting GRADLE_4_8_1_HOME=/home/jenkins/tools/gradle/4.8.1
Setting GRADLE_4_8_1_HOME=/home/jenkins/tools/gradle/4.8.1

Mime
View raw message