kafka-dev mailing list archives

Site index · List index
Message view « Date » · « Thread »
Top « Date » · « Thread »
From Apache Jenkins Server <jenk...@builds.apache.org>
Subject Build failed in Jenkins: kafka-2.1-jdk8 #93
Date Thu, 03 Jan 2019 09:24:39 GMT
See <https://builds.apache.org/job/kafka-2.1-jdk8/93/display/redirect?page=changes>

Changes:

[cshapi] MINOR: Upgrade to Gradle 4.10.3

------------------------------------------
[...truncated 736.97 KB...]
kafka.api.GroupEndToEndAuthorizationTest > testNoGroupAcl STARTED

kafka.api.GroupEndToEndAuthorizationTest > testNoGroupAcl PASSED

kafka.api.GroupEndToEndAuthorizationTest > testNoProduceWithDescribeAcl STARTED

kafka.api.GroupEndToEndAuthorizationTest > testNoProduceWithDescribeAcl PASSED

kafka.api.GroupEndToEndAuthorizationTest > testProduceConsumeViaSubscribe STARTED

kafka.api.GroupEndToEndAuthorizationTest > testProduceConsumeViaSubscribe PASSED

kafka.api.GroupEndToEndAuthorizationTest > testNoProduceWithoutDescribeAcl STARTED
ERROR: Could not install GRADLE_4_8_1_HOME
java.lang.NullPointerException
	at hudson.plugins.toolenv.ToolEnvBuildWrapper$1.buildEnvVars(ToolEnvBuildWrapper.java:46)
	at hudson.model.AbstractBuild.getEnvironment(AbstractBuild.java:881)
	at hudson.plugins.git.GitSCM.getParamExpandedRepos(GitSCM.java:483)
	at hudson.plugins.git.GitSCM.compareRemoteRevisionWithImpl(GitSCM.java:692)
	at hudson.plugins.git.GitSCM.compareRemoteRevisionWith(GitSCM.java:657)
	at hudson.scm.SCM.compareRemoteRevisionWith(SCM.java:400)
	at hudson.scm.SCM.poll(SCM.java:417)
	at hudson.model.AbstractProject._poll(AbstractProject.java:1390)
	at hudson.model.AbstractProject.poll(AbstractProject.java:1293)
	at hudson.triggers.SCMTrigger$Runner.runPolling(SCMTrigger.java:603)
	at hudson.triggers.SCMTrigger$Runner.run(SCMTrigger.java:649)
	at hudson.util.SequentialExecutionQueue$QueueEntry.run(SequentialExecutionQueue.java:119)
	at java.util.concurrent.Executors$RunnableAdapter.call(Executors.java:511)
	at java.util.concurrent.FutureTask.run(FutureTask.java:266)
	at java.util.concurrent.ThreadPoolExecutor.runWorker(ThreadPoolExecutor.java:1149)
	at java.util.concurrent.ThreadPoolExecutor$Worker.run(ThreadPoolExecutor.java:624)
	at java.lang.Thread.run(Thread.java:748)

kafka.api.GroupEndToEndAuthorizationTest > testNoProduceWithoutDescribeAcl PASSED

kafka.api.test.ProducerCompressionTest > testCompression[0 compressionType = none] STARTED

kafka.api.test.ProducerCompressionTest > testCompression[0 compressionType = none] PASSED

kafka.api.test.ProducerCompressionTest > testCompression[1 compressionType = gzip] STARTED

kafka.api.test.ProducerCompressionTest > testCompression[1 compressionType = gzip] PASSED

kafka.api.test.ProducerCompressionTest > testCompression[2 compressionType = snappy] STARTED

kafka.api.test.ProducerCompressionTest > testCompression[2 compressionType = snappy] PASSED

kafka.api.test.ProducerCompressionTest > testCompression[3 compressionType = lz4] STARTED

kafka.api.test.ProducerCompressionTest > testCompression[3 compressionType = lz4] PASSED

kafka.api.test.ProducerCompressionTest > testCompression[4 compressionType = zstd] STARTED

kafka.api.test.ProducerCompressionTest > testCompression[4 compressionType = zstd] PASSED

kafka.api.GroupAuthorizerIntegrationTest > testCommitWithTopicWrite STARTED

kafka.api.GroupAuthorizerIntegrationTest > testCommitWithTopicWrite PASSED

kafka.api.GroupAuthorizerIntegrationTest > shouldInitTransactionsWhenAclSet STARTED

kafka.api.GroupAuthorizerIntegrationTest > shouldInitTransactionsWhenAclSet PASSED

kafka.api.GroupAuthorizerIntegrationTest > testDeleteGroupApiWithNoDeleteGroupAcl STARTED

kafka.api.GroupAuthorizerIntegrationTest > testDeleteGroupApiWithNoDeleteGroupAcl PASSED

kafka.api.GroupAuthorizerIntegrationTest > testPatternSubscriptionWithTopicAndGroupRead
STARTED

kafka.api.GroupAuthorizerIntegrationTest > testPatternSubscriptionWithTopicAndGroupRead
PASSED

kafka.api.GroupAuthorizerIntegrationTest > testPatternSubscriptionWithNoTopicAccess STARTED

kafka.api.GroupAuthorizerIntegrationTest > testPatternSubscriptionWithNoTopicAccess PASSED

kafka.api.GroupAuthorizerIntegrationTest > testCreatePermissionOnClusterToWriteToNonExistentTopic
STARTED

kafka.api.GroupAuthorizerIntegrationTest > testCreatePermissionOnClusterToWriteToNonExistentTopic
PASSED

kafka.api.GroupAuthorizerIntegrationTest > testCreatePermissionOnClusterToReadFromNonExistentTopic
STARTED

kafka.api.GroupAuthorizerIntegrationTest > testCreatePermissionOnClusterToReadFromNonExistentTopic
PASSED

kafka.api.GroupAuthorizerIntegrationTest > testUnauthorizedDeleteTopicsWithDescribe STARTED

kafka.api.GroupAuthorizerIntegrationTest > testUnauthorizedDeleteTopicsWithDescribe PASSED

kafka.api.GroupAuthorizerIntegrationTest > shouldSuccessfullyAbortTransactionAfterTopicAuthorizationException
STARTED

kafka.api.GroupAuthorizerIntegrationTest > shouldSuccessfullyAbortTransactionAfterTopicAuthorizationException
PASSED

kafka.api.GroupAuthorizerIntegrationTest > testSendOffsetsWithNoConsumerGroupWriteAccess
STARTED

kafka.api.GroupAuthorizerIntegrationTest > testSendOffsetsWithNoConsumerGroupWriteAccess
PASSED

kafka.api.GroupAuthorizerIntegrationTest > testPatternSubscriptionWithTopicDescribeOnlyAndGroupRead
STARTED

kafka.api.GroupAuthorizerIntegrationTest > testPatternSubscriptionWithTopicDescribeOnlyAndGroupRead
PASSED

kafka.api.GroupAuthorizerIntegrationTest > testDescribeGroupCliWithGroupDescribe STARTED

kafka.api.GroupAuthorizerIntegrationTest > testDescribeGroupCliWithGroupDescribe PASSED

kafka.api.GroupAuthorizerIntegrationTest > testTransactionalProducerTopicAuthorizationExceptionInCommit
STARTED

kafka.api.GroupAuthorizerIntegrationTest > testTransactionalProducerTopicAuthorizationExceptionInCommit
PASSED

kafka.api.GroupAuthorizerIntegrationTest > testOffsetFetchWithNoAccess STARTED

kafka.api.GroupAuthorizerIntegrationTest > testOffsetFetchWithNoAccess PASSED

kafka.api.GroupAuthorizerIntegrationTest > testConsumeUsingAssignWithNoAccess STARTED

kafka.api.GroupAuthorizerIntegrationTest > testConsumeUsingAssignWithNoAccess PASSED

kafka.api.GroupAuthorizerIntegrationTest > testProduceWithTopicRead STARTED

kafka.api.GroupAuthorizerIntegrationTest > testProduceWithTopicRead PASSED

kafka.api.GroupAuthorizerIntegrationTest > testListOffsetsWithNoTopicAccess STARTED

kafka.api.GroupAuthorizerIntegrationTest > testListOffsetsWithNoTopicAccess PASSED

kafka.api.GroupAuthorizerIntegrationTest > testDeleteGroupApiWithDeleteGroupAcl STARTED

kafka.api.GroupAuthorizerIntegrationTest > testDeleteGroupApiWithDeleteGroupAcl PASSED

kafka.api.GroupAuthorizerIntegrationTest > testDeleteRecordsWithWildCardAuth STARTED

kafka.api.GroupAuthorizerIntegrationTest > testDeleteRecordsWithWildCardAuth PASSED

kafka.api.GroupAuthorizerIntegrationTest > testFetchFollowerRequest STARTED

kafka.api.GroupAuthorizerIntegrationTest > testFetchFollowerRequest PASSED

kafka.api.GroupAuthorizerIntegrationTest > testIdempotentProducerNoIdempotentWriteAclInProduce
STARTED

kafka.api.GroupAuthorizerIntegrationTest > testIdempotentProducerNoIdempotentWriteAclInProduce
PASSED

kafka.api.GroupAuthorizerIntegrationTest > testCreatePermissionOnTopicToReadFromNonExistentTopic
STARTED

kafka.api.GroupAuthorizerIntegrationTest > testCreatePermissionOnTopicToReadFromNonExistentTopic
PASSED

kafka.api.GroupAuthorizerIntegrationTest > testPatternSubscriptionMatchingInternalTopicWithDescribeOnlyPermission
STARTED

kafka.api.GroupAuthorizerIntegrationTest > testPatternSubscriptionMatchingInternalTopicWithDescribeOnlyPermission
PASSED

kafka.api.GroupAuthorizerIntegrationTest > testSimpleConsumeWithOffsetLookupAndNoGroupAccess
STARTED

kafka.api.GroupAuthorizerIntegrationTest > testSimpleConsumeWithOffsetLookupAndNoGroupAccess
PASSED

kafka.api.GroupAuthorizerIntegrationTest > testDeleteTopicsWithWildCardAuth STARTED

kafka.api.GroupAuthorizerIntegrationTest > testDeleteTopicsWithWildCardAuth PASSED

kafka.api.GroupAuthorizerIntegrationTest > testConsumeWithTopicDescribe STARTED
ERROR: Could not install GRADLE_4_8_1_HOME
java.lang.NullPointerException
	at hudson.plugins.toolenv.ToolEnvBuildWrapper$1.buildEnvVars(ToolEnvBuildWrapper.java:46)
	at hudson.model.AbstractBuild.getEnvironment(AbstractBuild.java:881)
	at hudson.plugins.git.GitSCM.getParamExpandedRepos(GitSCM.java:483)
	at hudson.plugins.git.GitSCM.compareRemoteRevisionWithImpl(GitSCM.java:692)
	at hudson.plugins.git.GitSCM.compareRemoteRevisionWith(GitSCM.java:657)
	at hudson.scm.SCM.compareRemoteRevisionWith(SCM.java:400)
	at hudson.scm.SCM.poll(SCM.java:417)
	at hudson.model.AbstractProject._poll(AbstractProject.java:1390)
	at hudson.model.AbstractProject.poll(AbstractProject.java:1293)
	at hudson.triggers.SCMTrigger$Runner.runPolling(SCMTrigger.java:603)
	at hudson.triggers.SCMTrigger$Runner.run(SCMTrigger.java:649)
	at hudson.util.SequentialExecutionQueue$QueueEntry.run(SequentialExecutionQueue.java:119)
	at java.util.concurrent.Executors$RunnableAdapter.call(Executors.java:511)
	at java.util.concurrent.FutureTask.run(FutureTask.java:266)
	at java.util.concurrent.ThreadPoolExecutor.runWorker(ThreadPoolExecutor.java:1149)
	at java.util.concurrent.ThreadPoolExecutor$Worker.run(ThreadPoolExecutor.java:624)
	at java.lang.Thread.run(Thread.java:748)
ERROR: Could not install GRADLE_4_8_1_HOME
java.lang.NullPointerException
	at hudson.plugins.toolenv.ToolEnvBuildWrapper$1.buildEnvVars(ToolEnvBuildWrapper.java:46)
	at hudson.model.AbstractBuild.getEnvironment(AbstractBuild.java:881)
	at hudson.plugins.git.GitSCM.getParamExpandedRepos(GitSCM.java:483)
	at hudson.plugins.git.GitSCM.compareRemoteRevisionWithImpl(GitSCM.java:692)
	at hudson.plugins.git.GitSCM.compareRemoteRevisionWith(GitSCM.java:657)
	at hudson.scm.SCM.compareRemoteRevisionWith(SCM.java:400)
	at hudson.scm.SCM.poll(SCM.java:417)
	at hudson.model.AbstractProject._poll(AbstractProject.java:1390)
	at hudson.model.AbstractProject.poll(AbstractProject.java:1293)
	at hudson.triggers.SCMTrigger$Runner.runPolling(SCMTrigger.java:603)
	at hudson.triggers.SCMTrigger$Runner.run(SCMTrigger.java:649)
	at hudson.util.SequentialExecutionQueue$QueueEntry.run(SequentialExecutionQueue.java:119)
	at java.util.concurrent.Executors$RunnableAdapter.call(Executors.java:511)
	at java.util.concurrent.FutureTask.run(FutureTask.java:266)
	at java.util.concurrent.ThreadPoolExecutor.runWorker(ThreadPoolExecutor.java:1149)
	at java.util.concurrent.ThreadPoolExecutor$Worker.run(ThreadPoolExecutor.java:624)
	at java.lang.Thread.run(Thread.java:748)
ERROR: Could not install GRADLE_4_8_1_HOME
java.lang.NullPointerException
	at hudson.plugins.toolenv.ToolEnvBuildWrapper$1.buildEnvVars(ToolEnvBuildWrapper.java:46)
	at hudson.model.AbstractBuild.getEnvironment(AbstractBuild.java:881)
	at hudson.plugins.git.GitSCM.getParamExpandedRepos(GitSCM.java:483)
	at hudson.plugins.git.GitSCM.compareRemoteRevisionWithImpl(GitSCM.java:692)
	at hudson.plugins.git.GitSCM.compareRemoteRevisionWith(GitSCM.java:657)
	at hudson.scm.SCM.compareRemoteRevisionWith(SCM.java:400)
	at hudson.scm.SCM.poll(SCM.java:417)
	at hudson.model.AbstractProject._poll(AbstractProject.java:1390)
	at hudson.model.AbstractProject.poll(AbstractProject.java:1293)
	at hudson.triggers.SCMTrigger$Runner.runPolling(SCMTrigger.java:603)
	at hudson.triggers.SCMTrigger$Runner.run(SCMTrigger.java:649)
	at hudson.util.SequentialExecutionQueue$QueueEntry.run(SequentialExecutionQueue.java:119)
	at java.util.concurrent.Executors$RunnableAdapter.call(Executors.java:511)
	at java.util.concurrent.FutureTask.run(FutureTask.java:266)
	at java.util.concurrent.ThreadPoolExecutor.runWorker(ThreadPoolExecutor.java:1149)
	at java.util.concurrent.ThreadPoolExecutor$Worker.run(ThreadPoolExecutor.java:624)
	at java.lang.Thread.run(Thread.java:748)
Build timed out (after 360 minutes). Marking the build as failed.
Build was aborted
[FINDBUGS] Collecting findbugs analysis files...
Setting GRADLE_4_8_1_HOME=/home/jenkins/tools/gradle/4.8.1
[FINDBUGS] Searching for all files in <https://builds.apache.org/job/kafka-2.1-jdk8/ws/>
that match the pattern **/build/reports/findbugs/*.xml
[FINDBUGS] No files found. Configuration error?
Setting GRADLE_4_8_1_HOME=/home/jenkins/tools/gradle/4.8.1
Setting GRADLE_4_8_1_HOME=/home/jenkins/tools/gradle/4.8.1
<Git Blamer> Using GitBlamer to create author and commit information for all warnings.
<Git Blamer> GIT_COMMIT=d860084dd9a0865fae9f9eacea6dbd14d16b7a94, workspace=<https://builds.apache.org/job/kafka-2.1-jdk8/ws/>
[FINDBUGS] Computing warning deltas based on reference build #92
Recording test results
Setting GRADLE_4_8_1_HOME=/home/jenkins/tools/gradle/4.8.1
Setting GRADLE_4_8_1_HOME=/home/jenkins/tools/gradle/4.8.1

kafka.api.GroupAuthorizerIntegrationTest > testConsumeWithTopicDescribe SKIPPED

> Task :kafka-2.1-jdk8:core:test FAILED
> Task :testScala_2_12 FAILED

FAILURE: Build failed with an exception.

* What went wrong:
Execution failed for task ':kafka-2.1-jdk8:core:test'.
> Process 'Gradle Test Executor 7' finished with non-zero exit value 143
  This problem might be caused by incorrect test process configuration.
  Please refer to the test execution section in the user guide at https://docs.gradle.org/4.10.3/userguide/java_plugin.html#sec:test_execution

* Try:
Run with --stacktrace option to get the stack trace. Run with --info or --debug option to
get more log output. Run with --scan to get full insights.

* Get more help at https://help.gradle.org

BUILD FAILED in 5h 59m 46s
27 actionable tasks: 18 executed, 9 up-to-date
Not sending mail to unregistered user cshapi@gmail.com

Mime
View raw message