kafka-dev mailing list archives

Site index · List index
Message view « Date » · « Thread »
Top « Date » · « Thread »
From Apache Jenkins Server <jenk...@builds.apache.org>
Subject Build failed in Jenkins: kafka-2.0-jdk8 #210
Date Tue, 08 Jan 2019 19:56:56 GMT
See <https://builds.apache.org/job/kafka-2.0-jdk8/210/display/redirect?page=changes>

Changes:

[jason] KAFKA-7253; The returned connector type is always null when creating

------------------------------------------
[...truncated 437.65 KB...]
kafka.coordinator.group.GroupMetadataTest > testStableToStableIllegalTransition STARTED

kafka.coordinator.group.GroupMetadataTest > testStableToStableIllegalTransition PASSED

kafka.coordinator.group.GroupMetadataTest > testOffsetCommitFailureWithAnotherPending STARTED

kafka.coordinator.group.GroupMetadataTest > testOffsetCommitFailureWithAnotherPending PASSED

kafka.coordinator.group.GroupMetadataTest > testDeadToStableIllegalTransition STARTED

kafka.coordinator.group.GroupMetadataTest > testDeadToStableIllegalTransition PASSED

kafka.coordinator.group.GroupMetadataTest > testOffsetCommit STARTED

kafka.coordinator.group.GroupMetadataTest > testOffsetCommit PASSED

kafka.coordinator.group.GroupMetadataTest > testAwaitingRebalanceToStableTransition STARTED

kafka.coordinator.group.GroupMetadataTest > testAwaitingRebalanceToStableTransition PASSED

kafka.coordinator.group.GroupMetadataTest > testSupportsProtocols STARTED

kafka.coordinator.group.GroupMetadataTest > testSupportsProtocols PASSED

kafka.coordinator.group.GroupMetadataTest > testEmptyToStableIllegalTransition STARTED

kafka.coordinator.group.GroupMetadataTest > testEmptyToStableIllegalTransition PASSED

kafka.coordinator.group.GroupMetadataTest > testCanRebalanceWhenStable STARTED

kafka.coordinator.group.GroupMetadataTest > testCanRebalanceWhenStable PASSED

kafka.coordinator.group.GroupMetadataTest > testOffsetCommitWithAnotherPending STARTED

kafka.coordinator.group.GroupMetadataTest > testOffsetCommitWithAnotherPending PASSED

kafka.coordinator.group.GroupMetadataTest > testPreparingRebalanceToPreparingRebalanceIllegalTransition
STARTED

kafka.coordinator.group.GroupMetadataTest > testPreparingRebalanceToPreparingRebalanceIllegalTransition
PASSED

kafka.coordinator.group.GroupMetadataTest > testSelectProtocolChoosesCompatibleProtocol
STARTED

kafka.coordinator.group.GroupMetadataTest > testSelectProtocolChoosesCompatibleProtocol
PASSED

kafka.coordinator.group.GroupCoordinatorConcurrencyTest > testConcurrentGoodPathSequence
STARTED

kafka.coordinator.group.GroupCoordinatorConcurrencyTest > testConcurrentGoodPathSequence
PASSED

kafka.coordinator.group.GroupCoordinatorConcurrencyTest > testConcurrentTxnGoodPathSequence
STARTED

kafka.coordinator.group.GroupCoordinatorConcurrencyTest > testConcurrentTxnGoodPathSequence
PASSED

kafka.coordinator.group.GroupCoordinatorConcurrencyTest > testConcurrentRandomSequence
STARTED

kafka.coordinator.group.GroupCoordinatorConcurrencyTest > testConcurrentRandomSequence
PASSED

kafka.coordinator.group.GroupMetadataManagerTest > testLoadOffsetsWithEmptyControlBatch
STARTED

kafka.coordinator.group.GroupMetadataManagerTest > testLoadOffsetsWithEmptyControlBatch
PASSED

kafka.coordinator.group.GroupMetadataManagerTest > testStoreNonEmptyGroup STARTED

kafka.coordinator.group.GroupMetadataManagerTest > testStoreNonEmptyGroup PASSED

kafka.coordinator.group.GroupMetadataManagerTest > testLoadOffsetsWithTombstones STARTED

kafka.coordinator.group.GroupMetadataManagerTest > testLoadOffsetsWithTombstones PASSED

kafka.coordinator.group.GroupMetadataManagerTest > testLoadWithCommittedAndAbortedTransactionalOffsetCommits
STARTED

kafka.coordinator.group.GroupMetadataManagerTest > testLoadWithCommittedAndAbortedTransactionalOffsetCommits
PASSED

kafka.coordinator.group.GroupMetadataManagerTest > testTransactionalCommitOffsetCommitted
STARTED

kafka.coordinator.group.GroupMetadataManagerTest > testTransactionalCommitOffsetCommitted
PASSED

kafka.coordinator.group.GroupMetadataManagerTest > testLoadOffsetsWithoutGroup STARTED

kafka.coordinator.group.GroupMetadataManagerTest > testLoadOffsetsWithoutGroup PASSED

kafka.coordinator.group.GroupMetadataManagerTest > testGroupNotExists STARTED

kafka.coordinator.group.GroupMetadataManagerTest > testGroupNotExists PASSED

kafka.coordinator.group.GroupMetadataManagerTest > testLoadEmptyGroupWithOffsets STARTED

kafka.coordinator.group.GroupMetadataManagerTest > testLoadEmptyGroupWithOffsets PASSED

kafka.coordinator.group.GroupMetadataManagerTest > testLoadTransactionalOffsetCommitsFromMultipleProducers
STARTED

kafka.coordinator.group.GroupMetadataManagerTest > testLoadTransactionalOffsetCommitsFromMultipleProducers
PASSED

kafka.coordinator.group.GroupMetadataManagerTest > testStoreEmptySimpleGroup STARTED

kafka.coordinator.group.GroupMetadataManagerTest > testStoreEmptySimpleGroup PASSED

kafka.coordinator.group.GroupMetadataManagerTest > testAddGroup STARTED

kafka.coordinator.group.GroupMetadataManagerTest > testAddGroup PASSED

kafka.coordinator.group.GroupMetadataManagerTest > testLoadGroupWithLargeGroupMetadataRecord
STARTED

kafka.coordinator.group.GroupMetadataManagerTest > testLoadGroupWithLargeGroupMetadataRecord
PASSED

kafka.coordinator.group.GroupMetadataManagerTest > testGroupMetadataRemovalWithLogAppendTime
STARTED

kafka.coordinator.group.GroupMetadataManagerTest > testGroupMetadataRemovalWithLogAppendTime
PASSED

kafka.coordinator.group.GroupMetadataManagerTest > testGroupLoadWithConsumerAndTransactionalOffsetCommitsTransactionWins
STARTED

kafka.coordinator.group.GroupMetadataManagerTest > testGroupLoadWithConsumerAndTransactionalOffsetCommitsTransactionWins
PASSED

kafka.coordinator.group.GroupMetadataManagerTest > testOffsetWriteAfterGroupRemoved STARTED

kafka.coordinator.group.GroupMetadataManagerTest > testOffsetWriteAfterGroupRemoved PASSED

kafka.coordinator.group.GroupMetadataManagerTest > testLoadTransactionalOffsetsWithoutGroup
STARTED

kafka.coordinator.group.GroupMetadataManagerTest > testLoadTransactionalOffsetsWithoutGroup
PASSED

kafka.coordinator.group.GroupMetadataManagerTest > testCommitOffsetWhenCoordinatorHasMoved
STARTED

kafka.coordinator.group.GroupMetadataManagerTest > testCommitOffsetWhenCoordinatorHasMoved
PASSED

kafka.coordinator.group.GroupMetadataManagerTest > testStoreNonEmptyGroupWhenCoordinatorHasMoved
STARTED

kafka.coordinator.group.GroupMetadataManagerTest > testStoreNonEmptyGroupWhenCoordinatorHasMoved
PASSED

kafka.coordinator.group.GroupMetadataManagerTest > testGroupLoadWithConsumerAndTransactionalOffsetCommitsConsumerWins
STARTED

kafka.coordinator.group.GroupMetadataManagerTest > testGroupLoadWithConsumerAndTransactionalOffsetCommitsConsumerWins
PASSED

kafka.coordinator.group.GroupMetadataManagerTest > testCommitOffset STARTED

kafka.coordinator.group.GroupMetadataManagerTest > testCommitOffset PASSED

kafka.coordinator.group.GroupMetadataManagerTest > testTransactionalCommitOffsetAborted
STARTED

kafka.coordinator.group.GroupMetadataManagerTest > testTransactionalCommitOffsetAborted
PASSED

kafka.coordinator.group.GroupMetadataManagerTest > testMetrics STARTED

kafka.coordinator.group.GroupMetadataManagerTest > testMetrics PASSED

kafka.coordinator.group.GroupMetadataManagerTest > testTransactionalCommitOffsetAppendFailure
STARTED

kafka.coordinator.group.GroupMetadataManagerTest > testTransactionalCommitOffsetAppendFailure
PASSED

kafka.coordinator.group.GroupMetadataManagerTest > testGroupMetadataRemoval STARTED

kafka.coordinator.group.GroupMetadataManagerTest > testGroupMetadataRemoval PASSED

kafka.coordinator.group.GroupMetadataManagerTest > testLoadGroupWithTombstone STARTED

kafka.coordinator.group.GroupMetadataManagerTest > testLoadGroupWithTombstone PASSED

kafka.coordinator.group.GroupMetadataManagerTest > testLoadWithCommittedAndAbortedAndPendingTransactionalOffsetCommits
STARTED

kafka.coordinator.group.GroupMetadataManagerTest > testLoadWithCommittedAndAbortedAndPendingTransactionalOffsetCommits
PASSED

kafka.coordinator.group.GroupMetadataManagerTest > testLoadOffsetsAndGroup STARTED

kafka.coordinator.group.GroupMetadataManagerTest > testLoadOffsetsAndGroup PASSED

kafka.coordinator.group.GroupMetadataManagerTest > testGroupLoadedWithPendingCommits STARTED

kafka.coordinator.group.GroupMetadataManagerTest > testGroupLoadedWithPendingCommits PASSED

kafka.coordinator.group.GroupMetadataManagerTest > testStoreGroupErrorMapping STARTED

kafka.coordinator.group.GroupMetadataManagerTest > testStoreGroupErrorMapping PASSED

kafka.coordinator.group.GroupMetadataManagerTest > testCommitOffsetFailure STARTED

kafka.coordinator.group.GroupMetadataManagerTest > testCommitOffsetFailure PASSED

kafka.coordinator.group.GroupMetadataManagerTest > testLoadGroupAndOffsetsFromDifferentSegments
STARTED

kafka.coordinator.group.GroupMetadataManagerTest > testLoadGroupAndOffsetsFromDifferentSegments
PASSED

kafka.coordinator.group.GroupMetadataManagerTest > testExpireOffset STARTED

kafka.coordinator.group.GroupMetadataManagerTest > testExpireOffset PASSED

kafka.coordinator.group.GroupMetadataManagerTest > testExpireOffsetsWithActiveGroup STARTED

kafka.coordinator.group.GroupMetadataManagerTest > testExpireOffsetsWithActiveGroup PASSED

kafka.coordinator.group.GroupMetadataManagerTest > testExpireGroupWithOffsetsOnly STARTED

kafka.coordinator.group.GroupMetadataManagerTest > testExpireGroupWithOffsetsOnly PASSED

kafka.coordinator.group.GroupMetadataManagerTest > testDoNotLoadAbortedTransactionalOffsetCommits
STARTED

kafka.coordinator.group.GroupMetadataManagerTest > testDoNotLoadAbortedTransactionalOffsetCommits
PASSED

kafka.coordinator.group.GroupMetadataManagerTest > testStoreEmptyGroup STARTED

kafka.coordinator.group.GroupMetadataManagerTest > testStoreEmptyGroup PASSED

unit.kafka.server.FetchRequestDownConversionConfigTest > testV1FetchWithDownConversionDisabled
STARTED

unit.kafka.server.FetchRequestDownConversionConfigTest > testV1FetchWithDownConversionDisabled
PASSED

unit.kafka.server.FetchRequestDownConversionConfigTest > testV1FetchFromReplica STARTED

unit.kafka.server.FetchRequestDownConversionConfigTest > testV1FetchFromReplica PASSED

unit.kafka.server.FetchRequestDownConversionConfigTest > testLatestFetchWithDownConversionDisabled
STARTED

unit.kafka.server.FetchRequestDownConversionConfigTest > testLatestFetchWithDownConversionDisabled
PASSED

unit.kafka.server.FetchRequestDownConversionConfigTest > testV1FetchWithTopicLevelOverrides
STARTED

unit.kafka.server.FetchRequestDownConversionConfigTest > testV1FetchWithTopicLevelOverrides
PASSED

2046 tests completed, 1 failed, 4 skipped

> Task :kafka-2.0-jdk8:core:test FAILED
> Task :testScala_2_11 FAILED

FAILURE: Build failed with an exception.

* What went wrong:
Execution failed for task ':kafka-2.0-jdk8:core:test'.
> There were failing tests. See the report at: file://<https://builds.apache.org/job/kafka-2.0-jdk8/ws/core/build/reports/tests/test/index.html>

* Try:
Run with --stacktrace option to get the stack trace. Run with --info or --debug option to
get more log output. Run with --scan to get full insights.

* Get more help at https://help.gradle.org

BUILD FAILED in 1h 59m 5s
25 actionable tasks: 3 executed, 22 up-to-date
Build step 'Execute shell' marked build as failure
[FINDBUGS] Collecting findbugs analysis files...
Setting GRADLE_4_8_1_HOME=/home/jenkins/tools/gradle/4.8.1
[FINDBUGS] Searching for all files in <https://builds.apache.org/job/kafka-2.0-jdk8/ws/>
that match the pattern **/build/reports/findbugs/*.xml
[FINDBUGS] Parsing 1 file in <https://builds.apache.org/job/kafka-2.0-jdk8/ws/>
[FINDBUGS] Successfully parsed file <https://builds.apache.org/job/kafka-2.0-jdk8/ws/core/build/reports/findbugs/main.xml>
with 0 unique warnings and 0 duplicates.
Setting GRADLE_4_8_1_HOME=/home/jenkins/tools/gradle/4.8.1
Setting GRADLE_4_8_1_HOME=/home/jenkins/tools/gradle/4.8.1
<Git Blamer> Using GitBlamer to create author and commit information for all warnings.
<Git Blamer> GIT_COMMIT=dbaa15226bc8f7dfe300346dec55a93e61741db7, workspace=<https://builds.apache.org/job/kafka-2.0-jdk8/ws/>
[FINDBUGS] Computing warning deltas based on reference build #204
Recording test results
Setting GRADLE_4_8_1_HOME=/home/jenkins/tools/gradle/4.8.1
Setting GRADLE_4_8_1_HOME=/home/jenkins/tools/gradle/4.8.1
Not sending mail to unregistered user wangguoz@gmail.com

Mime
View raw message