kafka-dev mailing list archives

Site index · List index
Message view « Date » · « Thread »
Top « Date » · « Thread »
From Apache Jenkins Server <jenk...@builds.apache.org>
Subject Build failed in Jenkins: kafka-2.0-jdk8 #209
Date Thu, 03 Jan 2019 02:27:51 GMT
See <https://builds.apache.org/job/kafka-2.0-jdk8/209/display/redirect?page=changes>

Changes:

[jason] KAFKA-5503; Idempotent producer ignores shutdown while fetching

------------------------------------------
[...truncated 2.66 MB...]
org.apache.kafka.connect.util.ShutdownableThreadTest > testForcibleShutdown PASSED

org.apache.kafka.connect.util.TopicAdminTest > shouldNotCreateTopicWhenItAlreadyExists
STARTED

org.apache.kafka.connect.util.TopicAdminTest > shouldNotCreateTopicWhenItAlreadyExists
PASSED

org.apache.kafka.connect.util.TopicAdminTest > shouldCreateTopicWhenItDoesNotExist STARTED

org.apache.kafka.connect.util.TopicAdminTest > shouldCreateTopicWhenItDoesNotExist PASSED

org.apache.kafka.connect.util.TopicAdminTest > shouldReturnFalseWhenSuppliedNullTopicDescription
STARTED

org.apache.kafka.connect.util.TopicAdminTest > shouldReturnFalseWhenSuppliedNullTopicDescription
PASSED

org.apache.kafka.connect.util.TopicAdminTest > returnNullWithApiVersionMismatch STARTED

org.apache.kafka.connect.util.TopicAdminTest > returnNullWithApiVersionMismatch PASSED

org.apache.kafka.connect.util.TopicAdminTest > shouldCreateOneTopicWhenProvidedMultipleDefinitionsWithSameTopicName
STARTED

org.apache.kafka.connect.util.TopicAdminTest > shouldCreateOneTopicWhenProvidedMultipleDefinitionsWithSameTopicName
PASSED

org.apache.kafka.connect.util.TopicAdminTest > returnNullWithClusterAuthorizationFailure
STARTED

org.apache.kafka.connect.util.TopicAdminTest > returnNullWithClusterAuthorizationFailure
PASSED

org.apache.kafka.connect.util.TableTest > basicOperations STARTED

org.apache.kafka.connect.util.TableTest > basicOperations PASSED

org.apache.kafka.connect.util.ConnectUtilsTest > testLookupNullKafkaClusterId STARTED

org.apache.kafka.connect.util.ConnectUtilsTest > testLookupNullKafkaClusterId PASSED

org.apache.kafka.connect.util.ConnectUtilsTest > testLookupKafkaClusterId STARTED

org.apache.kafka.connect.util.ConnectUtilsTest > testLookupKafkaClusterId PASSED

org.apache.kafka.connect.util.ConnectUtilsTest > testLookupKafkaClusterIdTimeout STARTED

org.apache.kafka.connect.util.ConnectUtilsTest > testLookupKafkaClusterIdTimeout PASSED

org.apache.kafka.connect.storage.KafkaConfigBackingStoreTest > testPutTaskConfigs STARTED

org.apache.kafka.connect.storage.KafkaConfigBackingStoreTest > testPutTaskConfigs PASSED

org.apache.kafka.connect.storage.KafkaConfigBackingStoreTest > testPutConnectorConfig STARTED

org.apache.kafka.connect.storage.KafkaConfigBackingStoreTest > testPutConnectorConfig PASSED

org.apache.kafka.connect.storage.KafkaConfigBackingStoreTest > testStartStop STARTED

org.apache.kafka.connect.storage.KafkaConfigBackingStoreTest > testStartStop PASSED

org.apache.kafka.connect.storage.KafkaConfigBackingStoreTest > testPutTaskConfigsZeroTasks
STARTED

org.apache.kafka.connect.storage.KafkaConfigBackingStoreTest > testPutTaskConfigsZeroTasks
PASSED

org.apache.kafka.connect.storage.KafkaConfigBackingStoreTest > testRestoreTargetState STARTED

org.apache.kafka.connect.storage.KafkaConfigBackingStoreTest > testRestoreTargetState PASSED

org.apache.kafka.connect.storage.KafkaConfigBackingStoreTest > testBackgroundUpdateTargetState
STARTED

org.apache.kafka.connect.storage.KafkaConfigBackingStoreTest > testBackgroundUpdateTargetState
PASSED

org.apache.kafka.connect.storage.KafkaConfigBackingStoreTest > testBackgroundConnectorDeletion
STARTED

org.apache.kafka.connect.storage.KafkaConfigBackingStoreTest > testBackgroundConnectorDeletion
PASSED

org.apache.kafka.connect.storage.KafkaConfigBackingStoreTest > testRestoreTargetStateUnexpectedDeletion
STARTED

org.apache.kafka.connect.storage.KafkaConfigBackingStoreTest > testRestoreTargetStateUnexpectedDeletion
PASSED

org.apache.kafka.connect.storage.KafkaConfigBackingStoreTest > testRestore STARTED

org.apache.kafka.connect.storage.KafkaConfigBackingStoreTest > testRestore PASSED

org.apache.kafka.connect.storage.KafkaConfigBackingStoreTest > testRestoreConnectorDeletion
STARTED

org.apache.kafka.connect.storage.KafkaConfigBackingStoreTest > testRestoreConnectorDeletion
PASSED

org.apache.kafka.connect.storage.KafkaConfigBackingStoreTest > testRestoreZeroTasks STARTED

org.apache.kafka.connect.storage.KafkaConfigBackingStoreTest > testRestoreZeroTasks PASSED

org.apache.kafka.connect.storage.KafkaConfigBackingStoreTest > testPutTaskConfigsDoesNotResolveAllInconsistencies
STARTED

org.apache.kafka.connect.storage.KafkaConfigBackingStoreTest > testPutTaskConfigsDoesNotResolveAllInconsistencies
PASSED

org.apache.kafka.connect.storage.KafkaOffsetBackingStoreTest > testReloadOnStart STARTED

org.apache.kafka.connect.storage.KafkaOffsetBackingStoreTest > testReloadOnStart PASSED

org.apache.kafka.connect.storage.KafkaOffsetBackingStoreTest > testStartStop STARTED

org.apache.kafka.connect.storage.KafkaOffsetBackingStoreTest > testStartStop PASSED

org.apache.kafka.connect.storage.KafkaOffsetBackingStoreTest > testSetFailure STARTED

org.apache.kafka.connect.storage.KafkaOffsetBackingStoreTest > testSetFailure PASSED

org.apache.kafka.connect.storage.KafkaOffsetBackingStoreTest > testGetSet STARTED

org.apache.kafka.connect.storage.KafkaOffsetBackingStoreTest > testGetSet PASSED

org.apache.kafka.connect.storage.KafkaOffsetBackingStoreTest > testGetSetNull STARTED

org.apache.kafka.connect.storage.KafkaOffsetBackingStoreTest > testGetSetNull PASSED

org.apache.kafka.connect.storage.KafkaStatusBackingStoreTest > readTaskState STARTED

org.apache.kafka.connect.storage.KafkaStatusBackingStoreTest > readTaskState PASSED

org.apache.kafka.connect.storage.KafkaStatusBackingStoreTest > putTaskState STARTED

org.apache.kafka.connect.storage.KafkaStatusBackingStoreTest > putTaskState PASSED

org.apache.kafka.connect.storage.KafkaStatusBackingStoreTest > putSafeWithNoPreviousValueIsPropagated
STARTED

org.apache.kafka.connect.storage.KafkaStatusBackingStoreTest > putSafeWithNoPreviousValueIsPropagated
PASSED

org.apache.kafka.connect.storage.KafkaStatusBackingStoreTest > putConnectorStateNonRetriableFailure
STARTED

org.apache.kafka.connect.storage.KafkaStatusBackingStoreTest > putConnectorStateNonRetriableFailure
PASSED

org.apache.kafka.connect.storage.KafkaStatusBackingStoreTest > putConnectorStateShouldOverride
STARTED

org.apache.kafka.connect.storage.KafkaStatusBackingStoreTest > putConnectorStateShouldOverride
PASSED

org.apache.kafka.connect.storage.KafkaStatusBackingStoreTest > putConnectorStateRetriableFailure
STARTED

org.apache.kafka.connect.storage.KafkaStatusBackingStoreTest > putConnectorStateRetriableFailure
PASSED

org.apache.kafka.connect.storage.KafkaStatusBackingStoreTest > putSafeOverridesValueSetBySameWorker
STARTED

org.apache.kafka.connect.storage.KafkaStatusBackingStoreTest > putSafeOverridesValueSetBySameWorker
PASSED

org.apache.kafka.connect.storage.KafkaStatusBackingStoreTest > readConnectorState STARTED

org.apache.kafka.connect.storage.KafkaStatusBackingStoreTest > readConnectorState PASSED

org.apache.kafka.connect.storage.KafkaStatusBackingStoreTest > putSafeConnectorIgnoresStaleStatus
STARTED

org.apache.kafka.connect.storage.KafkaStatusBackingStoreTest > putSafeConnectorIgnoresStaleStatus
PASSED

org.apache.kafka.connect.storage.KafkaStatusBackingStoreTest > putConnectorState STARTED

org.apache.kafka.connect.storage.KafkaStatusBackingStoreTest > putConnectorState PASSED

org.apache.kafka.connect.storage.MemoryStatusBackingStoreTest > putAndGetConnectorStatus
STARTED

org.apache.kafka.connect.storage.MemoryStatusBackingStoreTest > putAndGetConnectorStatus
PASSED

org.apache.kafka.connect.storage.MemoryStatusBackingStoreTest > putAndGetTaskStatus STARTED

org.apache.kafka.connect.storage.MemoryStatusBackingStoreTest > putAndGetTaskStatus PASSED

org.apache.kafka.connect.storage.MemoryStatusBackingStoreTest > deleteTaskStatus STARTED

org.apache.kafka.connect.storage.MemoryStatusBackingStoreTest > deleteTaskStatus PASSED

org.apache.kafka.connect.storage.MemoryStatusBackingStoreTest > deleteConnectorStatus STARTED

org.apache.kafka.connect.storage.MemoryStatusBackingStoreTest > deleteConnectorStatus PASSED

org.apache.kafka.connect.storage.OffsetStorageWriterTest > testWriteNullValueFlush STARTED

org.apache.kafka.connect.storage.OffsetStorageWriterTest > testWriteNullValueFlush PASSED

org.apache.kafka.connect.storage.OffsetStorageWriterTest > testWriteNullKeyFlush STARTED

org.apache.kafka.connect.storage.OffsetStorageWriterTest > testWriteNullKeyFlush PASSED

org.apache.kafka.connect.storage.OffsetStorageWriterTest > testNoOffsetsToFlush STARTED

org.apache.kafka.connect.storage.OffsetStorageWriterTest > testNoOffsetsToFlush PASSED

org.apache.kafka.connect.storage.OffsetStorageWriterTest > testFlushFailureReplacesOffsets
STARTED

org.apache.kafka.connect.storage.OffsetStorageWriterTest > testFlushFailureReplacesOffsets
PASSED

org.apache.kafka.connect.storage.OffsetStorageWriterTest > testAlreadyFlushing STARTED

org.apache.kafka.connect.storage.OffsetStorageWriterTest > testAlreadyFlushing PASSED

org.apache.kafka.connect.storage.OffsetStorageWriterTest > testCancelBeforeAwaitFlush STARTED

org.apache.kafka.connect.storage.OffsetStorageWriterTest > testCancelBeforeAwaitFlush PASSED

org.apache.kafka.connect.storage.OffsetStorageWriterTest > testCancelAfterAwaitFlush STARTED

org.apache.kafka.connect.storage.OffsetStorageWriterTest > testCancelAfterAwaitFlush PASSED

org.apache.kafka.connect.storage.OffsetStorageWriterTest > testWriteFlush STARTED

org.apache.kafka.connect.storage.OffsetStorageWriterTest > testWriteFlush PASSED

org.apache.kafka.connect.storage.FileOffsetBackingStoreTest > testSaveRestore STARTED

org.apache.kafka.connect.storage.FileOffsetBackingStoreTest > testSaveRestore PASSED

org.apache.kafka.connect.storage.FileOffsetBackingStoreTest > testGetSet STARTED

org.apache.kafka.connect.storage.FileOffsetBackingStoreTest > testGetSet PASSED

378 tests completed, 1 failed

> Task :connect:runtime:test FAILED

FAILURE: Build failed with an exception.

* What went wrong:
Execution failed for task ':connect:runtime:test'.
> There were failing tests. See the report at: file://<https://builds.apache.org/job/kafka-2.0-jdk8/ws/connect/runtime/build/reports/tests/test/index.html>

* Try:
Run with --stacktrace option to get the stack trace. Run with --info or --debug option to
get more log output. Run with --scan to get full insights.

* Get more help at https://help.gradle.org

BUILD FAILED in 2h 45m 29s
112 actionable tasks: 74 executed, 38 up-to-date
Build step 'Execute shell' marked build as failure
[FINDBUGS] Collecting findbugs analysis files...
Setting GRADLE_4_8_1_HOME=/home/jenkins/tools/gradle/4.8.1
[FINDBUGS] Searching for all files in <https://builds.apache.org/job/kafka-2.0-jdk8/ws/>
that match the pattern **/build/reports/findbugs/*.xml
[FINDBUGS] Parsing 12 files in <https://builds.apache.org/job/kafka-2.0-jdk8/ws/>
[FINDBUGS] Successfully parsed file <https://builds.apache.org/job/kafka-2.0-jdk8/ws/clients/build/reports/findbugs/main.xml>
with 0 unique warnings and 0 duplicates.
[FINDBUGS] Successfully parsed file <https://builds.apache.org/job/kafka-2.0-jdk8/ws/connect/api/build/reports/findbugs/main.xml>
with 0 unique warnings and 0 duplicates.
[FINDBUGS] Successfully parsed file <https://builds.apache.org/job/kafka-2.0-jdk8/ws/connect/basic-auth-extension/build/reports/findbugs/main.xml>
with 0 unique warnings and 0 duplicates.
[FINDBUGS] Successfully parsed file <https://builds.apache.org/job/kafka-2.0-jdk8/ws/connect/file/build/reports/findbugs/main.xml>
with 0 unique warnings and 0 duplicates.
[FINDBUGS] Successfully parsed file <https://builds.apache.org/job/kafka-2.0-jdk8/ws/connect/json/build/reports/findbugs/main.xml>
with 0 unique warnings and 0 duplicates.
[FINDBUGS] Successfully parsed file <https://builds.apache.org/job/kafka-2.0-jdk8/ws/connect/runtime/build/reports/findbugs/main.xml>
with 0 unique warnings and 0 duplicates.
[FINDBUGS] Successfully parsed file <https://builds.apache.org/job/kafka-2.0-jdk8/ws/core/build/reports/findbugs/main.xml>
with 0 unique warnings and 0 duplicates.
[FINDBUGS] Successfully parsed file <https://builds.apache.org/job/kafka-2.0-jdk8/ws/examples/build/reports/findbugs/main.xml>
with 0 unique warnings and 0 duplicates.
[FINDBUGS] Successfully parsed file <https://builds.apache.org/job/kafka-2.0-jdk8/ws/log4j-appender/build/reports/findbugs/main.xml>
with 0 unique warnings and 0 duplicates.
[FINDBUGS] Successfully parsed file <https://builds.apache.org/job/kafka-2.0-jdk8/ws/streams/build/reports/findbugs/main.xml>
with 0 unique warnings and 0 duplicates.
[FINDBUGS] Successfully parsed file <https://builds.apache.org/job/kafka-2.0-jdk8/ws/streams/streams-scala/build/reports/findbugs/main.xml>
with 0 unique warnings and 0 duplicates.
[FINDBUGS] Successfully parsed file <https://builds.apache.org/job/kafka-2.0-jdk8/ws/tools/build/reports/findbugs/main.xml>
with 0 unique warnings and 0 duplicates.
Setting GRADLE_4_8_1_HOME=/home/jenkins/tools/gradle/4.8.1
Setting GRADLE_4_8_1_HOME=/home/jenkins/tools/gradle/4.8.1
<Git Blamer> Using GitBlamer to create author and commit information for all warnings.
<Git Blamer> GIT_COMMIT=ffdb220862bee3fe007096a94d88f5b3ee22aba3, workspace=<https://builds.apache.org/job/kafka-2.0-jdk8/ws/>
[FINDBUGS] Computing warning deltas based on reference build #204
Recording test results
Setting GRADLE_4_8_1_HOME=/home/jenkins/tools/gradle/4.8.1
Setting GRADLE_4_8_1_HOME=/home/jenkins/tools/gradle/4.8.1
Not sending mail to unregistered user wangguoz@gmail.com

Mime
View raw message