kafka-dev mailing list archives

Site index · List index
Message view « Date » · « Thread »
Top « Date » · « Thread »
From Apache Jenkins Server <jenk...@builds.apache.org>
Subject Build failed in Jenkins: kafka-trunk-jdk10 #405
Date Wed, 15 Aug 2018 05:30:44 GMT
See <https://builds.apache.org/job/kafka-trunk-jdk10/405/display/redirect?page=changes>

Changes:

[wangguoz] KAFKA-6761: Reduce streams footprint part IV add optimization (#5451)

------------------------------------------
[...truncated 1.98 MB...]

org.apache.kafka.streams.StreamsConfigTest > shouldAcceptExactlyOnce PASSED

org.apache.kafka.streams.StreamsConfigTest > testGetGlobalConsumerConfigsWithGlobalConsumerOverridenPrefix
STARTED

org.apache.kafka.streams.StreamsConfigTest > testGetGlobalConsumerConfigsWithGlobalConsumerOverridenPrefix
PASSED

org.apache.kafka.streams.StreamsConfigTest > shouldSetInternalLeaveGroupOnCloseConfigToFalseInConsumer
STARTED

org.apache.kafka.streams.StreamsConfigTest > shouldSetInternalLeaveGroupOnCloseConfigToFalseInConsumer
PASSED

org.apache.kafka.streams.StreamsConfigTest > shouldSupportPrefixedPropertiesThatAreNotPartOfConsumerConfig
STARTED

org.apache.kafka.streams.StreamsConfigTest > shouldSupportPrefixedPropertiesThatAreNotPartOfConsumerConfig
PASSED

org.apache.kafka.streams.StreamsConfigTest > shouldForwardCustomConfigsWithNoPrefixToAllClients
STARTED

org.apache.kafka.streams.StreamsConfigTest > shouldForwardCustomConfigsWithNoPrefixToAllClients
PASSED

org.apache.kafka.streams.StreamsConfigTest > shouldResetToDefaultIfRestoreConsumerAutoCommitIsOverridden
STARTED

org.apache.kafka.streams.StreamsConfigTest > shouldResetToDefaultIfRestoreConsumerAutoCommitIsOverridden
PASSED

org.apache.kafka.streams.StreamsConfigTest > shouldSpecifyCorrectValueSerdeClassOnError
STARTED

org.apache.kafka.streams.StreamsConfigTest > shouldSpecifyCorrectValueSerdeClassOnError
PASSED

org.apache.kafka.streams.StreamsConfigTest > shouldResetToDefaultIfGlobalConsumerAutoCommitIsOverridden
STARTED

org.apache.kafka.streams.StreamsConfigTest > shouldResetToDefaultIfGlobalConsumerAutoCommitIsOverridden
PASSED

org.apache.kafka.streams.StreamsConfigTest > shouldResetToDefaultIfConsumerIsolationLevelIsOverriddenIfEosEnabled
STARTED

org.apache.kafka.streams.StreamsConfigTest > shouldResetToDefaultIfConsumerIsolationLevelIsOverriddenIfEosEnabled
PASSED

org.apache.kafka.streams.StreamsConfigTest > shouldBeSupportNonPrefixedGlobalConsumerConfigs
STARTED

org.apache.kafka.streams.StreamsConfigTest > shouldBeSupportNonPrefixedGlobalConsumerConfigs
PASSED

org.apache.kafka.streams.StreamsConfigTest > shouldSupportNonPrefixedAdminConfigs STARTED

org.apache.kafka.streams.StreamsConfigTest > shouldSupportNonPrefixedAdminConfigs PASSED

org.apache.kafka.streams.StreamsConfigTest > shouldNotOverrideUserConfigCommitIntervalMsIfExactlyOnceEnabled
STARTED

org.apache.kafka.streams.StreamsConfigTest > shouldNotOverrideUserConfigCommitIntervalMsIfExactlyOnceEnabled
PASSED

org.apache.kafka.streams.StreamsConfigTest > shouldSupportMultipleBootstrapServers STARTED

org.apache.kafka.streams.StreamsConfigTest > shouldSupportMultipleBootstrapServers PASSED

org.apache.kafka.streams.StreamsConfigTest > shouldSpecifyNoOptimizationWhenNotExplicitlyAddedToConfigs
STARTED

org.apache.kafka.streams.StreamsConfigTest > shouldSpecifyNoOptimizationWhenNotExplicitlyAddedToConfigs
PASSED

org.apache.kafka.streams.StreamsConfigTest > shouldThrowConfigExceptionWhenOptimizationConfigNotValueInRange
STARTED

org.apache.kafka.streams.StreamsConfigTest > shouldThrowConfigExceptionWhenOptimizationConfigNotValueInRange
PASSED

org.apache.kafka.streams.StreamsConfigTest > shouldThrowStreamsExceptionIfKeySerdeConfigFails
STARTED

org.apache.kafka.streams.StreamsConfigTest > shouldThrowStreamsExceptionIfKeySerdeConfigFails
PASSED

org.apache.kafka.streams.StreamsConfigTest > shouldSupportNonPrefixedProducerConfigs STARTED

org.apache.kafka.streams.StreamsConfigTest > shouldSupportNonPrefixedProducerConfigs PASSED

org.apache.kafka.streams.StreamsConfigTest > testGetRestoreConsumerConfigs STARTED

org.apache.kafka.streams.StreamsConfigTest > testGetRestoreConsumerConfigs PASSED

org.apache.kafka.streams.StreamsConfigTest > shouldThrowExceptionIfBootstrapServersIsNotSet
STARTED

org.apache.kafka.streams.StreamsConfigTest > shouldThrowExceptionIfBootstrapServersIsNotSet
PASSED

org.apache.kafka.streams.StreamsConfigTest > consumerConfigMustUseAdminClientConfigForRetries
STARTED

org.apache.kafka.streams.StreamsConfigTest > consumerConfigMustUseAdminClientConfigForRetries
PASSED

org.apache.kafka.streams.StreamsConfigTest > testGetMainConsumerConfigsWithMainConsumerOverridenPrefix
STARTED

org.apache.kafka.streams.StreamsConfigTest > testGetMainConsumerConfigsWithMainConsumerOverridenPrefix
PASSED

org.apache.kafka.streams.StreamsConfigTest > shouldBeSupportNonPrefixedRestoreConsumerConfigs
STARTED

org.apache.kafka.streams.StreamsConfigTest > shouldBeSupportNonPrefixedRestoreConsumerConfigs
PASSED

org.apache.kafka.streams.StreamsConfigTest > shouldSupportPrefixedRestoreConsumerConfigs
STARTED

org.apache.kafka.streams.StreamsConfigTest > shouldSupportPrefixedRestoreConsumerConfigs
PASSED

org.apache.kafka.streams.StreamsConfigTest > shouldThrowExceptionIfApplicationIdIsNotSet
STARTED

org.apache.kafka.streams.StreamsConfigTest > shouldThrowExceptionIfApplicationIdIsNotSet
PASSED

org.apache.kafka.streams.StreamsConfigTest > consumerConfigMustContainStreamPartitionAssignorConfig
STARTED

org.apache.kafka.streams.StreamsConfigTest > consumerConfigMustContainStreamPartitionAssignorConfig
PASSED

org.apache.kafka.streams.StreamsConfigTest > shouldSpecifyCorrectKeySerdeClassOnError STARTED

org.apache.kafka.streams.StreamsConfigTest > shouldSpecifyCorrectKeySerdeClassOnError PASSED

org.apache.kafka.streams.StreamsBuilderTest > shouldAllowJoinMaterializedJoinedKTable STARTED

org.apache.kafka.streams.StreamsBuilderTest > shouldAllowJoinMaterializedJoinedKTable PASSED

org.apache.kafka.streams.StreamsBuilderTest > shouldUseSerdesDefinedInMaterializedToConsumeGlobalTable
STARTED

org.apache.kafka.streams.StreamsBuilderTest > shouldUseSerdesDefinedInMaterializedToConsumeGlobalTable
PASSED

org.apache.kafka.streams.StreamsBuilderTest > shouldMergeStreams STARTED

org.apache.kafka.streams.StreamsBuilderTest > shouldMergeStreams PASSED

org.apache.kafka.streams.StreamsBuilderTest > shouldAllowJoinMaterializedFilteredKTable
STARTED

org.apache.kafka.streams.StreamsBuilderTest > shouldAllowJoinMaterializedFilteredKTable
PASSED

org.apache.kafka.streams.StreamsBuilderTest > shouldReuseSourceTopicAsChangelogsWithOptimization20
STARTED

org.apache.kafka.streams.StreamsBuilderTest > shouldReuseSourceTopicAsChangelogsWithOptimization20
PASSED

org.apache.kafka.streams.StreamsBuilderTest > shouldAllowJoinMaterializedMapValuedKTable
STARTED

org.apache.kafka.streams.StreamsBuilderTest > shouldAllowJoinMaterializedMapValuedKTable
PASSED

org.apache.kafka.streams.StreamsBuilderTest > shouldAllowJoinUnmaterializedMapValuedKTable
STARTED

org.apache.kafka.streams.StreamsBuilderTest > shouldAllowJoinUnmaterializedMapValuedKTable
PASSED

org.apache.kafka.streams.StreamsBuilderTest > shouldAllowJoinUnmaterializedFilteredKTable
STARTED

org.apache.kafka.streams.StreamsBuilderTest > shouldAllowJoinUnmaterializedFilteredKTable
PASSED

org.apache.kafka.streams.StreamsBuilderTest > shouldNotReuseSourceTopicAsChangelogsByDefault
STARTED

org.apache.kafka.streams.StreamsBuilderTest > shouldNotReuseSourceTopicAsChangelogsByDefault
PASSED

org.apache.kafka.streams.StreamsBuilderTest > shouldUseSerdesDefinedInMaterializedToConsumeTable
STARTED

org.apache.kafka.streams.StreamsBuilderTest > shouldUseSerdesDefinedInMaterializedToConsumeTable
PASSED

org.apache.kafka.streams.StreamsBuilderTest > shouldThrowExceptionWhenTopicNamesAreNull
STARTED

org.apache.kafka.streams.StreamsBuilderTest > shouldThrowExceptionWhenTopicNamesAreNull
PASSED

org.apache.kafka.streams.StreamsBuilderTest > shouldAllowJoinMaterializedSourceKTable STARTED

org.apache.kafka.streams.StreamsBuilderTest > shouldAllowJoinMaterializedSourceKTable PASSED

org.apache.kafka.streams.StreamsBuilderTest > shouldThrowExceptionWhenNoTopicPresent STARTED

org.apache.kafka.streams.StreamsBuilderTest > shouldThrowExceptionWhenNoTopicPresent PASSED

org.apache.kafka.streams.StreamsBuilderTest > shouldUseDefaultNodeAndStoreNames STARTED

org.apache.kafka.streams.StreamsBuilderTest > shouldUseDefaultNodeAndStoreNames PASSED

org.apache.kafka.streams.StreamsBuilderTest > shouldAllowJoinUnmaterializedJoinedKTable
STARTED

org.apache.kafka.streams.StreamsBuilderTest > shouldAllowJoinUnmaterializedJoinedKTable
PASSED

org.apache.kafka.streams.StreamsBuilderTest > shouldProcessingFromSinkTopic STARTED

org.apache.kafka.streams.StreamsBuilderTest > shouldProcessingFromSinkTopic PASSED

org.apache.kafka.streams.StreamsBuilderTest > shouldProcessViaThroughTopic STARTED

org.apache.kafka.streams.StreamsBuilderTest > shouldProcessViaThroughTopic PASSED

org.apache.kafka.streams.tools.StreamsResetterTest > testShiftOffsetByWhenBetweenBeginningAndEndOffset
STARTED

org.apache.kafka.streams.tools.StreamsResetterTest > testShiftOffsetByWhenBetweenBeginningAndEndOffset
PASSED

org.apache.kafka.streams.tools.StreamsResetterTest > testResetToSpecificOffsetWhenAfterEndOffset
STARTED

org.apache.kafka.streams.tools.StreamsResetterTest > testResetToSpecificOffsetWhenAfterEndOffset
PASSED

org.apache.kafka.streams.tools.StreamsResetterTest > shouldAcceptValidDateFormats STARTED

org.apache.kafka.streams.tools.StreamsResetterTest > shouldAcceptValidDateFormats PASSED

org.apache.kafka.streams.tools.StreamsResetterTest > shouldDeleteTopic STARTED

org.apache.kafka.streams.tools.StreamsResetterTest > shouldDeleteTopic PASSED

org.apache.kafka.streams.tools.StreamsResetterTest > testResetToSpecificOffsetWhenBetweenBeginningAndEndOffset
STARTED

org.apache.kafka.streams.tools.StreamsResetterTest > testResetToSpecificOffsetWhenBetweenBeginningAndEndOffset
PASSED

org.apache.kafka.streams.tools.StreamsResetterTest > testShiftOffsetByWhenAfterEndOffset
STARTED

org.apache.kafka.streams.tools.StreamsResetterTest > testShiftOffsetByWhenAfterEndOffset
PASSED

org.apache.kafka.streams.tools.StreamsResetterTest > testResetToSpecificOffsetWhenBeforeBeginningOffset
STARTED

org.apache.kafka.streams.tools.StreamsResetterTest > testResetToSpecificOffsetWhenBeforeBeginningOffset
PASSED

org.apache.kafka.streams.tools.StreamsResetterTest > shouldSeekToEndOffset STARTED

org.apache.kafka.streams.tools.StreamsResetterTest > shouldSeekToEndOffset PASSED

org.apache.kafka.streams.tools.StreamsResetterTest > testResetUsingPlanWhenBetweenBeginningAndEndOffset
STARTED

org.apache.kafka.streams.tools.StreamsResetterTest > testResetUsingPlanWhenBetweenBeginningAndEndOffset
PASSED

org.apache.kafka.streams.tools.StreamsResetterTest > testResetUsingPlanWhenBeforeBeginningOffset
STARTED

org.apache.kafka.streams.tools.StreamsResetterTest > testResetUsingPlanWhenBeforeBeginningOffset
PASSED

org.apache.kafka.streams.tools.StreamsResetterTest > shouldThrowOnInvalidDateFormat STARTED

org.apache.kafka.streams.tools.StreamsResetterTest > shouldThrowOnInvalidDateFormat PASSED

org.apache.kafka.streams.tools.StreamsResetterTest > testResetUsingPlanWhenAfterEndOffset
STARTED

org.apache.kafka.streams.tools.StreamsResetterTest > testResetUsingPlanWhenAfterEndOffset
PASSED

org.apache.kafka.streams.tools.StreamsResetterTest > testShiftOffsetByWhenBeforeBeginningOffset
STARTED

org.apache.kafka.streams.tools.StreamsResetterTest > testShiftOffsetByWhenBeforeBeginningOffset
PASSED

1922 tests completed, 1 failed

> Task :streams:test FAILED

FAILURE: Build failed with an exception.

* What went wrong:
Execution failed for task ':streams:test'.
> There were failing tests. See the report at: file://<https://builds.apache.org/job/kafka-trunk-jdk10/ws/streams/build/reports/tests/test/index.html>

* Try:
Run with --stacktrace option to get the stack trace. Run with --info or --debug option to
get more log output. Run with --scan to get full insights.

* Get more help at https://help.gradle.org

Deprecated Gradle features were used in this build, making it incompatible with Gradle 5.0.
See https://docs.gradle.org/4.8.1/userguide/command_line_interface.html#sec:command_line_warnings

BUILD FAILED in 2h 43m 33s
67 actionable tasks: 46 executed, 21 up-to-date
Build step 'Execute shell' marked build as failure
Recording test results
Setting GRADLE_4_8_1_HOME=/home/jenkins/tools/gradle/4.8.1
Setting GRADLE_4_8_1_HOME=/home/jenkins/tools/gradle/4.8.1
Not sending mail to unregistered user wangguoz@gmail.com
Not sending mail to unregistered user lindong28@gmail.com

Mime
View raw message