kafka-dev mailing list archives

Site index · List index
Message view « Date » · « Thread »
Top « Date » · « Thread »
From Apache Jenkins Server <jenk...@builds.apache.org>
Subject Build failed in Jenkins: kafka-1.1-jdk7 #181
Date Thu, 16 Aug 2018 05:21:28 GMT
See <https://builds.apache.org/job/kafka-1.1-jdk7/181/display/redirect?page=changes>

Changes:

[matthias] KAFKA-7285: Create new producer on each rebalance if EOS enabled (#5501)

------------------------------------------
[...truncated 1.93 MB...]

org.apache.kafka.streams.processor.TopologyBuilderTest > shouldNotAllowNullNameWhenAddingSink
STARTED

org.apache.kafka.streams.processor.TopologyBuilderTest > shouldNotAllowNullNameWhenAddingSink
PASSED

org.apache.kafka.streams.processor.TopologyBuilderTest > testNamedTopicMatchesAlreadyProvidedPattern
STARTED

org.apache.kafka.streams.processor.TopologyBuilderTest > testNamedTopicMatchesAlreadyProvidedPattern
PASSED

org.apache.kafka.streams.processor.TopologyBuilderTest > shouldAddTimestampExtractorWithOffsetResetAndPatternPerSource
STARTED

org.apache.kafka.streams.processor.TopologyBuilderTest > shouldAddTimestampExtractorWithOffsetResetAndPatternPerSource
PASSED

org.apache.kafka.streams.processor.TopologyBuilderTest > testAddSinkWithSameName STARTED

org.apache.kafka.streams.processor.TopologyBuilderTest > testAddSinkWithSameName PASSED

org.apache.kafka.streams.processor.TopologyBuilderTest > testAddSinkWithSelfParent STARTED

org.apache.kafka.streams.processor.TopologyBuilderTest > testAddSinkWithSelfParent PASSED

org.apache.kafka.streams.processor.TopologyBuilderTest > testAddProcessorWithSelfParent
STARTED

org.apache.kafka.streams.processor.TopologyBuilderTest > testAddProcessorWithSelfParent
PASSED

org.apache.kafka.streams.processor.TopologyBuilderTest > shouldAssociateStateStoreNameWhenStateStoreSupplierIsInternal
STARTED

org.apache.kafka.streams.processor.TopologyBuilderTest > shouldAssociateStateStoreNameWhenStateStoreSupplierIsInternal
PASSED

org.apache.kafka.streams.processor.TopologyBuilderTest > testAddStateStoreWithSink STARTED

org.apache.kafka.streams.processor.TopologyBuilderTest > testAddStateStoreWithSink PASSED

org.apache.kafka.streams.processor.TopologyBuilderTest > testTopicGroups STARTED

org.apache.kafka.streams.processor.TopologyBuilderTest > testTopicGroups PASSED

org.apache.kafka.streams.processor.TopologyBuilderTest > testBuild STARTED

org.apache.kafka.streams.processor.TopologyBuilderTest > testBuild PASSED

org.apache.kafka.streams.processor.TopologyBuilderTest > shouldNotAllowOffsetResetSourceWithoutTopics
STARTED

org.apache.kafka.streams.processor.TopologyBuilderTest > shouldNotAllowOffsetResetSourceWithoutTopics
PASSED

org.apache.kafka.streams.processor.TopologyBuilderTest > shouldNotAddNullStateStoreSupplier
STARTED

org.apache.kafka.streams.processor.TopologyBuilderTest > shouldNotAddNullStateStoreSupplier
PASSED

org.apache.kafka.streams.processor.TopologyBuilderTest > shouldNotAllowNullNameWhenAddingSource
STARTED

org.apache.kafka.streams.processor.TopologyBuilderTest > shouldNotAllowNullNameWhenAddingSource
PASSED

org.apache.kafka.streams.processor.TopologyBuilderTest > shouldNotAllowNullTopicWhenAddingSink
STARTED

org.apache.kafka.streams.processor.TopologyBuilderTest > shouldNotAllowNullTopicWhenAddingSink
PASSED

org.apache.kafka.streams.processor.TopologyBuilderTest > shouldNotAllowToAddGlobalStoreWithSourceNameEqualsProcessorName
STARTED

org.apache.kafka.streams.processor.TopologyBuilderTest > shouldNotAllowToAddGlobalStoreWithSourceNameEqualsProcessorName
PASSED

org.apache.kafka.streams.processor.TopologyBuilderTest > shouldAddSourceWithOffsetReset
STARTED

org.apache.kafka.streams.processor.TopologyBuilderTest > shouldAddSourceWithOffsetReset
PASSED

org.apache.kafka.streams.processor.TopologyBuilderTest > testAddStateStoreWithSource STARTED

org.apache.kafka.streams.processor.TopologyBuilderTest > testAddStateStoreWithSource PASSED

org.apache.kafka.streams.processor.TopologyBuilderTest > shouldThroughOnUnassignedStateStoreAccess
STARTED

org.apache.kafka.streams.processor.TopologyBuilderTest > shouldThroughOnUnassignedStateStoreAccess
PASSED

org.apache.kafka.streams.processor.TopologyBuilderTest > shouldAddInternalTopicConfigForRepartitionTopics
STARTED

org.apache.kafka.streams.processor.TopologyBuilderTest > shouldAddInternalTopicConfigForRepartitionTopics
PASSED

org.apache.kafka.streams.processor.TopologyBuilderTest > shouldNotAllowNullProcessorNameWhenConnectingProcessorAndStateStores
STARTED

org.apache.kafka.streams.processor.TopologyBuilderTest > shouldNotAllowNullProcessorNameWhenConnectingProcessorAndStateStores
PASSED

org.apache.kafka.streams.processor.TopologyBuilderTest > testAddSourceWithSameName STARTED

org.apache.kafka.streams.processor.TopologyBuilderTest > testAddSourceWithSameName PASSED

org.apache.kafka.streams.processor.TopologyBuilderTest > shouldAddTimestampExtractorWithOffsetResetPerSource
STARTED

org.apache.kafka.streams.processor.TopologyBuilderTest > shouldAddTimestampExtractorWithOffsetResetPerSource
PASSED

org.apache.kafka.streams.processor.TopologyBuilderTest > testAddMoreThanOnePatternSourceNode
STARTED

org.apache.kafka.streams.processor.TopologyBuilderTest > testAddMoreThanOnePatternSourceNode
PASSED

org.apache.kafka.streams.processor.TopologyBuilderTest > shouldAddTimestampExtractorWithPatternPerSource
STARTED

org.apache.kafka.streams.processor.TopologyBuilderTest > shouldAddTimestampExtractorWithPatternPerSource
PASSED

org.apache.kafka.streams.processor.TopologyBuilderTest > testAddProcessorWithSameName STARTED

org.apache.kafka.streams.processor.TopologyBuilderTest > testAddProcessorWithSameName PASSED

org.apache.kafka.streams.processor.TopologyBuilderTest > shouldSetCorrectSourceNodesWithRegexUpdatedTopics
STARTED

org.apache.kafka.streams.processor.TopologyBuilderTest > shouldSetCorrectSourceNodesWithRegexUpdatedTopics
PASSED

org.apache.kafka.streams.processor.TopologyBuilderTest > shouldConnectRegexMatchedTopicsToStateStore
STARTED

org.apache.kafka.streams.processor.TopologyBuilderTest > shouldConnectRegexMatchedTopicsToStateStore
PASSED

org.apache.kafka.streams.processor.TopologyBuilderTest > testAddSourceWithSameTopic STARTED

org.apache.kafka.streams.processor.TopologyBuilderTest > testAddSourceWithSameTopic PASSED

org.apache.kafka.streams.processor.TopologyBuilderTest > testTopicGroupsByStateStore STARTED

org.apache.kafka.streams.processor.TopologyBuilderTest > testTopicGroupsByStateStore PASSED

org.apache.kafka.streams.processor.TopologyBuilderTest > shouldAddSourceWithoutOffsetReset
STARTED

org.apache.kafka.streams.processor.TopologyBuilderTest > shouldAddSourceWithoutOffsetReset
PASSED

org.apache.kafka.streams.processor.TopologyBuilderTest > testAddStateStoreWithDuplicates
STARTED

org.apache.kafka.streams.processor.TopologyBuilderTest > testAddStateStoreWithDuplicates
PASSED

org.apache.kafka.streams.processor.TopologyBuilderTest > shouldAddTimestampExtractorPerSource
STARTED

org.apache.kafka.streams.processor.TopologyBuilderTest > shouldAddTimestampExtractorPerSource
PASSED

org.apache.kafka.streams.processor.TopologyBuilderTest > shouldAddTimestampExtractorWithOffsetResetAndKeyValSerdesPerSource
STARTED

org.apache.kafka.streams.processor.TopologyBuilderTest > shouldAddTimestampExtractorWithOffsetResetAndKeyValSerdesPerSource
PASSED

org.apache.kafka.streams.processor.TopologyBuilderTest > testPatternSourceTopic STARTED

org.apache.kafka.streams.processor.TopologyBuilderTest > testPatternSourceTopic PASSED

org.apache.kafka.streams.processor.TopologyBuilderTest > shouldAssociateStateStoreNameWhenStateStoreSupplierIsExternal
STARTED

org.apache.kafka.streams.processor.TopologyBuilderTest > shouldAssociateStateStoreNameWhenStateStoreSupplierIsExternal
PASSED

org.apache.kafka.streams.processor.TopologyBuilderTest > testAddSinkWithWrongParent STARTED

org.apache.kafka.streams.processor.TopologyBuilderTest > testAddSinkWithWrongParent PASSED

org.apache.kafka.streams.processor.TopologyBuilderTest > testPatternMatchesAlreadyProvidedTopicSource
STARTED

org.apache.kafka.streams.processor.TopologyBuilderTest > testPatternMatchesAlreadyProvidedTopicSource
PASSED

org.apache.kafka.streams.processor.TopologyBuilderTest > testAddSinkConnectedWithMultipleParent
STARTED

org.apache.kafka.streams.processor.TopologyBuilderTest > testAddSinkConnectedWithMultipleParent
PASSED

org.apache.kafka.streams.processor.TopologyBuilderTest > shouldAddTimestampExtractorWithOffsetResetAndKeyValSerdesAndPatternPerSource
STARTED

org.apache.kafka.streams.processor.TopologyBuilderTest > shouldAddTimestampExtractorWithOffsetResetAndKeyValSerdesAndPatternPerSource
PASSED

org.apache.kafka.streams.processor.TopologyBuilderTest > testSubscribeTopicNameAndPattern
STARTED

org.apache.kafka.streams.processor.TopologyBuilderTest > testSubscribeTopicNameAndPattern
PASSED

org.apache.kafka.streams.processor.TopologyBuilderTest > shouldAddPatternSourceWithoutOffsetReset
STARTED

org.apache.kafka.streams.processor.TopologyBuilderTest > shouldAddPatternSourceWithoutOffsetReset
PASSED

org.apache.kafka.streams.processor.TopologyBuilderTest > shouldNotAddNullInternalTopic
STARTED

org.apache.kafka.streams.processor.TopologyBuilderTest > shouldNotAddNullInternalTopic
PASSED

org.apache.kafka.streams.processor.TopologyBuilderTest > testAddProcessorWithWrongParent
STARTED

org.apache.kafka.streams.processor.TopologyBuilderTest > testAddProcessorWithWrongParent
PASSED

org.apache.kafka.streams.processor.TopologyBuilderTest > shouldNotAllowNullNameWhenAddingProcessor
STARTED

org.apache.kafka.streams.processor.TopologyBuilderTest > shouldNotAllowNullNameWhenAddingProcessor
PASSED

org.apache.kafka.streams.processor.TopologyBuilderTest > shouldAddSourcePatternWithOffsetReset
STARTED

org.apache.kafka.streams.processor.TopologyBuilderTest > shouldAddSourcePatternWithOffsetReset
PASSED

org.apache.kafka.streams.processor.TopologyBuilderTest > testAddStateStore STARTED

org.apache.kafka.streams.processor.TopologyBuilderTest > testAddStateStore PASSED

org.apache.kafka.streams.processor.TopologyBuilderTest > testAddSinkConnectedWithParent
STARTED

org.apache.kafka.streams.processor.TopologyBuilderTest > testAddSinkConnectedWithParent
PASSED

org.apache.kafka.streams.processor.TopologyBuilderTest > testAddStateStoreWithNonExistingProcessor
STARTED

org.apache.kafka.streams.processor.TopologyBuilderTest > testAddStateStoreWithNonExistingProcessor
PASSED

org.apache.kafka.streams.processor.TopologyBuilderTest > shouldCorrectlyMapStateStoreToInternalTopics
STARTED

org.apache.kafka.streams.processor.TopologyBuilderTest > shouldCorrectlyMapStateStoreToInternalTopics
PASSED

org.apache.kafka.streams.processor.UsePreviousTimeOnInvalidTimestampTest > usePreviousTimeOnInvalidTimestamp
STARTED

org.apache.kafka.streams.processor.UsePreviousTimeOnInvalidTimestampTest > usePreviousTimeOnInvalidTimestamp
PASSED

org.apache.kafka.streams.processor.UsePreviousTimeOnInvalidTimestampTest > shouldThrowStreamsException
STARTED

org.apache.kafka.streams.processor.UsePreviousTimeOnInvalidTimestampTest > shouldThrowStreamsException
PASSED

org.apache.kafka.streams.processor.UsePreviousTimeOnInvalidTimestampTest > extractMetadataTimestamp
STARTED

org.apache.kafka.streams.processor.UsePreviousTimeOnInvalidTimestampTest > extractMetadataTimestamp
PASSED

1894 tests completed, 3 failed, 10 skipped

> Task :streams:test FAILED

FAILURE: Build failed with an exception.

* What went wrong:
Execution failed for task ':streams:test'.
> There were failing tests. See the report at: file://<https://builds.apache.org/job/kafka-1.1-jdk7/ws/streams/build/reports/tests/test/index.html>

* Try:
Run with --stacktrace option to get the stack trace. Run with --info or --debug option to
get more log output. Run with --scan to get full insights.

* Get more help at https://help.gradle.org

Deprecated Gradle features were used in this build, making it incompatible with Gradle 5.0.
See https://docs.gradle.org/4.8.1/userguide/command_line_interface.html#sec:command_line_warnings

BUILD FAILED in 1h 59m 53s
58 actionable tasks: 31 executed, 27 up-to-date
Build step 'Execute shell' marked build as failure
[FINDBUGS] Collecting findbugs analysis files...
Setting GRADLE_4_8_1_HOME=/home/jenkins/tools/gradle/4.8.1
[FINDBUGS] Searching for all files in <https://builds.apache.org/job/kafka-1.1-jdk7/ws/>
that match the pattern **/build/reports/findbugs/*.xml
[FINDBUGS] Parsing 5 files in <https://builds.apache.org/job/kafka-1.1-jdk7/ws/>
[FINDBUGS] Successfully parsed file <https://builds.apache.org/job/kafka-1.1-jdk7/ws/clients/build/reports/findbugs/main.xml>
with 0 unique warnings and 0 duplicates.
[FINDBUGS] Successfully parsed file <https://builds.apache.org/job/kafka-1.1-jdk7/ws/core/build/reports/findbugs/main.xml>
with 0 unique warnings and 0 duplicates.
[FINDBUGS] Successfully parsed file <https://builds.apache.org/job/kafka-1.1-jdk7/ws/examples/build/reports/findbugs/main.xml>
with 0 unique warnings and 0 duplicates.
[FINDBUGS] Successfully parsed file <https://builds.apache.org/job/kafka-1.1-jdk7/ws/log4j-appender/build/reports/findbugs/main.xml>
with 0 unique warnings and 0 duplicates.
[FINDBUGS] Successfully parsed file <https://builds.apache.org/job/kafka-1.1-jdk7/ws/streams/build/reports/findbugs/main.xml>
with 0 unique warnings and 0 duplicates.
Setting GRADLE_4_8_1_HOME=/home/jenkins/tools/gradle/4.8.1
Setting GRADLE_4_8_1_HOME=/home/jenkins/tools/gradle/4.8.1
<Git Blamer> Using GitBlamer to create author and commit information for all warnings.
<Git Blamer> GIT_COMMIT=c9955362a919e1993cdebe9f183c6ff1e29887b0, workspace=<https://builds.apache.org/job/kafka-1.1-jdk7/ws/>
[FINDBUGS] Computing warning deltas based on reference build #178
Recording test results
Setting GRADLE_4_8_1_HOME=/home/jenkins/tools/gradle/4.8.1
Setting GRADLE_4_8_1_HOME=/home/jenkins/tools/gradle/4.8.1
Not sending mail to unregistered user rajinisivaram@googlemail.com
Not sending mail to unregistered user wangguoz@gmail.com

Mime
View raw message