kafka-dev mailing list archives

Site index · List index
Message view « Date » · « Thread »
Top « Date » · « Thread »
From Apache Jenkins Server <jenk...@builds.apache.org>
Subject Build failed in Jenkins: kafka-trunk-jdk10 #401
Date Tue, 14 Aug 2018 19:16:42 GMT
See <https://builds.apache.org/job/kafka-trunk-jdk10/401/display/redirect?page=changes>

Changes:

[jason] MINOR: Clean up to avoid errors in dynamic broker config tests (#5486)

[wangguoz] KAFKA-7222: Add Windows grace period (#5369)

[github] KAFKA-7119: Handle transient Kerberos errors as non-fatal exceptions

------------------------------------------
[...truncated 1.54 MB...]
kafka.controller.ReplicaStateMachineTest > testInvalidReplicaDeletionIneligibleToReplicaDeletionSuccessfulTransition
PASSED

kafka.controller.ReplicaStateMachineTest > testOnlineReplicaToOfflineReplicaTransition
STARTED

kafka.controller.ReplicaStateMachineTest > testOnlineReplicaToOfflineReplicaTransition
PASSED

kafka.controller.ReplicaStateMachineTest > testInvalidReplicaDeletionSuccessfulToReplicaDeletionIneligibleTransition
STARTED

kafka.controller.ReplicaStateMachineTest > testInvalidReplicaDeletionSuccessfulToReplicaDeletionIneligibleTransition
PASSED

kafka.controller.ReplicaStateMachineTest > testInvalidOfflineReplicaToNewReplicaTransition
STARTED

kafka.controller.ReplicaStateMachineTest > testInvalidOfflineReplicaToNewReplicaTransition
PASSED

kafka.controller.ReplicaStateMachineTest > testInvalidNewReplicaToNonexistentReplicaTransition
STARTED

kafka.controller.ReplicaStateMachineTest > testInvalidNewReplicaToNonexistentReplicaTransition
PASSED

kafka.controller.ReplicaStateMachineTest > testInvalidReplicaDeletionStartedToOnlineReplicaTransition
STARTED

kafka.controller.ReplicaStateMachineTest > testInvalidReplicaDeletionStartedToOnlineReplicaTransition
PASSED

kafka.controller.ReplicaStateMachineTest > testInvalidOfflineReplicaToReplicaDeletionSuccessfulTransition
STARTED

kafka.controller.ReplicaStateMachineTest > testInvalidOfflineReplicaToReplicaDeletionSuccessfulTransition
PASSED

kafka.controller.ReplicaStateMachineTest > testOfflineReplicaToOnlineReplicaTransition
STARTED

kafka.controller.ReplicaStateMachineTest > testOfflineReplicaToOnlineReplicaTransition
PASSED

kafka.controller.ReplicaStateMachineTest > testInvalidReplicaDeletionStartedToNonexistentReplicaTransition
STARTED

kafka.controller.ReplicaStateMachineTest > testInvalidReplicaDeletionStartedToNonexistentReplicaTransition
PASSED

kafka.controller.ReplicaStateMachineTest > testOfflineReplicaToReplicaDeletionStartedTransition
STARTED

kafka.controller.ReplicaStateMachineTest > testOfflineReplicaToReplicaDeletionStartedTransition
PASSED

kafka.controller.ReplicaStateMachineTest > testInvalidReplicaDeletionSuccessfulToNewReplicaTransition
STARTED

kafka.controller.ReplicaStateMachineTest > testInvalidReplicaDeletionSuccessfulToNewReplicaTransition
PASSED

kafka.controller.ReplicaStateMachineTest > testInvalidReplicaDeletionIneligibleToNonexistentReplicaTransition
STARTED

kafka.controller.ReplicaStateMachineTest > testInvalidReplicaDeletionIneligibleToNonexistentReplicaTransition
PASSED

kafka.controller.ReplicaStateMachineTest > testReplicaDeletionSuccessfulToNonexistentReplicaTransition
STARTED

kafka.controller.ReplicaStateMachineTest > testReplicaDeletionSuccessfulToNonexistentReplicaTransition
PASSED

kafka.controller.ReplicaStateMachineTest > testInvalidOnlineReplicaToNonexistentReplicaTransition
STARTED

kafka.controller.ReplicaStateMachineTest > testInvalidOnlineReplicaToNonexistentReplicaTransition
PASSED

kafka.controller.ReplicaStateMachineTest > testInvalidOfflineReplicaToReplicaDeletionIneligibleTransition
STARTED

kafka.controller.ReplicaStateMachineTest > testInvalidOfflineReplicaToReplicaDeletionIneligibleTransition
PASSED

kafka.controller.ReplicaStateMachineTest > testNewReplicaToOfflineReplicaTransition STARTED

kafka.controller.ReplicaStateMachineTest > testNewReplicaToOfflineReplicaTransition PASSED

kafka.controller.ReplicaStateMachineTest > testInvalidReplicaDeletionSuccessfulToOnlineReplicaTransition
STARTED

kafka.controller.ReplicaStateMachineTest > testInvalidReplicaDeletionSuccessfulToOnlineReplicaTransition
PASSED

kafka.controller.ReplicaStateMachineTest > testInvalidNonexistentReplicaToReplicaDeletionStartedTransition
STARTED

kafka.controller.ReplicaStateMachineTest > testInvalidNonexistentReplicaToReplicaDeletionStartedTransition
PASSED

kafka.controller.ReplicaStateMachineTest > testInvalidOnlineReplicaToReplicaDeletionSuccessfulTransition
STARTED

kafka.controller.ReplicaStateMachineTest > testInvalidOnlineReplicaToReplicaDeletionSuccessfulTransition
PASSED

kafka.controller.ReplicaStateMachineTest > testInvalidOfflineReplicaToNonexistentReplicaTransition
STARTED

kafka.controller.ReplicaStateMachineTest > testInvalidOfflineReplicaToNonexistentReplicaTransition
PASSED

kafka.controller.ReplicaStateMachineTest > testInvalidOnlineReplicaToReplicaDeletionIneligibleTransition
STARTED

kafka.controller.ReplicaStateMachineTest > testInvalidOnlineReplicaToReplicaDeletionIneligibleTransition
PASSED

kafka.controller.ReplicaStateMachineTest > testInvalidReplicaDeletionSuccessfulToReplicaDeletionStartedTransition
STARTED

kafka.controller.ReplicaStateMachineTest > testInvalidReplicaDeletionSuccessfulToReplicaDeletionStartedTransition
PASSED

kafka.controller.ReplicaStateMachineTest > testInvalidNewReplicaToReplicaDeletionSuccessfulTransition
STARTED

kafka.controller.ReplicaStateMachineTest > testInvalidNewReplicaToReplicaDeletionSuccessfulTransition
PASSED

kafka.controller.ReplicaStateMachineTest > testInvalidReplicaDeletionIneligibleToReplicaDeletionStartedTransition
STARTED

kafka.controller.ReplicaStateMachineTest > testInvalidReplicaDeletionIneligibleToReplicaDeletionStartedTransition
PASSED

kafka.controller.ReplicaStateMachineTest > testInvalidReplicaDeletionStartedToOfflineReplicaTransition
STARTED

kafka.controller.ReplicaStateMachineTest > testInvalidReplicaDeletionStartedToOfflineReplicaTransition
PASSED

kafka.controller.ReplicaStateMachineTest > testInvalidNewReplicaToReplicaDeletionStartedTransition
STARTED

kafka.controller.ReplicaStateMachineTest > testInvalidNewReplicaToReplicaDeletionStartedTransition
PASSED

kafka.controller.ReplicaStateMachineTest > testOnlineReplicaToOnlineReplicaTransition STARTED

kafka.controller.ReplicaStateMachineTest > testOnlineReplicaToOnlineReplicaTransition PASSED

kafka.controller.ReplicaStateMachineTest > testInvalidNewReplicaToReplicaDeletionIneligibleTransition
STARTED

kafka.controller.ReplicaStateMachineTest > testInvalidNewReplicaToReplicaDeletionIneligibleTransition
PASSED

kafka.controller.ReplicaStateMachineTest > testInvalidNonexistentReplicaToOfflineReplicaTransition
STARTED

kafka.controller.ReplicaStateMachineTest > testInvalidNonexistentReplicaToOfflineReplicaTransition
PASSED

kafka.controller.ReplicaStateMachineTest > testReplicaDeletionStartedToReplicaDeletionSuccessfulTransition
STARTED

kafka.controller.ReplicaStateMachineTest > testReplicaDeletionStartedToReplicaDeletionSuccessfulTransition
PASSED

kafka.controller.ReplicaStateMachineTest > testInvalidNonexistentReplicaToOnlineReplicaTransition
STARTED

kafka.controller.ReplicaStateMachineTest > testInvalidNonexistentReplicaToOnlineReplicaTransition
PASSED

kafka.controller.ReplicaStateMachineTest > testInvalidOnlineReplicaToNewReplicaTransition
STARTED

kafka.controller.ReplicaStateMachineTest > testInvalidOnlineReplicaToNewReplicaTransition
PASSED

kafka.controller.ReplicaStateMachineTest > testReplicaDeletionStartedToReplicaDeletionIneligibleTransition
STARTED

kafka.controller.ReplicaStateMachineTest > testReplicaDeletionStartedToReplicaDeletionIneligibleTransition
PASSED

kafka.controller.ReplicaStateMachineTest > testInvalidReplicaDeletionSuccessfulToOfflineReplicaTransition
STARTED

kafka.controller.ReplicaStateMachineTest > testInvalidReplicaDeletionSuccessfulToOfflineReplicaTransition
PASSED

kafka.controller.ReplicaStateMachineTest > testInvalidReplicaDeletionIneligibleToNewReplicaTransition
STARTED

kafka.controller.ReplicaStateMachineTest > testInvalidReplicaDeletionIneligibleToNewReplicaTransition
PASSED

kafka.controller.ReplicaStateMachineTest > testReplicaDeletionIneligibleToOnlineReplicaTransition
STARTED

kafka.controller.ReplicaStateMachineTest > testReplicaDeletionIneligibleToOnlineReplicaTransition
PASSED

kafka.controller.ReplicaStateMachineTest > testInvalidReplicaDeletionStartedToNewReplicaTransition
STARTED

kafka.controller.ReplicaStateMachineTest > testInvalidReplicaDeletionStartedToNewReplicaTransition
PASSED

kafka.controller.ReplicaStateMachineTest > testInvalidNonexistentReplicaToReplicaDeletionSuccessfulTransition
STARTED

kafka.controller.ReplicaStateMachineTest > testInvalidNonexistentReplicaToReplicaDeletionSuccessfulTransition
PASSED

kafka.controller.ReplicaStateMachineTest > testNewReplicaToOnlineReplicaTransition STARTED

kafka.controller.ReplicaStateMachineTest > testNewReplicaToOnlineReplicaTransition PASSED

kafka.controller.ControllerIntegrationTest > testControlledShutdown STARTED

kafka.controller.ControllerIntegrationTest > testControlledShutdown PASSED

kafka.controller.ControllerIntegrationTest > testPartitionReassignmentWithOfflineReplicaHaltingProgress
STARTED

kafka.controller.ControllerIntegrationTest > testPartitionReassignmentWithOfflineReplicaHaltingProgress
PASSED

kafka.controller.ControllerIntegrationTest > testControllerEpochPersistsWhenAllBrokersDown
STARTED

kafka.controller.ControllerIntegrationTest > testControllerEpochPersistsWhenAllBrokersDown
PASSED

kafka.controller.ControllerIntegrationTest > testTopicCreationWithOfflineReplica STARTED

kafka.controller.ControllerIntegrationTest > testTopicCreationWithOfflineReplica PASSED

kafka.controller.ControllerIntegrationTest > testPartitionReassignmentResumesAfterReplicaComesOnline
STARTED

kafka.controller.ControllerIntegrationTest > testPartitionReassignmentResumesAfterReplicaComesOnline
PASSED

kafka.controller.ControllerIntegrationTest > testLeaderAndIsrWhenEntireIsrOfflineAndUncleanLeaderElectionDisabled
STARTED

kafka.controller.ControllerIntegrationTest > testLeaderAndIsrWhenEntireIsrOfflineAndUncleanLeaderElectionDisabled
PASSED

kafka.controller.ControllerIntegrationTest > testTopicPartitionExpansionWithOfflineReplica
STARTED

kafka.controller.ControllerIntegrationTest > testTopicPartitionExpansionWithOfflineReplica
PASSED

kafka.controller.ControllerIntegrationTest > testPreferredReplicaLeaderElectionWithOfflinePreferredReplica
STARTED

kafka.controller.ControllerIntegrationTest > testPreferredReplicaLeaderElectionWithOfflinePreferredReplica
PASSED

kafka.controller.ControllerIntegrationTest > testAutoPreferredReplicaLeaderElection STARTED

kafka.controller.ControllerIntegrationTest > testAutoPreferredReplicaLeaderElection PASSED

kafka.controller.ControllerIntegrationTest > testTopicCreation STARTED

kafka.controller.ControllerIntegrationTest > testTopicCreation PASSED

kafka.controller.ControllerIntegrationTest > testPartitionReassignment STARTED

kafka.controller.ControllerIntegrationTest > testPartitionReassignment PASSED

kafka.controller.ControllerIntegrationTest > testTopicPartitionExpansion STARTED

kafka.controller.ControllerIntegrationTest > testTopicPartitionExpansion PASSED

kafka.controller.ControllerIntegrationTest > testControllerMoveIncrementsControllerEpoch
STARTED

kafka.controller.ControllerIntegrationTest > testControllerMoveIncrementsControllerEpoch
PASSED

kafka.controller.ControllerIntegrationTest > testLeaderAndIsrWhenEntireIsrOfflineAndUncleanLeaderElectionEnabled
STARTED

kafka.controller.ControllerIntegrationTest > testLeaderAndIsrWhenEntireIsrOfflineAndUncleanLeaderElectionEnabled
PASSED

kafka.controller.ControllerIntegrationTest > testBackToBackPreferredReplicaLeaderElections
STARTED

kafka.controller.ControllerIntegrationTest > testBackToBackPreferredReplicaLeaderElections
PASSED

kafka.controller.ControllerIntegrationTest > testEmptyCluster STARTED

kafka.controller.ControllerIntegrationTest > testEmptyCluster PASSED

kafka.controller.ControllerIntegrationTest > testPreferredReplicaLeaderElection STARTED

kafka.controller.ControllerIntegrationTest > testPreferredReplicaLeaderElection PASSED

unit.kafka.utils.ThrottlerTest > testThrottleDesiredRate STARTED

unit.kafka.utils.ThrottlerTest > testThrottleDesiredRate PASSED

2040 tests completed, 1 failed, 4 skipped

> Task :core:test FAILED

FAILURE: Build failed with an exception.

* What went wrong:
Execution failed for task ':core:test'.
> There were failing tests. See the report at: file://<https://builds.apache.org/job/kafka-trunk-jdk10/ws/core/build/reports/tests/test/index.html>

* Try:
Run with --stacktrace option to get the stack trace. Run with --info or --debug option to
get more log output. Run with --scan to get full insights.

* Get more help at https://help.gradle.org

BUILD FAILED in 1h 52m 51s
39 actionable tasks: 17 executed, 22 up-to-date
Build step 'Execute shell' marked build as failure
Recording test results
Setting GRADLE_4_8_1_HOME=/home/jenkins/tools/gradle/4.8.1
Setting GRADLE_4_8_1_HOME=/home/jenkins/tools/gradle/4.8.1
Not sending mail to unregistered user noreply@github.com
Not sending mail to unregistered user wangguoz@gmail.com

Mime
View raw message