kafka-dev mailing list archives

Site index · List index
Message view « Date » · « Thread »
Top « Date » · « Thread »
From Apache Jenkins Server <jenk...@builds.apache.org>
Subject Build failed in Jenkins: kafka-trunk-jdk8 #2853
Date Thu, 02 Aug 2018 04:50:53 GMT
See <https://builds.apache.org/job/kafka-trunk-jdk8/2853/display/redirect?page=changes>

Changes:

[harsha] MINOR: Fixed default streams state dir location. (#5441)

------------------------------------------
[...truncated 425.38 KB...]
kafka.api.SaslClientsWithInvalidCredentialsTest > testConsumerGroupServiceWithAuthenticationFailure
PASSED

kafka.api.SaslClientsWithInvalidCredentialsTest > testManualAssignmentConsumerWithAutoCommitDisabledWithAuthenticationFailure
STARTED

kafka.api.SaslClientsWithInvalidCredentialsTest > testManualAssignmentConsumerWithAutoCommitDisabledWithAuthenticationFailure
PASSED

kafka.api.SaslClientsWithInvalidCredentialsTest > testKafkaAdminClientWithAuthenticationFailure
STARTED

kafka.api.SaslClientsWithInvalidCredentialsTest > testKafkaAdminClientWithAuthenticationFailure
PASSED

kafka.api.SaslClientsWithInvalidCredentialsTest > testConsumerWithAuthenticationFailure
STARTED

kafka.api.SaslClientsWithInvalidCredentialsTest > testConsumerWithAuthenticationFailure
PASSED

kafka.api.DelegationTokenEndToEndAuthorizationTest > testNoConsumeWithoutDescribeAclViaSubscribe
STARTED

kafka.api.DelegationTokenEndToEndAuthorizationTest > testNoConsumeWithoutDescribeAclViaSubscribe
PASSED

kafka.api.DelegationTokenEndToEndAuthorizationTest > testProduceConsumeWithPrefixedAcls
STARTED

kafka.api.DelegationTokenEndToEndAuthorizationTest > testProduceConsumeWithPrefixedAcls
PASSED

kafka.api.DelegationTokenEndToEndAuthorizationTest > testProduceConsumeViaAssign STARTED

kafka.api.DelegationTokenEndToEndAuthorizationTest > testProduceConsumeViaAssign PASSED

kafka.api.DelegationTokenEndToEndAuthorizationTest > testNoConsumeWithDescribeAclViaAssign
STARTED

kafka.api.DelegationTokenEndToEndAuthorizationTest > testNoConsumeWithDescribeAclViaAssign
PASSED

kafka.api.DelegationTokenEndToEndAuthorizationTest > testProduceConsumeTopicAutoCreateTopicCreateAcl
STARTED

kafka.api.DelegationTokenEndToEndAuthorizationTest > testProduceConsumeTopicAutoCreateTopicCreateAcl
PASSED

kafka.api.DelegationTokenEndToEndAuthorizationTest > testProduceConsumeWithWildcardAcls
STARTED

kafka.api.DelegationTokenEndToEndAuthorizationTest > testProduceConsumeWithWildcardAcls
PASSED

kafka.api.DelegationTokenEndToEndAuthorizationTest > testNoConsumeWithDescribeAclViaSubscribe
STARTED

kafka.api.DelegationTokenEndToEndAuthorizationTest > testNoConsumeWithDescribeAclViaSubscribe
PASSED

kafka.api.DelegationTokenEndToEndAuthorizationTest > testNoConsumeWithoutDescribeAclViaAssign
STARTED

kafka.api.DelegationTokenEndToEndAuthorizationTest > testNoConsumeWithoutDescribeAclViaAssign
PASSED

kafka.api.DelegationTokenEndToEndAuthorizationTest > testNoGroupAcl STARTED

kafka.api.DelegationTokenEndToEndAuthorizationTest > testNoGroupAcl PASSED

kafka.api.DelegationTokenEndToEndAuthorizationTest > testNoProduceWithDescribeAcl STARTED

kafka.api.DelegationTokenEndToEndAuthorizationTest > testNoProduceWithDescribeAcl PASSED

kafka.api.DelegationTokenEndToEndAuthorizationTest > testProduceConsumeViaSubscribe STARTED

kafka.api.DelegationTokenEndToEndAuthorizationTest > testProduceConsumeViaSubscribe PASSED

kafka.api.DelegationTokenEndToEndAuthorizationTest > testNoProduceWithoutDescribeAcl STARTED

kafka.api.DelegationTokenEndToEndAuthorizationTest > testNoProduceWithoutDescribeAcl PASSED

kafka.api.SaslGssapiSslEndToEndAuthorizationTest > testTwoConsumersWithDifferentSaslCredentials
STARTED

kafka.api.SaslGssapiSslEndToEndAuthorizationTest > testTwoConsumersWithDifferentSaslCredentials
PASSED

kafka.api.SaslGssapiSslEndToEndAuthorizationTest > testNoConsumeWithoutDescribeAclViaSubscribe
STARTED

kafka.api.SaslGssapiSslEndToEndAuthorizationTest > testNoConsumeWithoutDescribeAclViaSubscribe
PASSED

kafka.api.SaslGssapiSslEndToEndAuthorizationTest > testProduceConsumeWithPrefixedAcls STARTED

kafka.api.SaslGssapiSslEndToEndAuthorizationTest > testProduceConsumeWithPrefixedAcls PASSED

kafka.api.SaslGssapiSslEndToEndAuthorizationTest > testProduceConsumeViaAssign STARTED

kafka.api.SaslGssapiSslEndToEndAuthorizationTest > testProduceConsumeViaAssign PASSED

kafka.api.SaslGssapiSslEndToEndAuthorizationTest > testNoConsumeWithDescribeAclViaAssign
STARTED

kafka.api.SaslGssapiSslEndToEndAuthorizationTest > testNoConsumeWithDescribeAclViaAssign
PASSED

kafka.api.SaslGssapiSslEndToEndAuthorizationTest > testProduceConsumeTopicAutoCreateTopicCreateAcl
STARTED

kafka.api.SaslGssapiSslEndToEndAuthorizationTest > testProduceConsumeTopicAutoCreateTopicCreateAcl
PASSED

kafka.api.SaslGssapiSslEndToEndAuthorizationTest > testProduceConsumeWithWildcardAcls STARTED

kafka.api.SaslGssapiSslEndToEndAuthorizationTest > testProduceConsumeWithWildcardAcls PASSED

kafka.api.SaslGssapiSslEndToEndAuthorizationTest > testNoConsumeWithDescribeAclViaSubscribe
STARTED

kafka.api.SaslGssapiSslEndToEndAuthorizationTest > testNoConsumeWithDescribeAclViaSubscribe
PASSED

kafka.api.SaslGssapiSslEndToEndAuthorizationTest > testNoConsumeWithoutDescribeAclViaAssign
STARTED

kafka.api.SaslGssapiSslEndToEndAuthorizationTest > testNoConsumeWithoutDescribeAclViaAssign
PASSED

kafka.api.SaslGssapiSslEndToEndAuthorizationTest > testNoGroupAcl STARTED

kafka.api.SaslGssapiSslEndToEndAuthorizationTest > testNoGroupAcl PASSED

kafka.api.SaslGssapiSslEndToEndAuthorizationTest > testNoProduceWithDescribeAcl STARTED

kafka.api.SaslGssapiSslEndToEndAuthorizationTest > testNoProduceWithDescribeAcl PASSED

kafka.api.SaslGssapiSslEndToEndAuthorizationTest > testProduceConsumeViaSubscribe STARTED

kafka.api.SaslGssapiSslEndToEndAuthorizationTest > testProduceConsumeViaSubscribe PASSED

kafka.api.SaslGssapiSslEndToEndAuthorizationTest > testNoProduceWithoutDescribeAcl STARTED

kafka.api.SaslGssapiSslEndToEndAuthorizationTest > testNoProduceWithoutDescribeAcl PASSED

kafka.api.TransactionsTest > testBasicTransactions STARTED

kafka.api.TransactionsTest > testBasicTransactions PASSED

kafka.api.TransactionsTest > testFencingOnSendOffsets STARTED

kafka.api.TransactionsTest > testFencingOnSendOffsets PASSED

kafka.api.TransactionsTest > testFencingOnAddPartitions STARTED

kafka.api.TransactionsTest > testFencingOnAddPartitions PASSED

kafka.api.TransactionsTest > testFencingOnTransactionExpiration STARTED

kafka.api.TransactionsTest > testFencingOnTransactionExpiration PASSED

kafka.api.TransactionsTest > testDelayedFetchIncludesAbortedTransaction STARTED

kafka.api.TransactionsTest > testDelayedFetchIncludesAbortedTransaction PASSED

kafka.api.TransactionsTest > testConsecutivelyRunInitTransactions STARTED

kafka.api.TransactionsTest > testConsecutivelyRunInitTransactions PASSED

kafka.api.TransactionsTest > testReadCommittedConsumerShouldNotSeeUndecidedData STARTED

kafka.api.TransactionsTest > testReadCommittedConsumerShouldNotSeeUndecidedData PASSED

kafka.api.TransactionsTest > testFencingOnSend STARTED

kafka.api.TransactionsTest > testFencingOnSend PASSED

kafka.api.TransactionsTest > testFencingOnCommit STARTED

kafka.api.TransactionsTest > testFencingOnCommit PASSED

kafka.api.TransactionsTest > testMultipleMarkersOneLeader STARTED

kafka.api.TransactionsTest > testMultipleMarkersOneLeader PASSED

kafka.api.TransactionsTest > testSendOffsets STARTED

kafka.api.TransactionsTest > testSendOffsets PASSED

kafka.api.PlaintextEndToEndAuthorizationTest > testListenerName STARTED

kafka.api.PlaintextEndToEndAuthorizationTest > testListenerName PASSED

kafka.api.PlaintextEndToEndAuthorizationTest > testNoConsumeWithoutDescribeAclViaSubscribe
STARTED

kafka.api.PlaintextEndToEndAuthorizationTest > testNoConsumeWithoutDescribeAclViaSubscribe
PASSED

kafka.api.PlaintextEndToEndAuthorizationTest > testProduceConsumeWithPrefixedAcls STARTED

kafka.api.PlaintextEndToEndAuthorizationTest > testProduceConsumeWithPrefixedAcls PASSED

kafka.api.PlaintextEndToEndAuthorizationTest > testProduceConsumeViaAssign STARTED

kafka.api.PlaintextEndToEndAuthorizationTest > testProduceConsumeViaAssign PASSED

kafka.api.PlaintextEndToEndAuthorizationTest > testNoConsumeWithDescribeAclViaAssign STARTED

kafka.api.PlaintextEndToEndAuthorizationTest > testNoConsumeWithDescribeAclViaAssign PASSED

kafka.api.PlaintextEndToEndAuthorizationTest > testProduceConsumeTopicAutoCreateTopicCreateAcl
STARTED

kafka.api.PlaintextEndToEndAuthorizationTest > testProduceConsumeTopicAutoCreateTopicCreateAcl
PASSED

kafka.api.PlaintextEndToEndAuthorizationTest > testProduceConsumeWithWildcardAcls STARTED

kafka.api.PlaintextEndToEndAuthorizationTest > testProduceConsumeWithWildcardAcls PASSED

kafka.api.PlaintextEndToEndAuthorizationTest > testNoConsumeWithDescribeAclViaSubscribe
STARTED

kafka.api.PlaintextEndToEndAuthorizationTest > testNoConsumeWithDescribeAclViaSubscribe
PASSED

kafka.api.PlaintextEndToEndAuthorizationTest > testNoConsumeWithoutDescribeAclViaAssign
STARTED

kafka.api.PlaintextEndToEndAuthorizationTest > testNoConsumeWithoutDescribeAclViaAssign
PASSED

kafka.api.PlaintextEndToEndAuthorizationTest > testNoGroupAcl STARTED

kafka.api.PlaintextEndToEndAuthorizationTest > testNoGroupAcl PASSED

kafka.api.PlaintextEndToEndAuthorizationTest > testNoProduceWithDescribeAcl STARTED

kafka.api.PlaintextEndToEndAuthorizationTest > testNoProduceWithDescribeAcl PASSED

kafka.api.PlaintextEndToEndAuthorizationTest > testProduceConsumeViaSubscribe STARTED

kafka.api.PlaintextEndToEndAuthorizationTest > testProduceConsumeViaSubscribe PASSED

kafka.api.PlaintextEndToEndAuthorizationTest > testNoProduceWithoutDescribeAcl STARTED

kafka.api.PlaintextEndToEndAuthorizationTest > testNoProduceWithoutDescribeAcl PASSED

unit.kafka.utils.ThrottlerTest > testThrottleDesiredRate STARTED

unit.kafka.utils.ThrottlerTest > testThrottleDesiredRate PASSED

2031 tests completed, 1 failed, 4 skipped

> Task :kafka-trunk-jdk8:core:test FAILED
> Task :testScala_2_11 FAILED

FAILURE: Build failed with an exception.

* What went wrong:
Execution failed for task ':kafka-trunk-jdk8:core:test'.
> There were failing tests. See the report at: file://<https://builds.apache.org/job/kafka-trunk-jdk8/ws/core/build/reports/tests/test/index.html>

* Try:
Run with --stacktrace option to get the stack trace. Run with --info or --debug option to
get more log output. Run with --scan to get full insights.

* Get more help at https://help.gradle.org

BUILD FAILED in 1h 37m 4s
25 actionable tasks: 17 executed, 8 up-to-date
Build step 'Execute shell' marked build as failure
[FINDBUGS] Collecting findbugs analysis files...
Setting GRADLE_4_8_1_HOME=/home/jenkins/tools/gradle/4.8.1
[FINDBUGS] Searching for all files in <https://builds.apache.org/job/kafka-trunk-jdk8/ws/>
that match the pattern **/build/reports/findbugs/*.xml
[FINDBUGS] Parsing 1 file in <https://builds.apache.org/job/kafka-trunk-jdk8/ws/>
[FINDBUGS] Successfully parsed file <https://builds.apache.org/job/kafka-trunk-jdk8/ws/core/build/reports/findbugs/main.xml>
with 0 unique warnings and 0 duplicates.
Setting GRADLE_4_8_1_HOME=/home/jenkins/tools/gradle/4.8.1
Setting GRADLE_4_8_1_HOME=/home/jenkins/tools/gradle/4.8.1
<Git Blamer> Using GitBlamer to create author and commit information for all warnings.
<Git Blamer> GIT_COMMIT=530d951cbd47e7d27d5e687881f3dffe8b880377, workspace=<https://builds.apache.org/job/kafka-trunk-jdk8/ws/>
[FINDBUGS] Computing warning deltas based on reference build #2846
Recording test results
Setting GRADLE_4_8_1_HOME=/home/jenkins/tools/gradle/4.8.1
Setting GRADLE_4_8_1_HOME=/home/jenkins/tools/gradle/4.8.1
Not sending mail to unregistered user lindong28@gmail.com
Not sending mail to unregistered user wangguoz@gmail.com
Not sending mail to unregistered user noreply@github.com

Mime
View raw message