kafka-dev mailing list archives

Site index · List index
Message view « Date » · « Thread »
Top « Date » · « Thread »
From Apache Jenkins Server <jenk...@builds.apache.org>
Subject Build failed in Jenkins: kafka-2.0-jdk8 #116
Date Tue, 14 Aug 2018 05:17:44 GMT
See <https://builds.apache.org/job/kafka-2.0-jdk8/116/display/redirect?page=changes>

Changes:

[matthias] KAFKA-7284: streams should unwrap fenced exception (#5499)

------------------------------------------
[...truncated 2.48 MB...]

org.apache.kafka.streams.kstream.internals.KStreamWindowAggregateTest > testJoin STARTED

org.apache.kafka.streams.kstream.internals.KStreamWindowAggregateTest > testJoin PASSED

org.apache.kafka.streams.kstream.internals.KStreamWindowAggregateTest > shouldLogAndMeterWhenSkippingNullKey
STARTED

org.apache.kafka.streams.kstream.internals.KStreamWindowAggregateTest > shouldLogAndMeterWhenSkippingNullKey
PASSED

org.apache.kafka.streams.kstream.internals.KStreamSelectKeyTest > testSelectKey STARTED

org.apache.kafka.streams.kstream.internals.KStreamSelectKeyTest > testSelectKey PASSED

org.apache.kafka.streams.kstream.internals.KStreamSelectKeyTest > testTypeVariance STARTED

org.apache.kafka.streams.kstream.internals.KStreamSelectKeyTest > testTypeVariance PASSED

org.apache.kafka.streams.kstream.internals.GlobalKTableJoinsTest > shouldInnerJoinWithStream
STARTED

org.apache.kafka.streams.kstream.internals.GlobalKTableJoinsTest > shouldInnerJoinWithStream
PASSED

org.apache.kafka.streams.kstream.internals.GlobalKTableJoinsTest > shouldLeftJoinWithStream
STARTED

org.apache.kafka.streams.kstream.internals.GlobalKTableJoinsTest > shouldLeftJoinWithStream
PASSED

org.apache.kafka.streams.kstream.internals.KStreamWindowReduceTest > shouldLogAndMeterOnNullKey
STARTED

org.apache.kafka.streams.kstream.internals.KStreamWindowReduceTest > shouldLogAndMeterOnNullKey
PASSED

org.apache.kafka.streams.kstream.WindowsTest > retentionTimeMustNotBeNegative STARTED

org.apache.kafka.streams.kstream.WindowsTest > retentionTimeMustNotBeNegative PASSED

org.apache.kafka.streams.kstream.WindowsTest > numberOfSegmentsMustBeAtLeastTwo STARTED

org.apache.kafka.streams.kstream.WindowsTest > numberOfSegmentsMustBeAtLeastTwo PASSED

org.apache.kafka.streams.kstream.WindowsTest > shouldSetWindowRetentionTime STARTED

org.apache.kafka.streams.kstream.WindowsTest > shouldSetWindowRetentionTime PASSED

org.apache.kafka.streams.kstream.WindowsTest > shouldSetNumberOfSegments STARTED

org.apache.kafka.streams.kstream.WindowsTest > shouldSetNumberOfSegments PASSED

org.apache.kafka.streams.kstream.UnlimitedWindowsTest > startTimeMustNotBeNegative STARTED

org.apache.kafka.streams.kstream.UnlimitedWindowsTest > startTimeMustNotBeNegative PASSED

org.apache.kafka.streams.kstream.UnlimitedWindowsTest > shouldThrowOnUntil STARTED

org.apache.kafka.streams.kstream.UnlimitedWindowsTest > shouldThrowOnUntil PASSED

org.apache.kafka.streams.kstream.UnlimitedWindowsTest > shouldIncludeRecordsThatHappenedOnWindowStart
STARTED

org.apache.kafka.streams.kstream.UnlimitedWindowsTest > shouldIncludeRecordsThatHappenedOnWindowStart
PASSED

org.apache.kafka.streams.kstream.UnlimitedWindowsTest > shouldSetWindowStartTime STARTED

org.apache.kafka.streams.kstream.UnlimitedWindowsTest > shouldSetWindowStartTime PASSED

org.apache.kafka.streams.kstream.UnlimitedWindowsTest > shouldIncludeRecordsThatHappenedAfterWindowStart
STARTED

org.apache.kafka.streams.kstream.UnlimitedWindowsTest > shouldIncludeRecordsThatHappenedAfterWindowStart
PASSED

org.apache.kafka.streams.kstream.UnlimitedWindowsTest > shouldExcludeRecordsThatHappenedBeforeWindowStart
STARTED

org.apache.kafka.streams.kstream.UnlimitedWindowsTest > shouldExcludeRecordsThatHappenedBeforeWindowStart
PASSED

org.apache.kafka.streams.kstream.JoinWindowsTest > endTimeShouldNotBeBeforeStart STARTED

org.apache.kafka.streams.kstream.JoinWindowsTest > endTimeShouldNotBeBeforeStart PASSED

org.apache.kafka.streams.kstream.JoinWindowsTest > shouldUseWindowSizeForMaintainDurationWhenSizeLargerThanDefaultMaintainMs
STARTED

org.apache.kafka.streams.kstream.JoinWindowsTest > shouldUseWindowSizeForMaintainDurationWhenSizeLargerThanDefaultMaintainMs
PASSED

org.apache.kafka.streams.kstream.JoinWindowsTest > shouldHaveSaneEqualsAndHashCode STARTED

org.apache.kafka.streams.kstream.JoinWindowsTest > shouldHaveSaneEqualsAndHashCode PASSED

org.apache.kafka.streams.kstream.JoinWindowsTest > validWindows STARTED

org.apache.kafka.streams.kstream.JoinWindowsTest > validWindows PASSED

org.apache.kafka.streams.kstream.JoinWindowsTest > startTimeShouldNotBeAfterEnd STARTED

org.apache.kafka.streams.kstream.JoinWindowsTest > startTimeShouldNotBeAfterEnd PASSED

org.apache.kafka.streams.kstream.JoinWindowsTest > untilShouldSetMaintainDuration STARTED

org.apache.kafka.streams.kstream.JoinWindowsTest > untilShouldSetMaintainDuration PASSED

org.apache.kafka.streams.kstream.JoinWindowsTest > retentionTimeMustNoBeSmallerThanWindowSize
STARTED

org.apache.kafka.streams.kstream.JoinWindowsTest > retentionTimeMustNoBeSmallerThanWindowSize
PASSED

org.apache.kafka.streams.kstream.JoinWindowsTest > timeDifferenceMustNotBeNegative STARTED

org.apache.kafka.streams.kstream.JoinWindowsTest > timeDifferenceMustNotBeNegative PASSED

org.apache.kafka.streams.kstream.WindowTest > shouldThrowIfEndIsSmallerThanStart STARTED

org.apache.kafka.streams.kstream.WindowTest > shouldThrowIfEndIsSmallerThanStart PASSED

org.apache.kafka.streams.kstream.WindowTest > shouldNotBeEqualIfDifferentWindowType STARTED

org.apache.kafka.streams.kstream.WindowTest > shouldNotBeEqualIfDifferentWindowType PASSED

org.apache.kafka.streams.kstream.WindowTest > shouldBeEqualIfStartAndEndSame STARTED

org.apache.kafka.streams.kstream.WindowTest > shouldBeEqualIfStartAndEndSame PASSED

org.apache.kafka.streams.kstream.WindowTest > shouldNotBeEqualIfNull STARTED

org.apache.kafka.streams.kstream.WindowTest > shouldNotBeEqualIfNull PASSED

org.apache.kafka.streams.kstream.WindowTest > shouldThrowIfStartIsNegative STARTED

org.apache.kafka.streams.kstream.WindowTest > shouldThrowIfStartIsNegative PASSED

org.apache.kafka.streams.kstream.WindowTest > shouldNotBeEqualIfStartOrEndIsDifferent STARTED

org.apache.kafka.streams.kstream.WindowTest > shouldNotBeEqualIfStartOrEndIsDifferent PASSED

org.apache.kafka.streams.kstream.SessionWindowedDeserializerTest > testWindowedValueDeserializerNoArgConstructors
STARTED

org.apache.kafka.streams.kstream.SessionWindowedDeserializerTest > testWindowedValueDeserializerNoArgConstructors
PASSED

org.apache.kafka.streams.kstream.SessionWindowedDeserializerTest > testWindowedKeyDeserializerNoArgConstructors
STARTED

org.apache.kafka.streams.kstream.SessionWindowedDeserializerTest > testWindowedKeyDeserializerNoArgConstructors
PASSED

org.apache.kafka.streams.kstream.TimeWindowedSerializerTest > testWindowedValueSerializerNoArgConstructors
STARTED

org.apache.kafka.streams.kstream.TimeWindowedSerializerTest > testWindowedValueSerializerNoArgConstructors
PASSED

org.apache.kafka.streams.kstream.TimeWindowedSerializerTest > testWindowedKeySerializerNoArgConstructors
STARTED

org.apache.kafka.streams.kstream.TimeWindowedSerializerTest > testWindowedKeySerializerNoArgConstructors
PASSED

org.apache.kafka.streams.kstream.SessionWindowsTest > retentionTimeShouldBeGapIfGapIsLargerThanDefaultRetentionTime
STARTED

org.apache.kafka.streams.kstream.SessionWindowsTest > retentionTimeShouldBeGapIfGapIsLargerThanDefaultRetentionTime
PASSED

org.apache.kafka.streams.kstream.SessionWindowsTest > shouldSetWindowGap STARTED

org.apache.kafka.streams.kstream.SessionWindowsTest > shouldSetWindowGap PASSED

org.apache.kafka.streams.kstream.SessionWindowsTest > shouldBeEqualWhenGapAndMaintainMsAreTheSame
STARTED

org.apache.kafka.streams.kstream.SessionWindowsTest > shouldBeEqualWhenGapAndMaintainMsAreTheSame
PASSED

org.apache.kafka.streams.kstream.SessionWindowsTest > retentionTimeMustNotBeNegative STARTED

org.apache.kafka.streams.kstream.SessionWindowsTest > retentionTimeMustNotBeNegative PASSED

org.apache.kafka.streams.kstream.SessionWindowsTest > shouldNotBeEqualWhenMaintainMsDifferent
STARTED

org.apache.kafka.streams.kstream.SessionWindowsTest > shouldNotBeEqualWhenMaintainMsDifferent
PASSED

org.apache.kafka.streams.kstream.SessionWindowsTest > windowSizeMustNotBeZero STARTED

org.apache.kafka.streams.kstream.SessionWindowsTest > windowSizeMustNotBeZero PASSED

org.apache.kafka.streams.kstream.SessionWindowsTest > windowSizeMustNotBeNegative STARTED

org.apache.kafka.streams.kstream.SessionWindowsTest > windowSizeMustNotBeNegative PASSED

org.apache.kafka.streams.kstream.SessionWindowsTest > shouldSetWindowRetentionTime STARTED

org.apache.kafka.streams.kstream.SessionWindowsTest > shouldSetWindowRetentionTime PASSED

org.apache.kafka.streams.kstream.SessionWindowsTest > shouldNotBeEqualWhenGapIsDifferent
STARTED

org.apache.kafka.streams.kstream.SessionWindowsTest > shouldNotBeEqualWhenGapIsDifferent
PASSED

org.apache.kafka.streams.kstream.PrintedTest > shouldCreateProcessorThatPrintsToStdOut
STARTED

org.apache.kafka.streams.kstream.PrintedTest > shouldCreateProcessorThatPrintsToStdOut
PASSED

org.apache.kafka.streams.kstream.PrintedTest > shouldPrintWithKeyValueMapper STARTED

org.apache.kafka.streams.kstream.PrintedTest > shouldPrintWithKeyValueMapper PASSED

org.apache.kafka.streams.kstream.PrintedTest > shouldThrowTopologyExceptionIfFilePathIsEmpty
STARTED

org.apache.kafka.streams.kstream.PrintedTest > shouldThrowTopologyExceptionIfFilePathIsEmpty
PASSED

org.apache.kafka.streams.kstream.PrintedTest > shouldThrowNullPointerExceptionIfLabelIsNull
STARTED

org.apache.kafka.streams.kstream.PrintedTest > shouldThrowNullPointerExceptionIfLabelIsNull
PASSED

org.apache.kafka.streams.kstream.PrintedTest > shouldThrowNullPointerExceptionIfMapperIsNull
STARTED

org.apache.kafka.streams.kstream.PrintedTest > shouldThrowNullPointerExceptionIfMapperIsNull
PASSED

org.apache.kafka.streams.kstream.PrintedTest > shouldPrintWithLabel STARTED

org.apache.kafka.streams.kstream.PrintedTest > shouldPrintWithLabel PASSED

org.apache.kafka.streams.kstream.PrintedTest > shouldThrowNullPointerExceptionIfFilePathIsNull
STARTED

org.apache.kafka.streams.kstream.PrintedTest > shouldThrowNullPointerExceptionIfFilePathIsNull
PASSED

org.apache.kafka.streams.kstream.PrintedTest > shouldCreateProcessorThatPrintsToFile STARTED

org.apache.kafka.streams.kstream.PrintedTest > shouldCreateProcessorThatPrintsToFile PASSED

org.apache.kafka.streams.kstream.PrintedTest > shouldThrowTopologyExceptionIfFilePathDoesntExist
STARTED

org.apache.kafka.streams.kstream.PrintedTest > shouldThrowTopologyExceptionIfFilePathDoesntExist
PASSED

1894 tests completed, 3 failed

> Task :streams:test FAILED

FAILURE: Build failed with an exception.

* What went wrong:
Execution failed for task ':streams:test'.
> There were failing tests. See the report at: file://<https://builds.apache.org/job/kafka-2.0-jdk8/ws/streams/build/reports/tests/test/index.html>

* Try:
Run with --stacktrace option to get the stack trace. Run with --info or --debug option to
get more log output. Run with --scan to get full insights.

* Get more help at https://help.gradle.org

BUILD FAILED in 4h 36m 50s
68 actionable tasks: 30 executed, 38 up-to-date
Build step 'Execute shell' marked build as failure
[FINDBUGS] Collecting findbugs analysis files...
Setting GRADLE_4_8_1_HOME=/home/jenkins/tools/gradle/4.8.1
[FINDBUGS] Searching for all files in <https://builds.apache.org/job/kafka-2.0-jdk8/ws/>
that match the pattern **/build/reports/findbugs/*.xml
[FINDBUGS] Parsing 6 files in <https://builds.apache.org/job/kafka-2.0-jdk8/ws/>
[FINDBUGS] Successfully parsed file <https://builds.apache.org/job/kafka-2.0-jdk8/ws/clients/build/reports/findbugs/main.xml>
with 0 unique warnings and 0 duplicates.
[FINDBUGS] Successfully parsed file <https://builds.apache.org/job/kafka-2.0-jdk8/ws/core/build/reports/findbugs/main.xml>
with 0 unique warnings and 0 duplicates.
[FINDBUGS] Successfully parsed file <https://builds.apache.org/job/kafka-2.0-jdk8/ws/examples/build/reports/findbugs/main.xml>
with 0 unique warnings and 0 duplicates.
[FINDBUGS] Successfully parsed file <https://builds.apache.org/job/kafka-2.0-jdk8/ws/log4j-appender/build/reports/findbugs/main.xml>
with 0 unique warnings and 0 duplicates.
[FINDBUGS] Successfully parsed file <https://builds.apache.org/job/kafka-2.0-jdk8/ws/streams/build/reports/findbugs/main.xml>
with 0 unique warnings and 0 duplicates.
[FINDBUGS] Successfully parsed file <https://builds.apache.org/job/kafka-2.0-jdk8/ws/streams/streams-scala/build/reports/findbugs/main.xml>
with 0 unique warnings and 0 duplicates.
Setting GRADLE_4_8_1_HOME=/home/jenkins/tools/gradle/4.8.1
Setting GRADLE_4_8_1_HOME=/home/jenkins/tools/gradle/4.8.1
<Git Blamer> Using GitBlamer to create author and commit information for all warnings.
<Git Blamer> GIT_COMMIT=8ba90edd8f3b0335f68d3faa3ffccd7a114b5e89, workspace=<https://builds.apache.org/job/kafka-2.0-jdk8/ws/>
[FINDBUGS] Computing warning deltas based on reference build #114
Recording test results
Setting GRADLE_4_8_1_HOME=/home/jenkins/tools/gradle/4.8.1
Setting GRADLE_4_8_1_HOME=/home/jenkins/tools/gradle/4.8.1

Mime
View raw message